{"text_format":"1","workbook":"xlsx","n_sheets":7,"sheets":["CALC.D","CALCULO","DIMENSIONAMENTO","TABELAS","OBSERVAÇÕES","REVISÕES","Relatório de Compatibilidade"],"not_rendered":{"charts":0,"images":1,"macros":1,"external_links":0,"defined_names":10,"comments":1,"pivot_tables":0},"unopened":[],"bounds":{"document_bytes":16777216,"sheet_cells":100000,"rows_first":2000,"rows_last":500,"rows_between":2000,"halvings":0,"cell_chars":16384,"cell_head_chars":4096},"cells_cut":0,"cells_raw":0,"read":"whole","date_system":"1900"}

{"sheet":"CALC.D","index":0,"n_rows":128,"n_cols":39,"rows_kept":128,"cut":false,"hidden":false,"merged":[[99,26,99,27],[69,5,69,21],[36,19,36,20],[37,17,37,18],[47,19,47,20],[32,17,32,18],[41,17,41,18],[42,17,42,18],[48,11,48,16],[47,11,47,16],[52,8,52,10],[51,11,51,12],[52,11,52,12],[52,15,52,16],[53,13,53,14],[61,9,61,12],[57,9,57,12],[58,9,58,12],[53,11,53,12],[53,5,53,7],[74,5,74,13],[47,7,47,8],[50,8,50,10],[47,5,47,6],[33,5,33,6],[32,1,32,4],[41,19,41,20],[38,17,38,18],[34,19,34,20],[35,1,35,4],[35,5,35,6],[35,7,35,8],[35,11,35,12],[41,5,41,6],[41,7,41,8],[40,7,40,8],[33,13,33,16],[33,17,33,18],[32,19,32,20],[33,1,33,4],[32,7,32,8],[37,5,37,6],[37,7,37,8],[36,5,36,6],[36,7,36,8],[32,5,32,6],[36,1,36,4],[37,1,37,4],[47,17,47,18],[39,11,40,21],[38,11,38,12],[53,15,53,16],[53,17,53,19],[56,16,56,21],[54,5,54,7],[51,15,51,16],[34,1,34,4],[43,1,44,9],[48,5,48,6],[48,7,48,8],[48,17,48,18],[51,5,51,7],[52,13,52,14],[50,5,50,7],[52,17,52,19],[51,20,51,21],[51,17,51,19],[56,1,57,3],[45,1,45,4],[41,1,41,4],[42,1,42,4],[40,1,40,4],[31,17,31,18],[28,11,28,16],[33,19,33,20],[31,19,31,20],[19,36,20,36],[56,26,56,27],[57,26,57,27],[57,16,58,21],[37,13,37,16],[28,27,28,28],[41,11,41,16],[34,13,34,16],[36,13,36,16],[31,11,31,16],[35,19,35,20],[34,17,34,18],[35,17,35,18],[36,17,36,18],[32,11,32,12],[33,11,33,12],[48,19,48,20],[50,13,50,14],[34,11,34,12],[36,11,36,12],[26,7,26,8],[26,5,26,6],[26,1,26,4],[29,5,29,6],[28,5,28,6],[29,1,29,4],[27,17,27,18],[25,7,25,8],[27,19,27,20],[28,1,28,4],[25,1,25,4],[27,1,27,4],[14,36,15,38],[23,1,23,4],[49,33,50,33],[37,11,37,12],[46,11,46,16],[49,32,50,32],[39,34,40,34],[43,34,44,34],[46,17,46,18],[46,19,46,20],[44,11,45,21],[43,19,43,20],[42,11,42,16],[38,19,38,20],[50,17,50,19],[37,19,37,20],[50,20,50,21],[38,13,38,16],[43,11,43,16],[42,19,42,20],[43,17,43,18],[19,1,19,4],[20,1,20,4],[32,13,32,16],[3,32,3,38],[3,10,3,12],[25,17,25,18],[25,19,25,20],[5,32,5,38],[8,32,9,38],[3,19,3,20],[6,32,7,38],[19,32,20,32],[10,29,14,29],[10,30,14,30],[13,32,13,38],[17,29,18,29],[17,30,18,30],[18,25,18,26],[18,23,18,24],[7,19,7,20],[7,15,7,18],[7,3,7,12],[24,5,24,6],[14,32,15,34],[13,17,13,21],[14,17,15,21],[10,32,11,38],[1,30,2,30],[5,29,7,29],[5,30,7,30],[0,2,2,15],[0,17,0,21],[1,17,2,21],[3,2,3,7],[9,5,9,6],[5,2,5,3],[3,8,3,9],[3,15,3,18],[3,13,3,14],[5,19,5,20],[5,15,5,18],[5,4,5,5],[5,6,5,14],[9,1,9,4],[1,29,2,29],[9,17,9,18],[9,8,9,14],[9,15,9,16],[17,11,18,21],[20,17,20,18],[25,11,25,16],[26,11,26,16],[26,17,26,18],[13,11,13,16],[17,1,18,9],[21,19,21,20],[28,19,28,20],[26,19,26,20],[24,19,24,20],[20,19,20,20],[19,17,19,18],[27,11,27,16],[19,11,19,16],[20,11,20,16],[21,11,21,16],[24,11,24,16],[21,1,21,4],[19,5,19,6],[20,5,20,6],[20,7,20,8],[22,1,22,4],[24,17,24,18],[19,19,19,20],[22,11,23,21],[22,5,22,6],[35,13,35,16],[27,7,27,8],[34,5,34,6],[34,7,34,8],[21,17,21,18],[21,7,21,8],[19,7,19,8],[21,5,21,6],[28,17,28,18],[28,7,28,8],[29,11,30,21],[29,7,29,8],[33,7,33,8],[30,1,31,9],[23,5,23,6],[22,7,22,8],[27,5,27,6],[23,7,23,8],[24,7,24,8],[25,5,25,6],[24,1,24,4],[93,25,93,28],[94,25,94,28],[67,5,67,21],[66,5,66,21],[68,5,68,21],[73,5,73,13],[52,20,52,21],[69,1,69,4],[68,1,68,4],[61,25,63,25],[60,16,61,21],[59,25,60,25],[54,17,54,19],[54,20,54,21],[88,25,88,28],[89,25,89,28],[90,25,90,28],[91,25,91,28],[92,25,92,28],[58,4,61,5],[58,6,61,8],[61,13,61,15],[78,1,78,21],[77,1,77,21],[42,5,42,6],[56,9,56,15],[50,11,50,12],[54,8,54,10],[54,11,54,12],[51,8,51,10],[42,7,42,8],[46,7,46,8],[46,5,46,6],[56,4,57,5],[48,1,48,4],[47,1,47,4],[54,13,54,14],[59,9,59,12],[60,9,60,12],[57,13,57,15],[52,5,52,7],[51,13,51,14],[45,7,45,8],[45,5,45,6],[53,1,53,2],[54,1,54,2],[51,1,51,2],[50,1,50,2],[56,6,57,8],[53,8,53,10],[38,1,39,9],[40,5,40,6],[115,25,115,27],[102,25,102,27],[14,1,15,9],[13,1,13,9],[53,20,53,21],[65,1,65,21],[66,1,66,4],[67,1,67,4],[52,1,52,2],[63,1,63,3],[63,4,63,9],[63,11,64,21],[58,13,58,15],[59,13,59,15],[60,13,60,15],[59,16,59,21],[54,15,54,16],[58,1,58,3],[59,1,59,3],[60,1,60,3],[61,1,61,3],[46,1,46,4]]}
[null,null,"CÁLCULO DE DEMANDA - FORNECIMENTO EM TENSÃO SECUNDÁRIA",null,null,null,null,null,null,null,null,null,null,null,null,null,null,"NORMA TÉCNICA APLICADA:"]
[null,null,null,null,null,null,null,null,null,null,null,null,null,null,null,null,null,"GED Nº 13 - CPFL",null,null,null,null,null,null,null,null,null,null,null,"CRIAR NOVO DOCUMENTO"]
[]
[null,"NOME:",null,null,null,null,null,null,"CONSUMIDOR:",null,null,null,null,"PROCESSO:",null,null,null,null,null,"DATA:",null,{"$f":"TODAY()","v":"2025-04-15"},null,null,null,null,null,{"$f":"IF(AB20=2,DIMENSIONAMENTO!AL5,IF(AB20=1,DIMENSIONAMENTO!AS82,\"\"))","v":0},"MAIOR MOTOR",null,null,null,"INSTRUÇÕES DE USO"]
[]
[null,"CLASSE:",null,null,"INSTALAÇÃO:    ",null,null,null,null,null,null,null,null,null,null,"* ÁREA CONSTRUÍDA:",null,null,null,null,null,"m²",null,null,null,null,null,null,"CAT.ATEND.","ACESSAR ABA OBSERVAÇÕES",null,null,"1º   EM DESCRIÇÃO SELECIONAR O EQUIPAMENTO ATRAVÉS DA LISTA "]
[null,null,null,null,null,null,null,null,null,null,null,null,null,null,null,"]",null,null,null,null,null,null,null,null,null,null,null,null,null,null,null,null,"2º   DETERMINAR A QUANTIDADE NA COLUNA \"QTDE\""]
[null,"* ver notas informativas",null,"PARA PRODUTORES RURAIS E CLIENTES INDUSTRIAIS INFORMAR O W/m²:",null,null,null,null,null,null,null,null,null,null,"w","* ÁREA DA VITRINE:",null,null,null,null,null,"m²",null,null,null,null,null,{"$f":"IF(AND(B15<>\"\",F10<>\"\",E64<>\"\",AB20=1),VLOOKUP(E64,TABELAS!AB57:AC61,2,FALSE),IF(AND(B15<>\"\",F10<>\"\",E64<>\"\",AB20=2),VLOOKUP(E64,TABELAS!A60:C67,3,FALSE),\"\"))","v":""},"Ancor."]
[null,null,null,null,null,null,null,null,null,null,null,null,null,null,null,null,null,null,null,null,null,null,null,null,null,null,null,null,null,null,null,null,"       OUTROS E DETERMINAR A POTENCIA EM \"W*\" E A QUANTIDADE EM \"QTDE\""]
[null,"NÚMERO DE LIGAÇÕES NO MESMO PADRÃO:",null,null,null,null,null,null,"INFORME O NÚMERO DE CÔMODOS OU DIVISÕES:",null,null,null,null,null,null,null,null,null,null,null,null,null,null,null,null,null,null,{"$f":"IFERROR(IF(AND(B60<>\"\",B60<>\"FALTANDO DADOS\",B60>0),75-B60,\"\"),\"ERRO\")","v":""},"cat. Cerim"]
[null,null,null,null,null,null,null,null,null,null,null,null,null,null,null,null,null,null,null,null,null,null,null,null,null,null,null,null,null,"ACESSAR ABA REVISÕES"]
[]
[]
[null,"INFORME QUAL O CONDUTOR DO PADRÃO:",null,null,null,null,null,null,null,null,null,"ESTÁ LIGAÇÃO SERÁ:",null,null,null,null,null,"HÁ EDIFICAÇÃO:",null,null,null,null,null,null,null,"NÃO","SIM",{"$f":"IFERROR((SUM(D55:V55)/1000),\"\")","v":0},"Dem.",null,null,null,"CONSULTA TABELA DE MOTORES"]
[null,null,null,null,null,null,null,null,null,null,null,null,null,null,null,null,null,null,null,null,null,null,null,null,null,null,null,{"$f":"IF(AA15=TRUE,1,0)","v":0},"380/220",null,null,null,"CPFL",null,null,null,"CERIM"]
[null,null,null,null,null,null,null,null,null,null,null,null,null,null,null,null,null,null,null,null,null,null,null,null,null,null,null,{"$f":"IF(AND(B15<>\"\",F10<>\"\"),VLOOKUP(B15,DIMENSIONAMENTO!A33:L35,12,FALSE),\"\")","v":""},"COND."," "]
[]
[null,"GRUPO 01: FATORES DE DEMANDA PARA TOMADAS/ILUMINAÇÃO/EQUIPAMENTOS DE USO GERAL",null,null,null,null,null,null,null,null,null,"GRUPO 5: FATORES DE DEMANDA PARA FOGÕES ELÉTRICOS",null,null,null,null,null,null,null,null,null,null,null,null,null,null,null,{"$f":"IF(AND(AB20=2,C6<>\"\",G6<>\"\",$AB$19=2),VLOOKUP(G6,TABELAS!G40:L50,6,FALSE),IF(AND(AB20=2,C6<>\"\",G6<>\"\",$AB$19=1),VLOOKUP(G6,TABELAS!C39:F41,4,FALSE),IF(AND(AB20=2,C6<>\"\",G6<>\"\",$AB$19=3),VLOOKUP(G6,TABELAS!M40:O40,2,FALSE),IF(AND(AB20=1,C6<>\"\",G6<>\"\",$AB$19=2),VLOOKUP(G6,TABELAS!AN39:AU50,8,FALSE),IF(AND(AB20=1,C6<>\"\",G6<>\"\",$AB$19=1),VLOOKUP(G6,TABELAS!AJ39:AM40,4,FALSE),IF(AND(AB20=1,C6<>\"\",G6<>\"\",$AB$19=3),VLOOKUP(G6,TABELAS!AV39:AW39,2,FALSE),IF(AND(AB20=1,C6<>\"\",G6<>\"\",$AB$19=4),VLOOKUP(G6,TABELAS!AX39:BA39,4,FALSE),0)))))))","v":0},"instalação (18)","VERIFICAR O PREENCHIMENTO",null,null,"POTÊNCIA","POTÊNCIA","POTÊNCIA",null,"POTÊNCIA","POTÊNCIA","POTÊNCIA"]
[null,null,null,null,null,null,null,null,null,null,null,null,null,null,null,null,null,null,null,null,null,null,null,"POTENCIA INST.",null,"DEMANDA",null,{"$f":"IF(AND(AB20=1,C6<>\"\"),VLOOKUP(C6,TABELAS!AF38:AG42,2,FALSE),IF(AND(AB20=2,C6<>\"\"),VLOOKUP(C6,TABELAS!A39:B42,2,FALSE),0))","v":0},"classe (19)",null,null,null,"NOMINAL","ABSORVIDA","ABSORVIDA",null,"NOMINAL","ABSORVIDA","ABSORVIDA"]
[null,"DESCRIÇÃO",null,null,null,"* W",null,"QTDE",null,"TOTAL",null,"DESCRIÇÃO",null,null,null,null,null,"* W",null,"QTDE",null,"TOTAL",null,"CPFL","CERIM","CPFL","CERIM",{"$f":"CALCULO!D7","v":2},"norma (20)",null,null,null,"CV ou HP","DA REDE","DA REDE",null,"CV ou HP","DA REDE","DA REDE"]
[null,null,null,null,null,null,null,null,null,{"$f":"IFERROR(IF(AND(B21<>\"TOMADAS DE USO GERAL 100W\",B21<>\"TOMADAS DE USO ESPECÍFICO 600W\"),F21*H21,IF(OR(B21=\"TOMADAS DE USO GERAL 100W\",B21=\"TOMADAS DE USO ESPECÍFICO 600W\"),TABELAS!E7*H21)),\"\")","v":0},null,null,null,null,null,null,null,null,null,null,null,{"$f":"IFERROR(IF(L21<>\"\",R21*T21,\"\"),\"\")","v":""},null,{"$f":"IF(AND(N33<>\"\",AB20=2,L33<>\"\",T33<>\"\",N33=\"POTÊNCIA ESPECÍFICA\"),R33*T33,IF(AND(L33<>\"\",AB20=2,T33<>\"\",N33<>\"\",N33=\"SELECIONE\"),\"\",IF(AND(L33<>\"\",AB20=2,T33<>\"\",N33<>\"\",N33<>\"SELECIONE\",N33<>\"POTÊNCIA ESPECÍFICA\"),T33*TABELAS!AD9,\"\")))","v":""},{"$f":"IF(AND(L33<>\"\",AB20=1,T33<>\"\",N33<>\"\",N33=\"POTÊNCIA ESPECÍFICA\"),R33*T33,IF(AND(L33<>\"\",AB20=1,T33<>\"\",N33<>\"\",N33=\"SELECIONE\"),\"\",IF(AND(L33<>\"\",AB20=1,T33<>\"\",N33<>\"\",N33<>\"SELECIONE\",N33<>\"POTÊNCIA ESPECÍFICA\"),T33*TABELAS!AZ9,\"\")))","v":""},{"$f":"IF(AND(N33<>\"\",AB20=2,L33<>\"\",T33<>\"\",N33=\"POTÊNCIA ESPECÍFICA\"),R33*T33,IF(AND(L33<>\"\",AB20=2,T33<>\"\",N33<>\"\",N33=\"SELECIONE\"),\"\",IF(AND(L33<>\"\",AB20=2,T33<>\"\",N33<>\"\",N33<>\"SELECIONE\",N33<>\"POTÊNCIA ESPECÍFICA\"),T33*TABELAS!AC9,\"\")))","v":""},{"$f":"IF(AND(L33<>\"\",AB20=1,T33<>\"\",N33<>\"\",N33=\"POTÊNCIA ESPECÍFICA\"),R33*T33,IF(AND(L33<>\"\",AB20=1,T33<>\"\",N33<>\"\",N33=\"SELECIONE\"),\"\",IF(AND(L33<>\"\",AB20=1,T33<>\"\",N33<>\"\",N33<>\"SELECIONE\",N33<>\"POTÊNCIA ESPECÍFICA\"),T33*TABELAS!AY9,\"\")))","v":""},{"$f":"IF(AND(L33<>\"\",L33=\"MONOFÁSICO FN\"),1,IF(AND(L33<>\"\",L33=\"BIFÁSICO FFN\"),2,IF(AND(L33<>\"\",L33=\"TRIFÁSICO FFFN\"),3,\"\")))","v":""},"motor",null,null,null,null,"TRIFÁSICOS","MONO",null,null,"TRIFÁSICOS","MONO"]
[null,null,null,null,null,null,null,null,null,{"$f":"IFERROR(IF(AND(B22<>\"TOMADAS DE USO GERAL 100W\",B22<>\"TOMADAS DE USO ESPECÍFICO 600W\"),F22*H22,IF(OR(B22=\"TOMADAS DE USO GERAL 100W\",B22=\"TOMADAS DE USO ESPECÍFICO 600W\"),TABELAS!E8*H22)),\"\")","v":0},null,null,null,null,null,null,null,null,null,null,null,{"$f":"IFERROR(IF(L22<>\"\",R22*T22,\"\"),\"\")","v":""},null,{"$f":"IF(AND(N34<>\"\",AB20=2,L34<>\"\",T34<>\"\",N34=\"POTÊNCIA ESPECÍFICA\"),R34*T34,IF(AND(L34<>\"\",AB20=2,T34<>\"\",N34<>\"\",N34=\"SELECIONE\"),\"\",IF(AND(L34<>\"\",AB20=2,T34<>\"\",N34<>\"\",N34<>\"SELECIONE\",N34<>\"POTÊNCIA ESPECÍFICA\"),T34*TABELAS!AD10,\"\")))","v":""},{"$f":"IF(AND(L34<>\"\",AB20=1,T34<>\"\",N34<>\"\",N34=\"POTÊNCIA ESPECÍFICA\"),R34*T34,IF(AND(L34<>\"\",AB20=1,T34<>\"\",N34<>\"\",N34=\"SELECIONE\"),\"\",IF(AND(L34<>\"\",AB20=1,T34<>\"\",N34<>\"\",N34<>\"SELECIONE\",N34<>\"POTÊNCIA ESPECÍFICA\"),T34*TABELAS!AZ10,\"\")))","v":""},{"$f":"IF(AND(N34<>\"\",AB20=2,L34<>\"\",T34<>\"\",N34=\"POTÊNCIA ESPECÍFICA\"),R34*T34,IF(AND(L34<>\"\",AB20=2,T34<>\"\",N34<>\"\",N34=\"SELECIONE\"),\"\",IF(AND(L34<>\"\",AB20=2,T34<>\"\",N34<>\"\",N34<>\"SELECIONE\",N34<>\"POTÊNCIA ESPECÍFICA\"),T34*TABELAS!AC10,\"\")))","v":""},{"$f":"IF(AND(L34<>\"\",AB20=1,T34<>\"\",N34<>\"\",N34=\"POTÊNCIA ESPECÍFICA\"),R34*T34,IF(AND(L34<>\"\",AB20=1,T34<>\"\",N34<>\"\",N34=\"SELECIONE\"),\"\",IF(AND(L34<>\"\",AB20=1,T34<>\"\",N34<>\"\",N34<>\"SELECIONE\",N34<>\"POTÊNCIA ESPECÍFICA\"),T34*TABELAS!AY10,\"\")))","v":""},{"$f":"IF(AND(L34<>\"\",L34=\"MONOFÁSICO FN\"),1,IF(AND(L34<>\"\",L34=\"BIFÁSICO FFN\"),2,IF(AND(L34<>\"\",L34=\"TRIFÁSICO FFFN\"),3,\"\")))","v":""},"motor",null,null,null,null,"TAB. 15","TAB. 14",null,null,"TAB. 24","TAB. 25"]
[null,null,null,null,null,null,null,null,null,{"$f":"IFERROR(IF(AND(B23<>\"TOMADAS DE USO GERAL 100W\",B23<>\"TOMADAS DE USO ESPECÍFICO 600W\"),F23*H23,IF(OR(B23=\"TOMADAS DE USO GERAL 100W\",B23=\"TOMADAS DE USO ESPECÍFICO 600W\"),TABELAS!E9*H23)),\"\")","v":0},null,"GRUPO 6: FATORES DE DEMANDA PARA APARELHOS DE AR CONDICIONADO TIPO JANELA",null,null,null,null,null,null,null,null,null,null,null,{"$f":"IF(AND(N35<>\"\",AB20=2,L35<>\"\",T35<>\"\",N35=\"POTÊNCIA ESPECÍFICA\"),R35*T35,IF(AND(L35<>\"\",AB20=2,T35<>\"\",N35<>\"\",N35=\"SELECIONE\"),\"\",IF(AND(L35<>\"\",AB20=2,T35<>\"\",N35<>\"\",N35<>\"SELECIONE\",N35<>\"POTÊNCIA ESPECÍFICA\"),T35*TABELAS!AD11,\"\")))","v":""},{"$f":"IF(AND(L35<>\"\",AB20=1,T35<>\"\",N35<>\"\",N35=\"POTÊNCIA ESPECÍFICA\"),R35*T35,IF(AND(L35<>\"\",AB20=1,T35<>\"\",N35<>\"\",N35=\"SELECIONE\"),\"\",IF(AND(L35<>\"\",AB20=1,T35<>\"\",N35<>\"\",N35<>\"SELECIONE\",N35<>\"POTÊNCIA ESPECÍFICA\"),T35*TABELAS!AZ11,\"\")))","v":""},{"$f":"IF(AND(N35<>\"\",AB20=2,L35<>\"\",T35<>\"\",N35=\"POTÊNCIA ESPECÍFICA\"),R35*T35,IF(AND(L35<>\"\",AB20=2,T35<>\"\",N35<>\"\",N35=\"SELECIONE\"),\"\",IF(AND(L35<>\"\",AB20=2,T35<>\"\",N35<>\"\",N35<>\"SELECIONE\",N35<>\"POTÊNCIA ESPECÍFICA\"),T35*TABELAS!AC11,\"\")))","v":""},{"$f":"IF(AND(L35<>\"\",AB20=1,T35<>\"\",N35<>\"\",N35=\"POTÊNCIA ESPECÍFICA\"),R35*T35,IF(AND(L35<>\"\",AB20=1,T35<>\"\",N35<>\"\",N35=\"SELECIONE\"),\"\",IF(AND(L35<>\"\",AB20=1,T35<>\"\",N35<>\"\",N35<>\"SELECIONE\",N35<>\"POTÊNCIA ESPECÍFICA\"),T35*TABELAS!AY11,\"\")))","v":""},"","motor",null,null,null,"1/4 CV",580,660,null,"1/4 CV",null,660]
[null,null,null,null,null,null,null,null,null,{"$f":"IFERROR(IF(AND(B24<>\"TOMADAS DE USO GERAL 100W\",B24<>\"TOMADAS DE USO ESPECÍFICO 600W\"),F24*H24,IF(OR(B24=\"TOMADAS DE USO GERAL 100W\",B24=\"TOMADAS DE USO ESPECÍFICO 600W\"),TABELAS!E10*H24)),\"\")","v":0},null,null,null,null,null,null,null,null,null,null,null,null,null,{"$f":"IF(AND(N36<>\"\",AB20=2,L36<>\"\",T36<>\"\",N36=\"POTÊNCIA ESPECÍFICA\"),R36*T36,IF(AND(L36<>\"\",AB20=2,T36<>\"\",N36<>\"\",N36=\"SELECIONE\"),\"\",IF(AND(L36<>\"\",AB20=2,T36<>\"\",N36<>\"\",N36<>\"SELECIONE\",N36<>\"POTÊNCIA ESPECÍFICA\"),T36*TABELAS!AD12,\"\")))","v":""},{"$f":"IF(AND(L36<>\"\",AB20=1,T36<>\"\",N36<>\"\",N36=\"POTÊNCIA ESPECÍFICA\"),R36*T36,IF(AND(L36<>\"\",AB20=1,T36<>\"\",N36<>\"\",N36=\"SELECIONE\"),\"\",IF(AND(L36<>\"\",AB20=1,T36<>\"\",N36<>\"\",N36<>\"SELECIONE\",N36<>\"POTÊNCIA ESPECÍFICA\"),T36*TABELAS!AZ12,\"\")))","v":""},{"$f":"IF(AND(N36<>\"\",AB20=2,L36<>\"\",T36<>\"\",N36=\"POTÊNCIA ESPECÍFICA\"),R36*T36,IF(AND(L36<>\"\",AB20=2,T36<>\"\",N36<>\"\",N36=\"SELECIONE\"),\"\",IF(AND(L36<>\"\",AB20=2,T36<>\"\",N36<>\"\",N36<>\"SELECIONE\",N36<>\"POTÊNCIA ESPECÍFICA\"),T36*TABELAS!AC12,\"\")))","v":""},{"$f":"IF(AND(L36<>\"\",AB20=1,T36<>\"\",N36<>\"\",N36=\"POTÊNCIA ESPECÍFICA\"),R36*T36,IF(AND(L36<>\"\",AB20=1,T36<>\"\",N36<>\"\",N36=\"SELECIONE\"),\"\",IF(AND(L36<>\"\",AB20=1,T36<>\"\",N36<>\"\",N36<>\"SELECIONE\",N36<>\"POTÊNCIA ESPECÍFICA\"),T36*TABELAS!AY12,\"\")))","v":""},"","motor",null,null,null,"1/3 CV",650,770,null,"1/3 CV",650,770]
[null,null,null,null,null,null,null,null,null,{"$f":"IFERROR(IF(AND(B25<>\"TOMADAS DE USO GERAL 100W\",B25<>\"TOMADAS DE USO ESPECÍFICO 600W\"),F25*H25,IF(OR(B25=\"TOMADAS DE USO GERAL 100W\",B25=\"TOMADAS DE USO ESPECÍFICO 600W\"),TABELAS!E11*H25)),\"\")","v":0},null,"DESCRIÇÃO",null,null,null,null,null,"* W",null,"QTDE",null,"TOTAL",null,{"$f":"IF(AND(N37<>\"\",AB20=2,L37<>\"\",T37<>\"\",N37=\"POTÊNCIA ESPECÍFICA\"),R37*T37,IF(AND(L37<>\"\",AB20=2,T37<>\"\",N37<>\"\",N37=\"SELECIONE\"),\"\",IF(AND(L37<>\"\",AB20=2,T37<>\"\",N37<>\"\",N37<>\"SELECIONE\",N37<>\"POTÊNCIA ESPECÍFICA\"),T37*TABELAS!AD13,\"\")))","v":""},{"$f":"IF(AND(L37<>\"\",AB20=1,T37<>\"\",N37<>\"\",N37=\"POTÊNCIA ESPECÍFICA\"),R37*T37,IF(AND(L37<>\"\",AB20=1,T37<>\"\",N37<>\"\",N37=\"SELECIONE\"),\"\",IF(AND(L37<>\"\",AB20=1,T37<>\"\",N37<>\"\",N37<>\"SELECIONE\",N37<>\"POTÊNCIA ESPECÍFICA\"),T37*TABELAS!AZ13,\"\")))","v":""},{"$f":"IF(AND(N37<>\"\",AB20=2,L37<>\"\",T37<>\"\",N37=\"POTÊNCIA ESPECÍFICA\"),R37*T37,IF(AND(L37<>\"\",AB20=2,T37<>\"\",N37<>\"\",N37=\"SELECIONE\"),\"\",IF(AND(L37<>\"\",AB20=2,T37<>\"\",N37<>\"\",N37<>\"SELECIONE\",N37<>\"POTÊNCIA ESPECÍFICA\"),T37*TABELAS!AC13,\"\")))","v":""},{"$f":"IF(AND(L37<>\"\",AB20=1,T37<>\"\",N37<>\"\",N37=\"POTÊNCIA ESPECÍFICA\"),R37*T37,IF(AND(L37<>\"\",AB20=1,T37<>\"\",N37<>\"\",N37=\"SELECIONE\"),\"\",IF(AND(L37<>\"\",AB20=1,T37<>\"\",N37<>\"\",N37<>\"SELECIONE\",N37<>\"POTÊNCIA ESPECÍFICA\"),T37*TABELAS!AY13,\"\")))","v":""},"","motor",null,null,null,"1/2 CV",870,1180,null,"1/2 CV",870,1180]
[null,null,null,null,null,null,null,null,null,{"$f":"IFERROR(IF(AND(B26<>\"TOMADAS DE USO GERAL 100W\",B26<>\"TOMADAS DE USO ESPECÍFICO 600W\"),F26*H26,IF(OR(B26=\"TOMADAS DE USO GERAL 100W\",B26=\"TOMADAS DE USO ESPECÍFICO 600W\"),TABELAS!E12*H26)),\"\")","v":0},null,null,null,null,null,null,null,null,null,null,null,{"$f":"IF(AND(AND(L26<>\"\",$AB$20>0,T26<>\"\"),T26<>\"\",CALCULO!$D$7=1),Y36,IF(AND(L26<>\"\",T26<>\"\",CALCULO!$D$7=2),X36,\"\"))","v":""},null,{"$f":"IF(AND(N38<>\"\",AB20=2,L38<>\"\",T38<>\"\",N38=\"POTÊNCIA ESPECÍFICA\"),R38*T38,IF(AND(L38<>\"\",AB20=2,T38<>\"\",N38<>\"\",N38=\"SELECIONE\"),\"\",IF(AND(L38<>\"\",AB20=2,T38<>\"\",N38<>\"\",N38<>\"SELECIONE\",N38<>\"POTÊNCIA ESPECÍFICA\"),T38*TABELAS!AD14,\"\")))","v":""},{"$f":"IF(AND(L38<>\"\",AB20=1,T38<>\"\",N38<>\"\",N38=\"POTÊNCIA ESPECÍFICA\"),R38*T38,IF(AND(L38<>\"\",AB20=1,T38<>\"\",N38<>\"\",N38=\"SELECIONE\"),\"\",IF(AND(L38<>\"\",AB20=1,T38<>\"\",N38<>\"\",N38<>\"SELECIONE\",N38<>\"POTÊNCIA ESPECÍFICA\"),T38*TABELAS!AZ14,\"\")))","v":""},{"$f":"IF(AND(N38<>\"\",AB20=2,L38<>\"\",T38<>\"\",N38=\"POTÊNCIA ESPECÍFICA\"),R38*T38,IF(AND(L38<>\"\",AB20=2,T38<>\"\",N38<>\"\",N38=\"SELECIONE\"),\"\",IF(AND(L38<>\"\",AB20=2,T38<>\"\",N38<>\"\",N38<>\"SELECIONE\",N38<>\"POTÊNCIA ESPECÍFICA\"),T38*TABELAS!AC14,\"\")))","v":""},{"$f":"IF(AND(L38<>\"\",AB20=1,T38<>\"\",N38<>\"\",N38=\"POTÊNCIA ESPECÍFICA\"),R38*T38,IF(AND(L38<>\"\",AB20=1,T38<>\"\",N38<>\"\",N38=\"SELECIONE\"),\"\",IF(AND(L38<>\"\",AB20=1,T38<>\"\",N38<>\"\",N38<>\"SELECIONE\",N38<>\"POTÊNCIA ESPECÍFICA\"),T38*TABELAS!AY14,\"\")))","v":""},"","motor",null,null,null,"3/4 CV",1260,1340,null,"3/4 CV",1260,1340]
[null,null,null,null,null,null,null,null,null,{"$f":"IFERROR(IF(AND(B27<>\"TOMADAS DE USO GERAL 100W\",B27<>\"TOMADAS DE USO ESPECÍFICO 600W\"),F27*H27,IF(OR(B27=\"TOMADAS DE USO GERAL 100W\",B27=\"TOMADAS DE USO ESPECÍFICO 600W\"),TABELAS!E13*H27)),\"\")","v":0},null,null,null,null,null,null,null,null,null,null,null,{"$f":"IF(AND(AND(L27<>\"\",$AB$20>0,T27<>\"\"),T27<>\"\",CALCULO!$D$7=1),AA37,IF(AND(L27<>\"\",T27<>\"\",CALCULO!$D$7=2),Z37,\"\"))","v":""},null,{"$f":"IF(AND(N39<>\"\",AB20=2,L39<>\"\",T39<>\"\",N39=\"POTÊNCIA ESPECÍFICA\"),R39*T39,IF(AND(L39<>\"\",AB20=2,T39<>\"\",N39<>\"\",N39=\"SELECIONE\"),\"\",IF(AND(L39<>\"\",AB20=2,T39<>\"\",N39<>\"\",N39<>\"SELECIONE\",N39<>\"POTÊNCIA ESPECÍFICA\"),T39*TABELAS!AD15,\"\")))","v":""},{"$f":"IF(AND(L39<>\"\",AB20=1,T39<>\"\",N39<>\"\",N39=\"POTÊNCIA ESPECÍFICA\"),R39*T39,IF(AND(L39<>\"\",AB20=1,T39<>\"\",N39<>\"\",N39=\"SELECIONE\"),\"\",IF(AND(L39<>\"\",AB20=1,T39<>\"\",N39<>\"\",N39<>\"SELECIONE\",N39<>\"POTÊNCIA ESPECÍFICA\"),T39*TABELAS!AZ15,\"\")))","v":""},{"$f":"IF(AND(N39<>\"\",AB20=2,L39<>\"\",T39<>\"\",N39=\"POTÊNCIA ESPECÍFICA\"),R39*T39,IF(AND(L39<>\"\",AB20=2,T39<>\"\",N39<>\"\",N39=\"SELECIONE\"),\"\",IF(AND(L39<>\"\",AB20=2,T39<>\"\",N39<>\"\",N39<>\"SELECIONE\",N39<>\"POTÊNCIA ESPECÍFICA\"),T39*TABELAS!AC15,\"\")))","v":""},{"$f":"IF(AND(L39<>\"\",AB20=1,T39<>\"\",N39<>\"\",N39=\"POTÊNCIA ESPECÍFICA\"),R39*T39,IF(AND(L39<>\"\",AB20=1,T39<>\"\",N39<>\"\",N39=\"SELECIONE\"),\"\",IF(AND(L39<>\"\",AB20=1,T39<>\"\",N39<>\"\",N39<>\"SELECIONE\",N39<>\"POTÊNCIA ESPECÍFICA\"),T39*TABELAS!AY15,\"\")))","v":""},"","motor",null,null,null,"1 CV",1520,1560,null,"1 CV",1520,1560]
[null,null,null,null,null,null,null,null,null,{"$f":"IFERROR(IF(AND(B28<>\"TOMADAS DE USO GERAL 100W\",B28<>\"TOMADAS DE USO ESPECÍFICO 600W\"),F28*H28,IF(OR(B28=\"TOMADAS DE USO GERAL 100W\",B28=\"TOMADAS DE USO ESPECÍFICO 600W\"),TABELAS!E14*H28)),\"\")","v":0},null,null,null,null,null,null,null,null,null,null,null,{"$f":"IF(AND(AND(L28<>\"\",$AB$20>0,T28<>\"\"),T28<>\"\",CALCULO!$D$7=1),AA38,IF(AND(L28<>\"\",T28<>\"\",CALCULO!$D$7=2),Z38,\"\"))","v":""},null,null,null,null,null,null,null,null,null,null,"1 1/2 CV",2170,2350,null,"1 1/2 CV",2170,2350]
[null,null,null,null,null,null,null,null,null,{"$f":"IFERROR(IF(AND(B29<>\"TOMADAS DE USO GERAL 100W\",B29<>\"TOMADAS DE USO ESPECÍFICO 600W\"),F29*H29,IF(OR(B29=\"TOMADAS DE USO GERAL 100W\",B29=\"TOMADAS DE USO ESPECÍFICO 600W\"),TABELAS!E15*H29)),\"\")","v":0},null,null,null,null,null,null,null,null,null,null,null,{"$f":"IF(AND(AND(L29<>\"\",$AB$20>0,T29<>\"\"),T29<>\"\",CALCULO!$D$7=1),AA39,IF(AND(L29<>\"\",T29<>\"\",CALCULO!$D$7=2),Z39,\"\"))","v":""},null,null,null,null,null,"ANCORAGEM",null,null,null,null,"2 CV",2700,2970,null,"2 CV",2700,2970]
[null,null,null,null,null,null,null,null,null,{"$f":"IFERROR(IF(AND(B30<>\"TOMADAS DE USO GERAL 100W\",B30<>\"TOMADAS DE USO ESPECÍFICO 600W\"),F30*H30,IF(OR(B30=\"TOMADAS DE USO GERAL 100W\",B30=\"TOMADAS DE USO ESPECÍFICO 600W\"),TABELAS!E16*H30)),\"\")","v":0},null,"GRUPO 7: FATORES DE DEMANDA PARA MOTORES MONOFÁSICOS E TRIFÁSCISO",null,null,null,null,null,null,null,null,null,null,null,null,null,null,null,"CPFL","CERIM",null,null,null,"3 CV",4040,4070,null,"3 CV",4040,4070]
[null,"GRUPO 2: FATORES DE DEMANDA PARA CHUVEIROS/TORNEIRAS/AQUEC. ÁGUA. PASS./FERROS ELÉTRI.",null,null,null,null,null,null,null,null,null,null,null,null,null,null,null,null,null,null,null,null,null,null,null,null," ",{"$f":"IF(AND(E59<>\"M.T\",E59<>\"FALTANDO DADOS\",E59<>\"VER NORMAS PARA LIG. COLETIVA/AGRUPADA\",$F$10<>\"\",$F$10=1,$AB$20=2,$C$6<>\"\",$G$6<>\"\",AB15=0,OR($AA$54=TRUE,$AA$55=TRUE),OR($AB$54=TRUE,$AB$55=TRUE)),TABELAS!A61,IF(AND(E59<>\"M.T\",E59<>\"FALTANDO DADOS\",E59<>\"VER NORMAS PARA LIG. COLETIVA/AGRUPADA\",$F$10<>\"\",$F$10=2,$AB$20=2,$C$6<>\"\",$G$6<>\"\",AB15=0,OR($AA$54=TRUE,$AA$55=TRUE),OR($AB$54=TRUE,$AB$55=TRUE)),TABELAS!A61,IF(AND(E59<>\"M.T\",E59<>\"FALTANDO DADOS\",E59<>\"VER NORMAS PARA LIG. COLETIVA/AGRUPADA\",$F$10<>\"\",$F$10=3,B60<=12,$AB$20=2,$C$6<>\"\",$G$6<>\"\",AB15=0,OR($AA$54=TRUE,$AA$55=TRUE),OR($AB$54=TRUE,$AB$55=TRUE)),TABELAS!A61,\"\")))","v":""},{"$f":"IF(AND(E59<>\"M.T\",E59<>\"FALTANDO DADOS\",E59<>\"VER NORMAS PARA LIG. COLETIVA/AGRUPADA\",$F$10<=2,$F$10<>\"\",$R$2<>\"\",$AB$20=1),TABELAS!AB57,\"\")","v":""}," ",null,null,"4 CV",5030,null,null,"4 CV",5030]
[null,null,null,null,null,null,null,null,null,null,null,"DESCRIÇÃO",null,null,null,null,null,"* W",null,"QTDE",null,"TOTAL",null,null,null,null," ",{"$f":"IF(AND(E59<>\"M.T\",E59<>\"FALTANDO DADOS\",E59<>\"VER NORMAS PARA LIG. COLETIVA/AGRUPADA\",$F$10<>\"\",$F$10=1,$AB$20=2,$C$6<>\"\",$G$6<>\"\",OR($AA$54=TRUE,$AA$55=TRUE),OR($AB$54=TRUE,$AB$55=TRUE)),TABELAS!A62,IF(AND(E59<>\"M.T\",E59<>\"FALTANDO DADOS\",E59<>\"VER NORMAS PARA LIG. COLETIVA/AGRUPADA\",$F$10<>\"\",$F$10=2,$AB$20=2,$C$6<>\"\",$G$6<>\"\",OR($AA$54=TRUE,$AA$55=TRUE),OR($AB$54=TRUE,$AB$55=TRUE)),TABELAS!A62,\"\"))","v":""},{"$f":"IF(AND(E59<>\"M.T\",E59<>\"FALTANDO DADOS\",E59<>\"VER NORMAS PARA LIG. COLETIVA/AGRUPADA\",$F$10<=2,$F$10<>\"\",$R$2<>\"\",$AB$20=1),TABELAS!AB58,\"\")","v":""}," ",null,null,"5 CV",6020,6160,null,"5 CV",6060,6160]
[null,"DESCRIÇÃO",null,null,null,"* W",null,"QTDE",null,"TOTAL",null,null,null,null,null,null,null,null,null,null,null,{"$f":"IF(AND(L33<>\"\",T33<>\"\",CALCULO!$D$7=1),Y21,IF(AND(L33<>\"\",T33<>\"\",CALCULO!$D$7=2),X21,\"\"))","v":""},null,null,null,null," ",{"$f":"IF(AND(E59<>\"M.T\",E59<>\"FALTANDO DADOS\",E59<>\"VER NORMAS PARA LIG. COLETIVA/AGRUPADA\",B60<=25,OR(B62<=23,B62=\"\"),AB15=0,$F$10<>\"\",$F$10=1,$AB$20=2,$C$6<>\"\",$G$6<>\"\",OR($AA$54=TRUE,$AA$55=TRUE),OR($AB$54=TRUE,$AB$55=TRUE)),TABELAS!A63,\"\")","v":""},{"$f":"IF(AND(E59<>\"M.T\",E59<>\"FALTANDO DADOS\",E59<>\"VER NORMAS PARA LIG. COLETIVA/AGRUPADA\",$F$10<=2,$F$10<>\"\",$R$2<>\"\",$AB$20=1),TABELAS!AB59,\"\")","v":""}," ",null,null,"6 CV",7000,null,null,"7 1/2 CV",8650,8840]
[null,null,null,null,null,null,null,null,null,{"$f":"IFERROR(IF(B34<>\"\",F34*H34,\"\"),\"\")","v":""},null,null,null,null,null,null,null,null,null,null,null,{"$f":"IF(AND(L34<>\"\",T34<>\"\",CALCULO!$D$7=1),Y22,IF(AND(L34<>\"\",T34<>\"\",CALCULO!$D$7=2),X22,\"\"))","v":""},null,null,null,null," ",{"$f":"IF(AND(E59<>\"M.T\",E59<>\"FALTANDO DADOS\",E59<>\"VER NORMAS PARA LIG. COLETIVA/AGRUPADA\",$F$10<>\"\",$F$10=1,$AB$20=2,AB16=3,AB15=0,$C$6<>\"\",$G$6<>\"\",OR($AA$54=TRUE,$AA$55=TRUE),OR($AB$54=TRUE,$AB$55=TRUE)),TABELAS!A64,IF(AND(E59<>\"M.T\",E59<>\"FALTANDO DADOS\",E59<>\"VER NORMAS PARA LIG. COLETIVA/AGRUPADA\",$F$10<>\"\",$F$10=2,$AB$20=2,AB16=3,AB15=0,$C$6<>\"\",$G$6<>\"\",OR($AA$54=TRUE,$AA$55=TRUE),OR($AB$54=TRUE,$AB$55=TRUE)),TABELAS!A64,\"\"))","v":""},{"$f":"IF(AND(E59<>\"M.T\",E59<>\"FALTANDO DADOS\",E59<>\"VER NORMAS PARA LIG. COLETIVA/AGRUPADA\",$F$10<=2,$F$10<>\"\",$R$2<>\"\",$AB$20=1),TABELAS!AB60,\"\")","v":""}," ",null,null,"7 1/2 CV",8650,8840,null,"10 CV",11540,11640]
[null,null,null,null,null,null,null,null,null,{"$f":"IFERROR(IF(B35<>\"\",F35*H35,\"\"),\"\")","v":""},null,null,null,null,null,null,null,null,null,null,null,{"$f":"IF(AND(L35<>\"\",T35<>\"\",CALCULO!$D$7=1),Y23,IF(AND(L35<>\"\",T35<>\"\",CALCULO!$D$7=2),X23,\"\"))","v":""},null,"CPFL","CERIM","CPFL","CERIM",{"$f":"IF(AND(E59<>\"M.T\",E59<>\"FALTANDO DADOS\",E59<>\"VER NORMAS PARA LIG. COLETIVA/AGRUPADA\",B60<=25,OR(B62<=23,B62=\"\"),$F$10<>\"\",$F$10=1,$AB$20=2,$C$6<>\"\",$G$6<>\"\",OR($AA$54=TRUE,$AA$55=TRUE),OR($AB$54=TRUE,$AB$55=TRUE)),TABELAS!A65,\"\")","v":""},null,null,null,null,"10 CV",11540,11640,null,"12 1/2 CV",14090,14940]
[null,null,null,null,null,null,null,null,null,"",null,null,null,null,null,null,null,null,null,null,null,{"$f":"IF(AND(L36<>\"\",T36<>\"\",CALCULO!$D$7=1),Y24,IF(AND(L36<>\"\",T36<>\"\",CALCULO!$D$7=2),X24,\"\"))","v":""},null,{"$f":"IF(AND(L26<>\"\",AB20=2,L26=\"POTÊNCIA ESPECÍFICA\"),R26*T26,IF(AND(L26<>\"\",AB20=2,L26=\"SELECIONE\"),\"\",IF(AND(L26<>\"\",AB20=2,L26<>\"SELECIONE\",L26<>\"POTÊNCIA ESPECÍFICA\"),T26*TABELAS!Q15,\"\")))","v":""},{"$f":"IF(AND(L26<>\"\",AB20=1,L26=\"POTÊNCIA ESPECÍFICA\"),R26*T26,IF(AND(L26<>\"\",AB20=1,L26=\"SELECIONE\"),\"\",IF(AND(L26<>\"\",AB20=1,L26<>\"SELECIONE\",L26<>\"POTÊNCIA ESPECÍFICA\"),T26*TABELAS!AL7,\"\")))","v":""},{"$f":"IF(AND(L26<>\"\",AB20=2,L26=\"POTÊNCIA ESPECÍFICA\"),R26*T26,IF(AND(L26<>\"\",AB20=2,L26=\"SELECIONE\"),\"\",IF(AND(L26<>\"\",L26<>\"SELECIONE\",AB20=2,L26<>\"POTÊNCIA ESPECÍFICA\"),T26*TABELAS!R15,\"\")))","v":""},{"$f":"IF(AND(L26<>\"\",AB20=1,L26=\"POTÊNCIA ESPECÍFICA\"),R26*T26,IF(AND(L26<>\"\",AB20=1,L26=\"SELECIONE\"),\"\",IF(AND(L26<>\"\",AB20=1,L26<>\"SELECIONE\",L26<>\"POTÊNCIA ESPECÍFICA\"),T26*TABELAS!AM7,\"\")))","v":""},{"$f":"IF(AND(AB15=0,E59<>\"M.T\",E59<>\"FALTANDO DADOS\",E59<>\"VER NORMAS PARA LIG. COLETIVA/AGRUPADA\",$F$10<>\"\",$F$10<=3,$AB$20=2,$C$6<>\"\",$G$6<>\"\",OR($AA$54=TRUE,$AA$55=TRUE),OR($AB$54=TRUE,$AB$55=TRUE)),TABELAS!A66,\"\")","v":""},null,null,null,null,"12 1/2 CV",14090,14940,null,"15 CV",16650,16940]
[null,null,null,null,null,null,null,null,null,"",null,null,null,null,null,null,null,null,null,null,null,{"$f":"IF(AND(L37<>\"\",T37<>\"\",CALCULO!$D$7=1),Y25,IF(AND(L37<>\"\",T37<>\"\",CALCULO!$D$7=2),X25,\"\"))","v":""},null,{"$f":"IF(AND(L27<>\"\",AB20=2,L27=\"POTÊNCIA ESPECÍFICA\"),R27*T27,IF(AND(L27<>\"\",AB20=2,L27=\"SELECIONE\"),\"\",IF(AND(L27<>\"\",AB20=2,L27<>\"SELECIONE\",L27<>\"POTÊNCIA ESPECÍFICA\"),T27*TABELAS!Q16,\"\")))","v":""},{"$f":"IF(AND(L27<>\"\",AB20=1,L27=\"POTÊNCIA ESPECÍFICA\"),R27*T27,IF(AND(L27<>\"\",AB20=1,L27=\"SELECIONE\"),\"\",IF(AND(L27<>\"\",AB20=1,L27<>\"SELECIONE\",L27<>\"POTÊNCIA ESPECÍFICA\"),T27*TABELAS!AL8,\"\")))","v":""},{"$f":"IF(AND(L27<>\"\",AB20=2,L27=\"POTÊNCIA ESPECÍFICA\"),R27*T27,IF(AND(L27<>\"\",AB20=2,L27=\"SELECIONE\"),\"\",IF(AND(L27<>\"\",AB20=2,L27<>\"SELECIONE\",L27<>\"POTÊNCIA ESPECÍFICA\"),T27*TABELAS!R16,\"\")))","v":""},{"$f":"IF(AND(L27<>\"\",AB20=1,L27=\"POTÊNCIA ESPECÍFICA\"),R27*T27,IF(AND(L27<>\"\",AB20=1,L27=\"SELECIONE\"),\"\",IF(AND(L27<>\"\",AB20=1,L27<>\"SELECIONE\",L27<>\"POTÊNCIA ESPECÍFICA\"),T27*TABELAS!AM8,\"\")))","v":""},{"$f":"IF(AND(AB15=0,E59<>\"M.T\",E59<>\"FALTANDO DADOS\",E59<>\"VER NORMAS PARA LIG. COLETIVA/AGRUPADA\",$F$10<>\"\",$F$10<=3,$AB$20=2,$C$6<>\"\",$G$6<>\"\",OR($AA$54=TRUE,$AA$55=TRUE),OR($AB$54=TRUE,$AB$55=TRUE)),TABELAS!A67,\"\")","v":""},null,null,null,null,"15 CV",16650,16940,null,"20 CV",22100]
[null,null,null,null,null,null,null,null,null,"",null,null,null,null,null,null,null,null,null,null,null,{"$f":"IF(AND(L38<>\"\",T38<>\"\",CALCULO!$D$7=1),Y26,IF(AND(L38<>\"\",T38<>\"\",CALCULO!$D$7=2),X26,\"\"))","v":""},null,{"$f":"IF(AND(L28<>\"\",AB20=2,L28=\"POTÊNCIA ESPECÍFICA\"),R28*T28,IF(AND(L28<>\"\",AB20=2,L28=\"SELECIONE\"),\"\",IF(AND(L28<>\"\",AB20=2,L28<>\"SELECIONE\",L28<>\"POTÊNCIA ESPECÍFICA\"),T28*TABELAS!Q17,\"\")))","v":""},{"$f":"IF(AND(L28<>\"\",AB20=1,L28=\"POTÊNCIA ESPECÍFICA\"),R28*T28,IF(AND(L28<>\"\",AB20=1,L28=\"SELECIONE\"),\"\",IF(AND(L28<>\"\",AB20=1,L28<>\"SELECIONE\",L28<>\"POTÊNCIA ESPECÍFICA\"),T28*TABELAS!AL9,\"\")))","v":""},{"$f":"IF(AND(L28<>\"\",AB20=2,L28=\"POTÊNCIA ESPECÍFICA\"),R28*T28,IF(AND(L28<>\"\",AB20=2,L28=\"SELECIONE\"),\"\",IF(AND(L28<>\"\",AB20=2,L28<>\"SELECIONE\",L28<>\"POTÊNCIA ESPECÍFICA\"),T28*TABELAS!R17,\"\")))","v":""},{"$f":"IF(AND(L28<>\"\",AB20=1,L28=\"POTÊNCIA ESPECÍFICA\"),R28*T28,IF(AND(L28<>\"\",AB20=1,L28=\"SELECIONE\"),\"\",IF(AND(L28<>\"\",AB20=1,L28<>\"SELECIONE\",L28<>\"POTÊNCIA ESPECÍFICA\"),T28*TABELAS!AM9,\"\")))","v":""},null,null,null,null,null,"20 CV",22100,null,null,"25 CV",25830]
[null,"GRUPO 3: FATORES DE DEMANDA PARA AQUECEDOR CENTRAL/ACUMULAÇÃO (BOILER)",null,null,null,null,null,null,null,null,null,null,null,null,null,null,null,null,null,null,null,{"$f":"IF(AND(L39<>\"\",T39<>\"\",CALCULO!$D$7=1),Y27,IF(AND(L39<>\"\",T39<>\"\",CALCULO!$D$7=2),X27,\"\"))","v":""},null,{"$f":"IF(AND(L29<>\"\",AB20=2,L29=\"POTÊNCIA ESPECÍFICA\"),R29*T29,IF(AND(L29<>\"\",AB20=2,L29=\"SELECIONE\"),\"\",IF(AND(L29<>\"\",AB20=2,L29<>\"SELECIONE\",L29<>\"POTÊNCIA ESPECÍFICA\"),T29*TABELAS!Q18,\"\")))","v":""},{"$f":"IF(AND(L29<>\"\",AB20=1,L29=\"POTÊNCIA ESPECÍFICA\"),R29*T29,IF(AND(L29<>\"\",AB20=1,L29=\"SELECIONE\"),\"\",IF(AND(L29<>\"\",AB20=1,L29<>\"SELECIONE\",L29<>\"POTÊNCIA ESPECÍFICA\"),T29*TABELAS!AL10,\"\")))","v":""},{"$f":"IF(AND(L29<>\"\",AB20=2,L29=\"POTÊNCIA ESPECÍFICA\"),R29*T29,IF(AND(L29<>\"\",AB20=2,L29=\"SELECIONE\"),\"\",IF(AND(L29<>\"\",AB20=2,L29<>\"SELECIONE\",L29<>\"POTÊNCIA ESPECÍFICA\"),T29*TABELAS!R18,\"\")))","v":""},{"$f":"IF(AND(L29<>\"\",AB20=1,L29=\"POTÊNCIA ESPECÍFICA\"),R29*T29,IF(AND(L29<>\"\",AB20=1,L29=\"SELECIONE\"),\"\",IF(AND(L29<>\"\",AB20=1,L29<>\"SELECIONE\",L29<>\"POTÊNCIA ESPECÍFICA\"),T29*TABELAS!AM10,\"\")))","v":""},null,null,null,null,null,"25 CV",25830,null,null,"30 CV",30520]
[null,null,null,null,null,null,null,null,null,null,null,"GRUPO 8: FATORES DE DEMANDA PARA EQPTOS ESPECIAIS (SOLDA ARCO/GALV./RESIST. E RAIO - X)",null,null,null,null,null,null,null,null,null,null,null,null,null,null,{"$f":"IF(AND(B60<=8,B62=\"\"),1,\"\")","v":""},{"$f":"IF(AND(B60<=25,B60>12,B62=\"\"),2,\"\")","v":""},{"$f":"IF(AND(B60<=75,B60>18,B62<>\"\",B62<=75,DIMENSIONAMENTO!AS86>0),3,\"\")","v":""},null,null,null,"30 CV",30520,null,null,"40 CV",39740]
[null,"DESCRIÇÃO",null,null,null,"* W",null,"QTDE",null,"TOTAL",null,null,null,null,null,null,null,null,null,null,null,null,null,null,null,null,null,"RESULTADO",{"$f":"LARGE(AA40:AC40,1)","v":{"$error":"#NUM!"}},null,null,null,"40 CV",39740,null,null,"50 CV",48730]
[null,null,null,null,null,null,null,null,null,{"$f":"IFERROR(IF(B42<>\"\",F42*H42,\"\"),\"\")","v":""},null,"DESCRIÇÃO",null,null,null,null,null,"* W",null,"QTDE",null,"TOTAL",null,null,null,null,"CPFL","CERIM",null,null,null,null,"50 CV",48730,null,null,"60 CV",58150]
[null,null,null,null,null,null,null,null,null,{"$f":"IFERROR(IF(B43<>\"\",F43*H43,\"\"),\"\")","v":""},null,null,null,null,null,null,null,null,null,null,null,{"$f":"IF(AND(L43<>\"\",$AB$20>0,T43<>\"\"),IF(L43=\"POTÊNCIA ESPECÍFICA\",R43*T43,IF(L43<>\"POTÊNCIA ESPECÍFICA\",T43*TABELAS!Q28,\"\")),\"\")","v":""},null,null,null,null,1,1,null,null,null,null,"60 CV",58150,null,null,"75 CV",72280]
[null,"GRUPO 4: FATORES DE DEMANDA PARA SECADORA/LAVADORA DE ROUPA-LOUÇA/ MICROONDAS",null,null,null,null,null,null,null,null,null,null,null,null,null,null,null,null,null,null,null,{"$f":"IF(AND(L44<>\"\",$AB$20>0,T44<>\"\"),IF(L44=\"POTÊNCIA ESPECÍFICA\",R44*T44,IF(L44<>\"POTÊNCIA ESPECÍFICA\",T44*TABELAS!Q29,\"\")),\"\")","v":""},null,null,null,null,2,2,null,null,null,null,"75 CV",72280,null,null,"100 CV",95560]
[null,null,null,null,null,null,null,null,null,null,null,"GRUPO 9: HIDROMASSAGEM (SOMENTE PARA A NORMA NTC D 04 CERIM)",null,null,null,null,null,null,null,null,null,null,null,null,null,null,3,"3 ou mais",null,null,null,null,"100 CV",97050,null,null,"125 CV",117050]
[null,"DESCRIÇÃO",null,null,null,"* W",null,"QTDE",null,"TOTAL",null,null,null,null,null,null,null,null,null,null,null,null,null,null,null,null,"4 ou mais",null,null,null,null,null,"125 CV",114560,null,null,"150 CV",141290]
[null,null,null,null,null,null,null,null,null,{"$f":"IFERROR(IF(B47<>\"\",F47*H47,\"\"),\"\")","v":""},null,"DESCRIÇÃO",null,null,null,null,null,"* W",null,"QTDE",null,"TOTAL",null,null,null,null,{"$f":"MAX(D52:D53)","v":0},{"$f":"AA40:AC40","v":""},null,null,null,null,"150 CV",128020,null,null,"200 CV",190180]
[null,null,null,null,null,null,null,null,null,{"$f":"IFERROR(IF(B48<>\"\",F48*H48,\"\"),\"\")","v":""},null,null,null,null,null,null,null,null,null,null,null,{"$f":"IF(AND(L48<>\"\",$G$6<>\"\",$C$6<>\"\",$AB$20=1,T48<>\"\"),IF(L48=\"POTÊNCIA ESPECÍFICA\",R48*T48,IF(L48<>\"POTÊNCIA ESPECÍFICA\",T48*TABELAS!AM22,\"FALHA\")),\"\")","v":""},null,null,null,null,"1A/1C/1D/1E e 09","TAB. 1B e 09",null,null,null,null,"175 CV",170890]
[null,null,null,null,null,null,null,null,null,"",null,null,null,null,null,null,null,null,null,null,null,{"$f":"IF(AND(L49<>\"\",$G$6<>\"\",$C$6<>\"\",$AB$20=1,T49<>\"\"),IF(L49=\"POTÊNCIA ESPECÍFICA\",R49*T49,IF(L49<>\"POTÊNCIA ESPECÍFICA\",T49*TABELAS!AM23,\"FALHA\")),\"\")","v":""},null,null,null,{"$f":"IF(AND(E64<>\"\",AB20=2),VLOOKUP(E64,TABELAS!A60:C67,3,FALSE),\"\")","v":2},{"$f":"IF(OR(B60=\"FALTANDO DADOS\",B62=\"FALTANDO DADOS\"),\"\",IF(DIMENSIONAMENTO!B5=1,\"A1 MONOFÁSICO\",IF(DIMENSIONAMENTO!B6=1,\"A2 MONOFÁSICO\",IF(DIMENSIONAMENTO!B7=1,\"B1 BIFÁSICO\",IF(DIMENSIONAMENTO!B8=1,\"B2 BIFÁSICO\",IF(DIMENSIONAMENTO!B9=1,\"C1 TRIFÁSICO\",IF(DIMENSIONAMENTO!B10=1,\"C2 TRIFÁSICO\",IF(DIMENSIONAMENTO!B11=1,\"C3 TRIFÁSICO\",IF(DIMENSIONAMENTO!B12=1,\"C4 TRIFÁSICO\",IF(DIMENSIONAMENTO!B13=1,\"C5 TRIFÁSICO\",IF(DIMENSIONAMENTO!B14=1,\"C6 TRIFÁSICO\",\"M.T\")))))))))))","v":""},{"$f":"IF(OR(B60=\"FALTANDO DADOS\",B62=\"FALTANDO DADOS\"),\"\",IF(DIMENSIONAMENTO!B23=1,DIMENSIONAMENTO!C23,IF(DIMENSIONAMENTO!B24=1,DIMENSIONAMENTO!C24,IF(DIMENSIONAMENTO!B25=1,DIMENSIONAMENTO!C25,IF(DIMENSIONAMENTO!B26=1,DIMENSIONAMENTO!C26,IF(DIMENSIONAMENTO!B27=1,DIMENSIONAMENTO!C27,IF(DIMENSIONAMENTO!B28=1,DIMENSIONAMENTO!C28,IF(DIMENSIONAMENTO!B29=1,DIMENSIONAMENTO!C29,IF(DIMENSIONAMENTO!B30=1,DIMENSIONAMENTO!C30,\"M.T\")))))))))","v":""},"CPFL",null,null,null,"200 CV",196390]
[null,null,null,null,null,null,null,null,null,null,null,null,null,null,null,null,null,null,null,null,null,null,null,null,null,null,null,null,null,null,null,null,"250 CV IRRIG.",242820]
[null,"DESCRIÇÃO/GRUPO",null,1,2,3,null,null,4,null,null,5,null,6,null,7,null,8,null,null,9,null,null,null,null,{"$f":"IF(AND(AB20=1,E64<>\"\"),VLOOKUP(E64,TABELAS!AB56:AC61,2,FALSE),\"\")","v":""},{"$f":"IF(OR(B60=\"FALTANDO DADOS\",B62=\"FALTANDO DADOS\"),\"\",IF(DIMENSIONAMENTO!B81=1,\"A1 MONOFÁSICO\",IF(DIMENSIONAMENTO!B82=1,\"A2 MONOFÁSICO\",IF(DIMENSIONAMENTO!B83=1,\"B1 BIFÁSICO\",IF(DIMENSIONAMENTO!B84=1,\"B2 BIFÁSICO\",IF(DIMENSIONAMENTO!B85=1,\"C1 TRIFÁSICO\",IF(DIMENSIONAMENTO!B86=1,\"C2 TRIFÁSICO\",IF(DIMENSIONAMENTO!B87=1,\"C3 TRIFÁSICO\",IF(DIMENSIONAMENTO!B88=1,\"C4 TRIFÁSICO\",IF(DIMENSIONAMENTO!B89=1,\"C5 TRIFÁSICO\",IF(DIMENSIONAMENTO!B90=1,\"C6 TRIFÁSICO\",IF(AND(AB20=1,AB15=0,OR(DIMENSIONAMENTO!AV83>DIMENSIONAMENTO!AD82,DIMENSIONAMENTO!AW83>DIMENSIONAMENTO!AE85,DIMENSIONAMENTO!AX83)),AB51,\"M.T\"))))))))))))","v":""},{"$f":"IF(OR(B60=\"FALTANDO DADOS\",B62=\"FALTANDO DADOS\"),\"\",IF(DIMENSIONAMENTO!B91=1,\"C7 TRIFÁSICO\",IF(DIMENSIONAMENTO!B92=1,\"C8 TRIFÁSICO\",IF(DIMENSIONAMENTO!B93=1,\"C9 TRIFÁSICO\",IF(DIMENSIONAMENTO!B94=1,\"C10 TRIFÁSICO\",IF(DIMENSIONAMENTO!B95=1,\"C11 TRIFÁSICO\",\"M.T\"))))))","v":""},"CERIM"]
[null,"CARGA DECLARADA",null,{"$f":"IF(AND($C$6<>\"\",$G$6<>\"\",OR($AB$20=2,$AB$20=1),$AB$19=1),SUM(J21:J30),IF(AND($C$6<>\"\",$G$6<>\"\",$AB$20=2,$AB$19=2),CALCULO!$R$52,IF(AND($C$6<>\"\",$G$6<>\"\",OR($AB$20=2,$AB$20=1),$AB$19=3),SUM(J21:J30),IF(AND($C$6<>\"\",$G$6<>\"\",$AB$20=1,$AB$19=2),CALCULO!$R$77,IF(AND($C$6<>\"\",$G$6<>\"\",$AB$20=1,$AB$19=4),CALCULO!$P$89,0)))))","v":0},{"$f":"IF(AND($C$6<>\"\",$G$6<>\"\"),SUM(J34:J38),0)","v":0},{"$f":"IF(AND($C$6<>\"\",$G$6<>\"\"),SUM(J42:J43),0)","v":0},null,null,{"$f":"IF(AND($C$6<>\"\",$G$6<>\"\"),SUM(J47:J49),0)","v":0},null,null,{"$f":"IF(AND($C$6<>\"\",$G$6<>\"\"),SUM(V21:V22),0)","v":0},null,{"$f":"IF(AND($C$6<>\"\",$G$6<>\"\"),SUM(V26:V29),0)","v":0},null,{"$f":"IF(AND($C$6<>\"\",$G$6<>\"\",$AB$20=2),CALCULO!D67,IF(AND($C$6<>\"\",$G$6<>\"\",$AB$20=1),CALCULO!H67,0))","v":0},null,{"$f":"IF(AND($C$6<>\"\",$G$6<>\"\"),SUM(V43:V44),0)","v":0},null,null,{"$f":"IF(AND($C$6<>\"\",$G$6<>\"\"),SUM(V48:V49),0)","v":0},null,null,null,null,null,null,null,null,null,null,null,"300 CV IRRIG.",286970]
[null,"CARGA MÍNIMA",null,{"$f":"IF(AND(OR($AB$20=1,$AB$20=2),$AB$19=1,$C$6<>\"\",$G$6<>\"\",P10>0),CALCULO!X38,IF(AND($AB$20=1,$AB$19=2,$C$6<>\"\",$G$6<>\"\",D52<>0),CALCULO!Q75,IF(AND($AB$20=2,$AB$19=2,$C$6<>\"\",$G$6<>\"\",D52<>0),CALCULO!Q50,IF(AND(OR($AB$20=2,$AB$20=1,$AB$19=3,$AB$19=4),$C$6<>\"\",$G$6<>\"\"),CALCULO!P8,0))))","v":0},{"$f":"E52","v":0},{"$f":"F52","v":0},null,null,{"$f":"I52","v":0},null,null,{"$f":"L52","v":0},null,{"$f":"N52","v":0},null,{"$f":"P52","v":0},null,{"$f":"R52","v":0},null,null,{"$f":"U52","v":0},null,null,null,null,null,"LIGAÇÃO","EDIFICAÇÃO"]
[null,"FD MÉDIO",null,{"$f":"IF(AND($C$6<>\"\",$G$6<>\"\",AB19=1),CALCULO!X41,IF(AND($C$6<>\"\",$G$6<>\"\",AB19=2,$AB$20=1,OR(D52>0,D53>0)),VLOOKUP(CALCULO!Q76,CALCULO!N58:T74,4,FALSE),IF(AND($C$6<>\"\",$G$6<>\"\",AB19=1,$AB$20=2,D52>0),CALCULO!D15,IF(AND($C$6<>\"\",$G$6<>\"\",$AB$20=2,AB19=2,OR(D52>0,D53>0)),VLOOKUP(CALCULO!Q51,CALCULO!N35:T49,4,FALSE),IF(AND($C$6<>\"\",$G$6<>\"\",AB19=3,OR(D52>0,D53>0)),CALCULO!P83,IF(AND($C$6<>\"\",$G$6<>\"\",AB19=4,$AB$20=1),CALCULO!P88,0))))))","v":0},{"$f":"CALCULO!H15","v":0},{"$f":"CALCULO!D27","v":0},null,null,{"$f":"CALCULO!H27","v":0},null,null,{"$f":"CALCULO!D39","v":0},null,{"$f":"CALCULO!H39","v":0},null,{"$f":"IF(AND(C6<>\"\",G6<>\"\",AB20=1,CALCULO!H73<>\"\",CALCULO!H74<>\"\"),CALCULO!H70,IF(AND(C6<>\"\",G6<>\"\",AB20=2,CALCULO!D73<>\"\",CALCULO!D74<>\"\"),CALCULO!B70,0))","v":0},null,{"$f":"IF(AND(C6<>\"\",G6<>\"\",AB20=2),CALCULO!B49,IF(AND(C6<>\"\",G6<>\"\",AB20=1),CALCULO!H62,\"\"))","v":""},null,null,{"$f":"CALCULO!H6","v":0},null,null,null,null,"DEFINITIVA",true,true,"SIM"]
[null,"DEMANDA",null,{"$f":"IF(AND($C$6<>\"\",$G$6<>\"\",$AB$19=1),LARGE(CALCULO!X39:X40,1),IF(AND($C$6<>\"\",$G$6<>\"\",$AB$20=2,$AB$19=2,D52>0),LARGE(CALCULO!Q52:Q53,1),IF(AND($C$6<>\"\",$G$6<>\"\",$AB$20=1,$AB$19=2,D52<>0),CALCULO!$Q$77,IF(AND($C$6<>\"\",$G$6<>\"\",$AB$20=2,$AB$19=3,D52<>0),(LARGE(D52:D53,1)*D54),IF(AND($C$6<>\"\",$G$6<>\"\",$AB$20=1,OR($AB$19=3,$AB$19=4),D52<>0),(LARGE(D52:D53,1)*D54),0)))))","v":0},{"$f":"IF(AND($C$6<>\"\",$G$6<>\"\",$AB$20=1),CALCULO!H18,IF(AND($C$6<>\"\",$G$6<>\"\",$AB$20=2),CALCULO!H18,0))","v":0},{"$f":"IF(AND($C$6<>\"\",$G$6<>\"\",$AB$20=1),CALCULO!D30,IF(AND($C$6<>\"\",$G$6<>\"\",$AB$20=2),CALCULO!D30,0))","v":0},null,null,{"$f":"IF(AND($C$6<>\"\",$G$6<>\"\",$AB$20=1),CALCULO!H30,IF(AND($C$6<>\"\",$G$6<>\"\",$AB$20=2),CALCULO!H30,0))","v":0},null,null,{"$f":"IF(AND($C$6<>\"\",$G$6<>\"\",$AB$20=1),CALCULO!D42,IF(AND($C$6<>\"\",$G$6<>\"\",$AB$20=2),CALCULO!D42,0))","v":0},null,{"$f":"IF(AND($C$6<>\"\",$G$6<>\"\",$AB$20=1),CALCULO!H42,IF(AND($C$6<>\"\",$G$6<>\"\",$AB$20=2),CALCULO!H42,0))","v":0},null,{"$f":"IF(AND($C$6<>\"\",$G$6<>\"\",$AB$20=1),CALCULO!F70,IF(AND($C$6<>\"\",$G$6<>\"\",$AB$20=2),CALCULO!F70,0))","v":0},null,{"$f":"IF(AND($C$6<>\"\",$G$6<>\"\",$AB$20=1),CALCULO!F49,IF(AND($C$6<>\"\",$G$6<>\"\",$AB$20=2),CALCULO!F49,0))","v":0},null,null,{"$f":"IF(AND($C$6<>\"\",$G$6<>\"\",$AB$20=1),CALCULO!H7,IF(AND($C$6<>\"\",$G$6<>\"\",$AB$20=2),CALCULO!H7,0))","v":0},null,null,null,null,"PROVISÓRIA",null,null,"NÃO"]
[]
[null,"CARGA",null,null,"CATEGORIA CALCULADA",null,"CATEGORIA SOLICITADA",null,null,"PRINCIPAIS CARACTERÍSTICAS DO PADRÃO",null,null,null,null,null,null,"TENSÃO DE FORNECIMENTO:",null,null,null,null,null,null,null,null,null,"NÍVEIS DE TENSÃO"]
[null,null,null,null,null,null,null,null,null,"DISJUNTOR",null,null,null,{"$f":"IF(AND($AB$15=0,$B$15<>\"\",$R$2<>\"\",$C$6<>\"\",$G$6<>\"\",$T$6<>\"\",$F$10<>\"\",$E$64<>\"\",$E$59<>\"\",$E$59<>\"M.T\",$F$10<=3,$G$59<>\"\",$G$59<>\"M.T\",$AB$20=2,OR($AA$54=TRUE,$AA$55=TRUE),OR($AB$54=TRUE,$AB$55=TRUE)),VLOOKUP($G$59,DIMENSIONAMENTO!$C$5:$R$14,9,FALSE),IF(AND($AB$15=1,$B$15<>\"\",$R$2<>\"\",$C$6<>\"\",$G$6<>\"\",$T$6<>\"\",$F$10<>\"\",$E$64<>\"\",$E$59<>\"\",$E$59<>\"M.T\",$F$10<=3,$G$59<>\"\",$G$59<>\"M.T\",$AB$20=2,OR($AA$54=TRUE,$AA$55=TRUE),OR($AB$54=TRUE,$AB$55=TRUE)),VLOOKUP($G$59,DIMENSIONAMENTO!$C$23:$R$30,9,FALSE),IF(AND($AB$15=0,DIMENSIONAMENTO!AV83<=DIMENSIONAMENTO!AD82,$B$15<>\"\",$R$2<>\"\",$C$6<>\"\",$G$6<>\"\",$T$6<>\"\",$F$10<>\"\",$E$64<>\"\",$E$59<>\"\",$E$59<>\"M.T\",$F$10<=2,$G$59<>\"\",$G$59<>\"\",$AB$20=1,OR($AA$54=TRUE,$AA$55=TRUE),OR($AB$54=TRUE,$AB$55=TRUE)),VLOOKUP($G$59,DIMENSIONAMENTO!$C$81:$Y$90,10,FALSE),IF(AND(OR($AB$15=1,DIMENSIONAMENTO!AV83>DIMENSIONAMENTO!AD82),$B$15<>\"\",$R$2<>\"\",$C$6<>\"\",$G$6<>\"\",$T$6<>\"\",$F$10<>\"\",$E$64<>\"\",$E$59<>\"\",$E$59<>\"M.T\",$F$10<=2,$G$59<>\"\",$G$59<>\"\",$AB$20=1,OR($AA$54=TRUE,$AA$55=TRUE),OR($AB$54=TRUE,$AB$55=TRUE)),VLOOKUP($G$59,DIMENSIONAMENTO!$C$91:$Y$95,10,FALSE),IF(AND($B$15<>\"\",$G$6<>\"\",$C$6<>\"\",$T$6<>\"\",$F$10<>\"\",OR($F$10=\"4 ou mais\",$F$10=\"3 ou mais\",AND(B60>38,F10>=2))),\"LIG. COLETIVA\",IF(E59=\"M.T\",\"M.T\",\"FALTANDO DADOS\"))))))","v":"FALTANDO DADOS"},null,null,{"$f":"IF(AND(C6<>\"\",E64<>\"\",G6<>\"\",F10<>\"\",F10<=3,G59<>\"M.T\",G59<>\"\",AB20=2,AB15=0,OR(AA54=TRUE,AA55=TRUE),OR(AB54=TRUE,AB55=TRUE),B60<=12,DIMENSIONAMENTO!AM7=0,DIMENSIONAMENTO!AL9=0),AA60,IF(AND(C6<>\"\",E64<>\"\",G6<>\"\",F10<>\"\",F10<=3,G59<>\"M.T\",G59<>\"\",AB20=2,AB15=0,OR(AA54=TRUE,AA55=TRUE),OR(AB54=TRUE,AB55=TRUE),B60<=75),AA62,IF(AND(C6<>\"\",G6<>\"\",F10<>\"\",F10<=3,G59<>\"M.T;G59<>\"\";F59<>\"\"\",AB20=2,AB15=1,OR(AA54=TRUE,AA55=TRUE),OR(AB54=TRUE,AB55=TRUE),B60<=15,DIMENSIONAMENTO!AM7=0,DIMENSIONAMENTO!AL9=0),AA61,IF(AND(C6<>\"\",E64<>\"\",G6<>\"\",F10<>\"\",F10<=3,G59<>\"\",G59<>\"M.T\",AB20=2,AB15=1,OR(AA54=TRUE,AA55=TRUE),OR(AB54=TRUE,AB55=TRUE),B60<=75),AA64,IF(AND(C6<>\"\",E64<>\"\",G6<>\"\",F10<>\"\",F10<=2,G59<>\"\",G59<>\"M.T\",AB20=1,AB15=0,DIMENSIONAMENTO!AV83<=DIMENSIONAMENTO!AD82,OR(AA54=TRUE,AA55=TRUE),OR(AB54=TRUE,AB55=TRUE),B60<=8,DIMENSIONAMENTO!AT84=0,DIMENSIONAMENTO!AS86=0),AB60,IF(AND(C6<>\"\",E64<>\"\",G6<>\"\",F10<>\"\",F10<=2,G59<>\"\",G59<>\"M.T\",AB20=1,AB15=0,DIMENSIONAMENTO!AV83<=DIMENSIONAMENTO!AD82,OR(AA54=TRUE,AA55=TRUE),OR(AB54=TRUE,AB55=TRUE),B60<=75),AB62,IF(AND(C6<>\"\",E64<>\"\",G6<>\"\",F10<>\"\",F10<=3,G59<>\"\",G59<>\"M.T\",AB20=1,OR(AB15=1,DIMENSIONAMENTO!AV83>DIMENSIONAMENTO!AD82),OR(AA54=TRUE,AA55=TRUE),OR(AB54=TRUE,AB55=TRUE),B60<=75),AB67,IF(AND($B$15<>\"\",$G$6<>\"\",$C$6<>\"\",$T$6<>\"\",$F$10<>\"\",OR($F$10=\"4 ou mais\",$F$10=\"3 ou mais\",,AND(B60>38,F10>=2))),\"LIG. COLETIVA\",\"FALTANDO DADOS\"))))))))","v":"FALTANDO DADOS"},null,null,null,null,null,null,null,null,null,"DE FORNECIMENTO"]
[null,"POTENCIA INSTALADA(KW):",null,null,{"$f":"IF(AND(OR(B60=\"LIG. COLETIVA\",B60<=75),B15<>\"\",$T$6<>\"\",OR(F10=\"4 ou mais\",F10=\"3 ou mais\"),OR(AND(AB20=2,AB4<=20920,AB15=0),AND(AB20=2,AB4<=33380,AB15=1),AND(AB20=1,AB4<=12820,AB15=0),AND(AB20=1,AB4<=17010,AB15=1)),OR($AA$55=TRUE,$AA$54=TRUE),OR($AB$54=TRUE,$AB$55=TRUE)),\"VER NORMAS P/ LIG. COLETIVA\",IF(AND(AB15=0,$AB$20=1,F10<=2,OR(AA54=TRUE,AA55=TRUE),OR(AB54=TRUE,AB55=TRUE)),$AA$51,IF(AND(AB15=0,B15<>\"\",$AB$20=2,F10<>\"\",F10<=2,OR(AA54=TRUE,AA55=TRUE),OR(AB54=TRUE,AB55=TRUE)),$AA$49,IF(AND(AB15=1,$AB$20=1,F10<=2,OR(AA54=TRUE,AA55=TRUE),OR(AB54=TRUE,AB55=TRUE)),AB51,IF(AND(AB15=1,B15<>\"\",$AB$20=2,F10<>\"\",F10<=3,OR(AA54=TRUE,AA55=TRUE),OR(AB54=TRUE,AB55=TRUE)),AB49,IF(AND(AB15=0,B15<>\"\",$AB$20=2,F10<>\"\",F10<=3,OR(AA54=TRUE,AA55=TRUE),OR(AB54=TRUE,AB55=TRUE)),AA49,\"FALTANDO DADOS\"))))))","v":"FALTANDO DADOS"},null,null,null,null,"CABOS ENTRADA/SAÍDA",null,null,null,{"$f":"IF(AND($AB$15=0,$B$15<>\"\",$R$2<>\"\",$C$6<>\"\",$G$6<>\"\",$T$6<>\"\",$F$10<>\"\",$E$64<>\"\",$E$59<>\"\",$E$59<>\"M.T\",$G$59<>\"\",$G$59<>\"M.T\",$F$10<=3,$AB$20=2,OR($AA$54=TRUE,$AA$55=TRUE),OR($AB$54=TRUE,$AB$55=TRUE)),VLOOKUP($G$59,DIMENSIONAMENTO!$C$5:$R$14,7,FALSE),IF(AND($AB$15=1,$B$15<>\"\",$R$2<>\"\",$C$6<>\"\",$G$6<>\"\",$T$6<>\"\",$F$10<>\"\",$E$64<>\"\",$E$59<>\"\",$E$59<>\"M.T\",$G$59<>\"\",$G$59<>\"M.T\",$F$10<=3,$AB$20=2,OR($AA$54=TRUE,$AA$55=TRUE),OR($AB$54=TRUE,$AB$55=TRUE)),VLOOKUP($G$59,DIMENSIONAMENTO!$C$23:$R$30,7,FALSE),IF(AND($AB$15=0,DIMENSIONAMENTO!AV83<=DIMENSIONAMENTO!AD82,$B$15<>\"\",$R$2<>\"\",$C$6<>\"\",$G$6<>\"\",$T$6<>\"\",$F$10<>\"\",$E$64<>\"\",$E$59<>\"\",$E$59<>\"M.T\",$F$10<=2,$G$59<>\"\",$G$59<>\"\",$AB$20=1,OR($AA$54=TRUE,$AA$55=TRUE),OR($AB$54=TRUE,$AB$55=TRUE)),VLOOKUP($G$59,DIMENSIONAMENTO!$C$81:$Y$90,9,FALSE),IF(AND(OR($AB$15=1,DIMENSIONAMENTO!AV83>DIMENSIONAMENTO!AD82),$B$15<>\"\",$R$2<>\"\",$C$6<>\"\",$G$6<>\"\",$T$6<>\"\",$F$10<>\"\",$E$64<>\"\",$E$59<>\"\",$E$59<>\"M.T\",$F$10<=2,$G$59<>\"\",$G$59<>\"\",$AB$20=1,OR($AA$54=TRUE,$AA$55=TRUE),OR($AB$54=TRUE,$AB$55=TRUE)),VLOOKUP($G$59,DIMENSIONAMENTO!$C$91:$Y$95,9,FALSE),IF(AND($B$15<>\"\",$G$6<>\"\",$C$6<>\"\",$T$6<>\"\",$F$10<>\"\",OR($F$10=\"4 ou mais\",F$10=\"3 ou mais\",,AND(B60>38,F10>=2))),\"LIG. COLETIVA\",IF(E59=\"M.T\",\"M.T\",\"FALTANDO DADOS\"))))))","v":"FALTANDO DADOS"},null,null,null,null,null,null,null,null,null,null,null,null,"GED 13","NTCD04"]
[null,{"$f":"IF(AND($AB$20=2,$B$15<>\"\",$G$6<>\"\",$C$6<>\"\",$T$6<>\"\",$F$10<>\"\",$F$10<=3,OR($AA$55=TRUE,$AA$54=TRUE),OR($AB$54=TRUE,$AB$55=TRUE)),(((LARGE(D52:D53,1))+E53+F53+I53+L53+N53+P53+R53+U53)/1000),IF(AND($AB$20=2,$B$15<>\"\",$G$6<>\"\",$C$6<>\"\",$T$6<>\"\",$F$10<>\"\",$F$10=\"4 ou mais\"),\"LIG. COLETIVA\",IF(AND($AB$20=1,$B$15<>\"\",$G$6<>\"\",$C$6<>\"\",$T$6<>\"\",F10<>\"\",$F$10<=2,OR($AA$55=TRUE,$AA$54=TRUE),OR($AB$54=TRUE,$AB$55=TRUE)),(((LARGE(D52:D53,1))+E53+F53+I53+L53+N53+P53+R53+U53)/1000),IF(AND($AB$20=1,$B$15<>\"\",$G$6<>\"\",$C$6<>\"\",$T$6<>\"\",$F$10<>\"\",F10=\"3 ou mais\"),\"LIG. COLETIVA\",\"FALTANDO DADOS\"))))","v":"FALTANDO DADOS"},null,null,null,null,null,null,null,"RAMAL DE LIGAÇÃO",null,null,null,{"$f":"IF(AND($AB$15=0,$B$15<>\"\",$R$2<>\"\",$C$6<>\"\",$G$6<>\"\",$T$6<>\"\",$F$10<>\"\",$E$64<>\"\",$E$59<>\"\",$E$59<>\"M.T\",$G$59<>\"\",$G$59<>\"M.T\",$F$10<=3,$AB$20=2,OR($AA$54=TRUE,$AA$55=TRUE),OR($AB$54=TRUE,$AB$55=TRUE)),VLOOKUP($G$59,DIMENSIONAMENTO!$C$5:$R$14,16,FALSE),IF(AND($AB$15=1,$B$15<>\"\",$R$2<>\"\",$C$6<>\"\",$G$6<>\"\",$T$6<>\"\",$F$10<>\"\",$E$64<>\"\",$E$59<>\"\",$E$59<>\"M.T\",$G$59<>\"\",$G$59<>\"M.T\",$F$10<=3,$AB$20=2,OR($AA$54=TRUE,$AA$55=TRUE),OR($AB$54=TRUE,$AB$55=TRUE)),VLOOKUP($G$59,DIMENSIONAMENTO!$C$23:$R$30,16,FALSE),IF(AND($AB$15=0,DIMENSIONAMENTO!AV83<=DIMENSIONAMENTO!AD82,$B$15<>\"\",$R$2<>\"\",$C$6<>\"\",$G$6<>\"\",$T$6<>\"\",$F$10<>\"\",$E$64<>\"\",$E$59<>\"\",$E$59<>\"M.T\",$F$10<=2,$G$59<>\"\",$G$59<>\"M.T\",$AB$20=1,OR($AA$54=TRUE,$AA$55=TRUE),OR($AB$54=TRUE,$AB$55=TRUE)),VLOOKUP($G$59,DIMENSIONAMENTO!$C$81:$Z$90,24,FALSE),IF(AND(OR($AB$15=1,DIMENSIONAMENTO!AV83>DIMENSIONAMENTO!AD82),$B$15<>\"\",$R$2<>\"\",$C$6<>\"\",$G$6<>\"\",$T$6<>\"\",$F$10<>\"\",$E$64<>\"\",$E$59<>\"\",$E$59<>\"M.T\",$F$10<=2,$G$59<>\"\",$G$59<>\"M.T\",$AB$20=1,OR($AA$54=TRUE,$AA$55=TRUE),OR($AB$54=TRUE,$AB$55=TRUE)),VLOOKUP($G$59,DIMENSIONAMENTO!$C$91:$Z$95,24,FALSE),IF(AND($B$15<>\"\",$G$6<>\"\",$C$6<>\"\",$T$6<>\"\",$F$10<>\"\",OR($F$10=\"4 ou mais\",$F$10=\"3 ou mais\",,AND(B60>38,F10>=2))),\"LIG. COLETIVA\",IF(E59=\"M.T\",\"M.T\",\"FALTANDO DADOS\"))))))","v":"FALTANDO DADOS"},null,null,"CONDUTOR DE ATERRAMENTO:",null,null,null,null,null,null,null,null,"MONOFÁSICOS","127 MONOFÁSICO","115 OU 127 MONOFÁSICO"," "]
[null,"DEMANDA CALCULADA(KVA):",null,null,null,null,null,null,null,"ELETRODUTO ATERRAMENTO",null,null,null,{"$f":"IF(AND($AB$15=0,$B$15<>\"\",$R$2<>\"\",$C$6<>\"\",$G$6<>\"\",$T$6<>\"\",$F$10<>\"\",$E$64<>\"\",$E$59<>\"\",$E$59<>\"M.T\",$F$10<=3,$G$59<>\"\",$G$59<>\"M.T\",$AB$20=2,OR($AA$54=TRUE,$AA$55=TRUE),OR($AB$54=TRUE,$AB$55=TRUE)),VLOOKUP($G$59,DIMENSIONAMENTO!$C$5:$R$14,12,FALSE),IF(AND($AB$15=1,$B$15<>\"\",$R$2<>\"\",$C$6<>\"\",$G$6<>\"\",$T$6<>\"\",$F$10<>\"\",$E$64<>\"\",$E$59<>\"\",$E$59<>\"M.T\",$F$10<=3,$G$59<>\"\",$G$59<>\"M.T\",$AB$20=2,OR($AA$54=TRUE,$AA$55=TRUE),OR($AB$54=TRUE,$AB$55=TRUE)),VLOOKUP($G$59,DIMENSIONAMENTO!$C$23:$R$30,12,FALSE),IF(AND($AB$15=0,DIMENSIONAMENTO!AV83<=DIMENSIONAMENTO!AD82,$B$15<>\"\",$R$2<>\"\",$C$6<>\"\",$G$6<>\"\",$T$6<>\"\",$F$10<>\"\",$E$64<>\"\",$E$59<>\"\",$E$59<>\"M.T\",$F$10<=2,$G$59<>\"\",$G$59<>\"\",$AB$20=1,OR($AA$54=TRUE,$AA$55=TRUE),OR($AB$54=TRUE,$AB$55=TRUE)),VLOOKUP($G$59,DIMENSIONAMENTO!$C$81:$Y$90,16,FALSE),IF(AND(OR($AB$15=1,DIMENSIONAMENTO!AV83>DIMENSIONAMENTO!AD82),$B$15<>\"\",$R$2<>\"\",$C$6<>\"\",$G$6<>\"\",$T$6<>\"\",$F$10<>\"\",$E$64<>\"\",$E$59<>\"\",$E$59<>\"M.T\",$F$10<=3,$G$59<>\"\",$G$59<>\"\",$AB$20=1,OR($AA$54=TRUE,$AA$55=TRUE),OR($AB$54=TRUE,$AB$55=TRUE)),VLOOKUP($G$59,DIMENSIONAMENTO!$C$91:$Y$95,16,FALSE),IF(AND($B$15<>\"\",$G$6<>\"\",$C$6<>\"\",$T$6<>\"\",$F$10<>\"\",OR($F$10=\"4 ou mais\",$F$10=\"3 ou mais\",,AND(B60>38,F10>=2))),\"LIG. COLETIVA\",IF(E59=\"M.T\",\"M.T\",\"FALTANDO DADOS\"))))))","v":"FALTANDO DADOS"},null,null,{"$f":"IF(AND($AB$15=0,$B$15<>\"\",$R$2<>\"\",$C$6<>\"\",$G$6<>\"\",$T$6<>\"\",$F$10<>\"\",$E$64<>\"\",$E$59<>\"\",$E$59<>\"M.T\",$F$10<=3,$G$59<>\"\",$G$59<>\"M.T\",$AB$20=2,OR($AA$54=TRUE,$AA$55=TRUE),OR($AB$54=TRUE,$AB$55=TRUE)),VLOOKUP($G$59,DIMENSIONAMENTO!$C$5:$R$14,11,FALSE),IF(AND($AB$15=1,$B$15<>\"\",$R$2<>\"\",$C$6<>\"\",$G$6<>\"\",$T$6<>\"\",$F$10<>\"\",$E$64<>\"\",$E$59<>\"\",$E$59<>\"M.T\",$F$10<=3,$G$59<>\"\",$G$59<>\"M.T\",$AB$20=2,OR($AA$54=TRUE,$AA$55=TRUE),OR($AB$54=TRUE,$AB$55=TRUE)),VLOOKUP($G$59,DIMENSIONAMENTO!$C$23:$R$30,11,FALSE),IF(AND($AB$15=0,DIMENSIONAMENTO!AV83<=DIMENSIONAMENTO!AD82,$B$15<>\"\",$R$2<>\"\",$C$6<>\"\",$G$6<>\"\",$T$6<>\"\",$F$10<>\"\",$E$64<>\"\",$E$59<>\"\",$E$59<>\"M.T\",$F$10<=2,$G$59<>\"\",$G$59<>\"\",$AB$20=1,OR($AA$54=TRUE,$AA$55=TRUE),OR($AB$54=TRUE,$AB$55=TRUE)),VLOOKUP($G$59,DIMENSIONAMENTO!$C$81:$Y$90,15,FALSE),IF(AND(OR($AB$15=1,DIMENSIONAMENTO!AV83>DIMENSIONAMENTO!AD82),$B$15<>\"\",$R$2<>\"\",$C$6<>\"\",$G$6<>\"\",$T$6<>\"\",$F$10<>\"\",$E$64<>\"\",$E$59<>\"\",$E$59<>\"M.T\",$F$10<=2,$G$59<>\"\",$G$59<>\"\",$AB$20=1,OR($AA$54=TRUE,$AA$55=TRUE),OR($AB$54=TRUE,$AB$55=TRUE)),VLOOKUP($G$59,DIMENSIONAMENTO!$C$91:$Y$95,15,FALSE),IF(AND($B$15<>\"\",$G$6<>\"\",$C$6<>\"\",$T$6<>\"\",$F$10<>\"\",OR($F$10=\"4 ou mais\",$F$10=\"3 ou mais\",AND(B60>38,F10>=2))),\"LIG. COLETIVA\",IF(E59=\"M.T\",\"M.T\",\"FALTANDO DADOS\"))))))","v":"FALTANDO DADOS"},null,null,null,null,null,null,null,null,null,"220 MONOFÁSICO","127 MONOFÁSICO"," "]
[null,{"$f":"IF(AND(B15<>\"\",$G$6>0,$C$6<>\"\",$T$6<>\"\",F10<>\"\",F10<=3,$AB$20=2,OR($AA$55=TRUE,$AA$54=TRUE),OR($AB$54=TRUE,$AB$55=TRUE),OR(B60>=25,DIMENSIONAMENTO!AL9>0)),((D55+E55+F55+I55+L55+N55+P55+R55+U55)/1000),IF(AND(B15<>\"\",$G$6<>\"\",$C$6<>\"\",$T$6<>\"\",F10<>\"\",F10=\"4 ou mais\",$AB$20=2,OR($AA$55=TRUE,$AA$54=TRUE),OR($AB$54=TRUE,$AB$55=TRUE)),\"LIG. COLETIVA\",IF(AND(B15<>\"\",$G$6>0,$C$6<>\"\",$T$6<>\"\",F10<>\"\",F10<=3,$AB$20=2,OR($AA$55=TRUE,$AA$54=TRUE),OR($AB$54=TRUE,$AB$55=TRUE)),\"\",IF(AND(B15<>\"\",$G$6>0,$C$6<>\"\",$T$6<>\"\",F10<>\"\",F10<=2,$AB$20=1,OR($AA$55=TRUE,$AA$54=TRUE),OR($AB$54=TRUE,$AB$55=TRUE),OR(B60>=18,DIMENSIONAMENTO!AS86>0)),((D55+E55+F55+I55+L55+N55+P55+R55+U55)/1000),IF(AND(B15<>\"\",$G$6<>\"\",$C$6<>\"\",$T$6<>\"\",F10<>\"\",F10=\"3 ou mais\",$AB$20=1),\"LIG. COLETIVA\",IF(AND(B15<>\"\",$G$6>0,$C$6<>\"\",$T$6<>\"\",F10<>\"\",F10<=2,$AB$20=1,OR($AA$55=TRUE,$AA$54=TRUE),OR($AB$54=TRUE,$AB$55=TRUE)),0,\"FALTANDO DADOS\"))))))","v":"FALTANDO DADOS"},null,null,null,null,null,null,null,"* ELETRODUTO DE PVC ou AÇO",null,null,null,{"$f":"IF(AND($AB$15=0,$B$15<>\"\",$R$2<>\"\",$C$6<>\"\",$G$6<>\"\",$T$6<>\"\",$F$10<>\"\",$E$64<>\"\",$E$59<>\"\",$E$59<>\"M.T\",$F$10<=3,$G$59<>\"\",$G$59<>\"M.T\",$AB$20=2,OR($AA$54=TRUE,$AA$55=TRUE),OR($AB$54=TRUE,$AB$55=TRUE)),VLOOKUP($G$59,DIMENSIONAMENTO!$C$5:$R$14,10,FALSE),IF(AND($AB$15=1,$B$15<>\"\",$R$2<>\"\",$C$6<>\"\",$G$6<>\"\",$T$6<>\"\",$F$10<>\"\",$E$64<>\"\",$E$59<>\"\",$E$59<>\"M.T\",$F$10<=3,$G$59<>\"\",$G$59<>\"M.T\",$AB$20=2,OR($AA$54=TRUE,$AA$55=TRUE),OR($AB$54=TRUE,$AB$55=TRUE)),VLOOKUP($G$59,DIMENSIONAMENTO!$C$23:$R$30,10,FALSE),IF(AND($AB$15=0,DIMENSIONAMENTO!AV83<=DIMENSIONAMENTO!AD82,$B$15<>\"\",$R$2<>\"\",$C$6<>\"\",$G$6<>\"\",$T$6<>\"\",$F$10<>\"\",$E$64<>\"\",$E$59<>\"\",$E$59<>\"M.T\",$F$10<=2,$G$59<>\"\",$G$59<>\"\",$AB$20=1,OR($AA$54=TRUE,$AA$55=TRUE),OR($AB$54=TRUE,$AB$55=TRUE)),VLOOKUP($G$59,DIMENSIONAMENTO!$C$81:$Y$90,11,FALSE),IF(AND(OR($AB$15=1,DIMENSIONAMENTO!AV83>DIMENSIONAMENTO!AD82),$B$15<>\"\",$R$2<>\"\",$C$6<>\"\",$G$6<>\"\",$T$6<>\"\",$F$10<>\"\",$E$64<>\"\",$E$59<>\"\",$E$59<>\"M.T\",$F$10<=2,$G$59<>\"\",$G$59<>\"\",$AB$20=1,OR($AA$54=TRUE,$AA$55=TRUE),OR($AB$54=TRUE,$AB$55=TRUE)),VLOOKUP($G$59,DIMENSIONAMENTO!$C$91:$Y$95,11,FALSE),IF(AND($B$15<>\"\",$G$6<>\"\",$C$6<>\"\",$T$6<>\"\",$F$10<>\"\",OR($F$10=\"4 ou mais\",$F$10=\"3 ou mais\",,AND(B60>38,F10>=2))),\"LIG. COLETIVA\",IF(E59=\"M.T\",\"M.T\",\"FALTANDO DADOS\"))))))","v":"FALTANDO DADOS"},null,null,null,null,null,null,null,null,null,null,null,"TRIFÁSICOS","127/220 (BIFÁSICO OU TRIFÁSICO)","127/220 OU 115/230 (BIFÁSICO OU TRIFÁSICO)"," "]
[null,null,null,null,null,null,null,null,null,null,null,null,null,null,null,null,null,null,null,null,null,null,null,null,null,null,null,null," "]
[null,"ANCORAGEM-RAMAL DE LIGAÇÃO",null,null,"POSTE PADRÃO C/ CAIXA",null,null,null,null,null,null,{"$f":"IF(AND($C$6<>\"\",$R$2<>\"\",$AB$20=2,$E$64<>\"\",F10<>\"\",OR($AA$54=TRUE,$AA$55=TRUE),OR($AB$54=TRUE,$AB$55=TRUE),E59<>\"M.T\"),DIMENSIONAMENTO!AV2&\" \"&DIMENSIONAMENTO!AV26,IF(AND($C$6<>\"\",$R$2<>\"\",$AB$20=1,G59<>\"\",$E$64<>\"\",F10<>\"\",OR($AA$54=TRUE,$AA$55=TRUE),OR($AB$54=TRUE,$AB$55=TRUE),E59<>\"M.T\"),DIMENSIONAMENTO!BC78&\" \"&DIMENSIONAMENTO!BC92,\"\"))","v":""},null,null,null,null,null,null,null,null,null,null,null,null,null,null,"220/380 (BIFÁSICO OU TRIFÁSICO)","115/230 (BIFÁSICO OU TRIFÁSICO)"," "]
[null,null,null,null,null,null,null,null,null,null,null,null,null,null,null,null,null,null,null,null,null,null,null,null,null,null," "]
[null,"INFORMAÇÕES INERENTES AO CÁLCULO DE DEMANDA REALIZADO:"]
[null,"TABELA APLICADA:",null,null,null,{"$f":"IF(G59=\"M.T\",\"VERIFICAR NORMAS PARA LIGAÇÃO NA MÉDIA TENSÃO\",IF(AND(E64<>\"\",G59<>\"\",B15<>\"\",F10<=2),DIMENSIONAMENTO!M44,IF(AND(E64<>\"\",G59<>\"\",B15<>\"\",F10=3,B60<=12),DIMENSIONAMENTO!M44,IF(AND(B60<>\"\",B60=\"LIG. COLETIVA\"),\"CONSULTAR NORMAS PARA LIGAÇÃO COLETIVA OU AGRUPADA\",IF(OR(G59=\"\",E64=\"\"),\"FALTANDO DADOS\",)))))","v":"FALTANDO DADOS"},null,null,null,null,null,null,null,null,null,null,null,null,null,null,null,null,null,null,null,null," ","220/380 (BIFÁSICO OU TRIFÁSICO)"," "]
[null,"RESPONSABILIDADE TÉCNICA ELÉTRICA:",null,null,null,{"$f":"IF(AND(OR(G59=\"\",E64=\"\"),B60<>\"LIG. COLETIVA\"),\"FALTANDO DADOS\",IF(G59=\"M.T\",\"VERIFICAR NORMAS PARA LIGAÇÃO NA MÉDIA TENSÃO\",IF(AND(G59<>\"\",E64<>\"\",AB20=1,F10<=2),DIMENSIONAMENTO!J49,IF(AND(G59<>\"\",E64<>\"\",AB20=2,F10<=2),DIMENSIONAMENTO!M49,IF(AND(G59<>\"\",E64<>\"\",AB20=2,F10=3,B60<=12),DIMENSIONAMENTO!M49,IF(OR(G59<>\"\",E64<>\"\",B60>12,F10=3,B60=\"LIG. COLETIVA\"),\"CONSULTAR NORMAS PARA LIGAÇÃO COLETIVA OU AGRUPADA\",\"\"))))))","v":"FALTANDO DADOS"}]
[null,"RESPONSABILIDADE TÉCNICA CIVIL:",null,null,null,{"$f":"IF(AND(OR(G59=\"\",E64=\"\"),B60<>\"LIG. COLETIVA\"),\"FALTANDO DADOS\",IF(G59=\"M.T\",\"VERIFICAR NORMAS PARA LIGAÇÃO NA MÉDIA TENSÃO\",IF(AND(G59<>\"\",E64<>\"\",AB20=1,F10<=2),DIMENSIONAMENTO!G53,IF(AND(G59<>\"\",E64<>\"\",AB20=2,F10<=2),DIMENSIONAMENTO!K53,IF(AND(G59<>\"\",E64<>\"\",AB20=2,F10=3,B60<=12),DIMENSIONAMENTO!K53,IF(OR(G59<>\"\",E64<>\"\",B60>12,F10=3,B60=\"LIG. COLETIVA\"),\"CONSULTAR NORMAS PARA LIGAÇÃO COLETIVA OU AGRUPADA\",\"\"))))))","v":"FALTANDO DADOS"},null,null,null,null,null,null,null,null,null,null,null,null,null,null,null,null,null,null,null,null,null,null,null," "]
[null,"RELATIVO AO NÚMERO DE LIGAÇÕES OBSERVAR:",null,null,null,{"$f":"IF(AND(OR(G59=\"\",E64=\"\"),B60<>\"LIG. COLETIVA\"),\"FALTANDO DADOS\",IF(G59=\"M.T\",\"VERIFICAR NORMAS PARA LIGAÇÃO NA MÉDIA TENSÃO\",IF(AND(F10<>\"\",F10<=2,C6<>\"\",G6<>\"\",OR(B60<>\"FALTANDO DADOS\",AB10<>\"M.T\"),G59<>\"\",E64<>\"\"),Z91&\" \"&Z93&\" \"&Z95,IF(AND(AB20=2,F10<>\"\",F10=3,B60<=12,C6<>\"\",G6<>\"\",OR(B60<>\"FALTANDO DADOS\",AB10<>\"M.T\"),G59<>\"\",E64<>\"\"),Z91&\" \"&Z93&\" \"&Z95,IF(AND(OR(F10<>\"\",F10=3,B60>12),C6<>\"\",G6<>\"\",OR(B60<>\"FALTANDO DADOS\",AB10<>\"M.T\")),\"CONSULTAR NORMAS PARA LIGAÇÃO COLETIVA OU AGRUPADA\",\"\")))))","v":"FALTANDO DADOS"},null,null,null,null,null,null,null,null,null,null,null,null,null,null,null,null,null,null,null,null,"CPFL","CERIM",null," "]
[null,null,null,null,null,null,null,null,null,null,null,null,null,null,null,null,null,null,null,null,null,null,null,null,null," ",{"$f":"IF(AND($F$10=1,$AB$15=0,$AB$20=2,$C$6<>\"\",OR($AA$54=TRUE,$AA$55=TRUE),OR($AB$54=TRUE,$AB$55=TRUE)),TABELAS!$E57,IF(AND($F$10=2,$AB$15=0,$AB$20=2,$C$6<>\"\",OR($AA$54=TRUE,$AA$55=TRUE),OR($AB$54=TRUE,$AB$55=TRUE)),TABELAS!$E57,IF(AND($F$10=3,$AB$15=0,$AB$20=2,$C$6<>\"\",OR($AA$54=TRUE,$AA$55=TRUE),OR($AB$54=TRUE,$AB$55=TRUE)),TABELAS!$E57,IF(AND($F$10=1,$AB$15=1,$AB$20=2,$C$6<>\"\",OR($AA$54=TRUE,$AA$55=TRUE),OR($AB$54=TRUE,$AB$55=TRUE)),TABELAS!$G57,IF(AND($F$10=2,$AB$15=1,$AB$20=2,$C$6<>\"\",OR($AA$54=TRUE,$AA$55=TRUE),OR($AB$54=TRUE,$AB$55=TRUE)),TABELAS!$G57,IF(AND($F$10=3,$AB$15=1,$AB$20=2,$C$6<>\"\",OR($AA$54=TRUE,$AA$55=TRUE),OR($AB$54=TRUE,$AB$55=TRUE)),TABELAS!$G57,\"\"))))))","v":""},{"$f":"IF(AND($F$10=1,$AB$15=0,$AB$20=1,$C$6<>\"\",OR($AA$54=TRUE,$AA$55=TRUE),OR($AB$54=TRUE,$AB$55=TRUE)),TABELAS!$I57,IF(AND($F$10=2,$AB$15=0,$AB$20=1,$C$6<>\"\",OR($AA$54=TRUE,$AA$55=TRUE),OR($AB$54=TRUE,$AB$55=TRUE)),TABELAS!$I57,IF(AND($F$10=1,$AB$15=1,$AB$20=1,$C$6<>\"\",OR($AA$54=TRUE,$AA$55=TRUE),OR($AB$54=TRUE,$AB$55=TRUE)),TABELAS!$K57,IF(AND($F$10=2,$AB$15=1,$AB$20=1,$C$6<>\"\",OR($AA$54=TRUE,$AA$55=TRUE),OR($AB$54=TRUE,$AB$55=TRUE)),TABELAS!$K57,\"\"))))","v":""}," "," "]
[null,null,null,null,null,null,null,null,null,null,null,null,null,null,null,null,null,null,null,null,null,null,null,null,null," ",{"$f":"IF(AND($F$10=1,$AB$15=0,$AB$20=2,$C$6<>\"\",OR($AA$54=TRUE,$AA$55=TRUE),OR($AB$54=TRUE,$AB$55=TRUE)),TABELAS!$E58,IF(AND($F$10=2,$AB$15=0,$AB$20=2,$C$6<>\"\",OR($AA$54=TRUE,$AA$55=TRUE),OR($AB$54=TRUE,$AB$55=TRUE)),TABELAS!$E58,IF(AND($F$10=3,$AB$15=0,$AB$20=2,$C$6<>\"\",OR($AA$54=TRUE,$AA$55=TRUE),OR($AB$54=TRUE,$AB$55=TRUE)),TABELAS!$E58,IF(AND($F$10=1,$AB$15=1,$AB$20=2,$C$6<>\"\",OR($AA$54=TRUE,$AA$55=TRUE),OR($AB$54=TRUE,$AB$55=TRUE)),TABELAS!$G58,IF(AND($F$10=2,$AB$15=1,$AB$20=2,$C$6<>\"\",OR($AA$54=TRUE,$AA$55=TRUE),OR($AB$54=TRUE,$AB$55=TRUE)),TABELAS!$G58,IF(AND($F$10=3,$AB$15=1,$AB$20=2,$C$6<>\"\",OR($AA$54=TRUE,$AA$55=TRUE),OR($AB$54=TRUE,$AB$55=TRUE)),TABELAS!$G58,\"\"))))))","v":""},{"$f":"IF(AND($F$10=1,$AB$15=0,$AB$20=1,$C$6<>\"\",OR($AA$54=TRUE,$AA$55=TRUE),OR($AB$54=TRUE,$AB$55=TRUE)),TABELAS!$I58,IF(AND($F$10=2,$AB$15=0,$AB$20=1,$C$6<>\"\",OR($AA$54=TRUE,$AA$55=TRUE),OR($AB$54=TRUE,$AB$55=TRUE)),TABELAS!$I58,IF(AND($F$10=1,$AB$15=1,$AB$20=1,$C$6<>\"\",OR($AA$54=TRUE,$AA$55=TRUE),OR($AB$54=TRUE,$AB$55=TRUE)),TABELAS!$K58,IF(AND($F$10=2,$AB$15=1,$AB$20=1,$C$6<>\"\",OR($AA$54=TRUE,$AA$55=TRUE),OR($AB$54=TRUE,$AB$55=TRUE)),TABELAS!$K58,\"\"))))","v":""}," "]
[null,null,null,null,null,null,null,null,null,null,null,null,null,null,null,null,null,null,null,null,null,null,null,null,null," ",{"$f":"IF(AND(TABELAS!F59>=AA83,$F$10=1,$AB$15=0,$AB$20=2,$C$6<>\"\",OR($AA$54=TRUE,$AA$55=TRUE),OR($AB$54=TRUE,$AB$55=TRUE)),TABELAS!$E59,IF(AND(TABELAS!F59>=AA83,$F$10=2,$AB$15=0,$AB$20=2,$C$6<>\"\",OR($AA$54=TRUE,$AA$55=TRUE),OR($AB$54=TRUE,$AB$55=TRUE)),TABELAS!$E59,IF(AND(TABELAS!F59>=AA83,$F$10=3,$AB$15=0,$AB$20=2,$C$6<>\"\",OR($AA$54=TRUE,$AA$55=TRUE),OR($AB$54=TRUE,$AB$55=TRUE)),TABELAS!$E59,IF(AND(TABELAS!H59>=AA83,$F$10=1,$AB$15=1,$AB$20=2,$C$6<>\"\",OR($AA$54=TRUE,$AA$55=TRUE),OR($AB$54=TRUE,$AB$55=TRUE)),TABELAS!$G59,IF(AND(TABELAS!H59>=AA83,$F$10=2,$AB$15=1,$AB$20=2,$C$6<>\"\",OR($AA$54=TRUE,$AA$55=TRUE),OR($AB$54=TRUE,$AB$55=TRUE)),TABELAS!$G59,IF(AND(TABELAS!H59>=AA83,$F$10=3,$AB$15=1,$AB$20=2,$C$6<>\"\",OR($AA$54=TRUE,$AA$55=TRUE),OR($AB$54=TRUE,$AB$55=TRUE)),TABELAS!$G59,\"\"))))))","v":""},{"$f":"IF(E59<>\"M.T\",IF(AND(TABELAS!J59>=AB83,$F$10=1,$AB$15=0,$AB$20=1,$C$6<>\"\",OR($AA$54=TRUE,$AA$55=TRUE),OR($AB$54=TRUE,$AB$55=TRUE)),TABELAS!$I59,IF(AND(TABELAS!J59>=AB83,$F$10=2,$AB$15=0,$AB$20=1,$C$6<>\"\",OR($AA$54=TRUE,$AA$55=TRUE),OR($AB$54=TRUE,$AB$55=TRUE)),TABELAS!$I59,IF(AND($F$10=1,$AB$15=1,$AB$20=1,$C$6<>\"\",OR($AA$54=TRUE,$AA$55=TRUE),OR($AB$54=TRUE,$AB$55=TRUE),TABELAS!L59>=AB83),TABELAS!$K59,IF(AND($F$10=2,$AB$15=1,$AB$20=1,$C$6<>\"\",OR($AA$54=TRUE,$AA$55=TRUE),OR($AB$54=TRUE,$AB$55=TRUE),TABELAS!L59>=AB83),TABELAS!$K59,\"\")))),\"\")","v":""}," "]
[null,null,null,null,null,null,null,null,null,null,null,null,null,null,null,null,null,null,null,null,null,null,null,null,null," ",{"$f":"IF(AND(TABELAS!F60>=AA83,$F$10=1,$AB$15=0,$AB$20=2,$C$6<>\"\",OR($AA$54=TRUE,$AA$55=TRUE),OR($AB$54=TRUE,$AB$55=TRUE)),TABELAS!$E60,IF(AND(TABELAS!F60>=AA83,$F$10=2,$AB$15=0,$AB$20=2,$C$6<>\"\",OR($AA$54=TRUE,$AA$55=TRUE),OR($AB$54=TRUE,$AB$55=TRUE)),TABELAS!$E60,IF(AND(TABELAS!F60>=AA83,$F$10=3,$AB$15=0,$AB$20=2,$C$6<>\"\",OR($AA$54=TRUE,$AA$55=TRUE),OR($AB$54=TRUE,$AB$55=TRUE)),TABELAS!$E60,IF(AND($F$10=1,$AB$15=1,$AB$20=2,$C$6<>\"\",OR($AA$54=TRUE,$AA$55=TRUE),OR($AB$54=TRUE,$AB$55=TRUE),TABELAS!H60>=AA83),TABELAS!$G60,IF(AND($F$10=2,$AB$15=1,$AB$20=2,$C$6<>\"\",OR($AA$54=TRUE,$AA$55=TRUE),OR($AB$54=TRUE,$AB$55=TRUE),TABELAS!H60>=AA83),TABELAS!$G60,IF(AND($F$10=3,$AB$15=1,$AB$20=2,$C$6<>\"\",OR($AA$54=TRUE,$AA$55=TRUE),OR($AB$54=TRUE,$AB$55=TRUE),TABELAS!H60>=AA83),TABELAS!$G60,\"\"))))))","v":""},{"$f":"IF(E59<>\"M.T\",IF(AND(TABELAS!J60>=AB83,$F$10=1,$AB$15=0,$AB$20=1,$C$6<>\"\",OR($AA$54=TRUE,$AA$55=TRUE),OR($AB$54=TRUE,$AB$55=TRUE)),TABELAS!$I60,IF(AND(TABELAS!J60>=AB83,$F$10=2,$AB$15=0,$AB$20=1,$C$6<>\"\",OR($AA$54=TRUE,$AA$55=TRUE),OR($AB$54=TRUE,$AB$55=TRUE)),TABELAS!$I60,IF(AND($F$10=1,$AB$15=1,$AB$20=1,$C$6<>\"\",OR($AA$54=TRUE,$AA$55=TRUE),OR($AB$54=TRUE,$AB$55=TRUE),TABELAS!L60>=AB83),TABELAS!$K60,IF(AND($F$10=2,$AB$15=1,$AB$20=1,$C$6<>\"\",OR($AA$54=TRUE,$AA$55=TRUE),OR($AB$54=TRUE,$AB$55=TRUE),TABELAS!L60>=AB83),TABELAS!$K60,\"\")))),\"\")","v":""}," "]
[null,null,null,null,null,"ASSINATURA DO RESPONSÁVEL",null,null,null,null,null,null,null,null,null,null,null,null,null,null,null,null,null,null,null," ",{"$f":"IF(AND(TABELAS!F61>=AA83,$F$10=1,$AB$15=0,$AB$20=2,$C$6<>\"\",OR($AA$54=TRUE,$AA$55=TRUE),OR($AB$54=TRUE,$AB$55=TRUE)),TABELAS!$E61,IF(AND(TABELAS!F61>=AA83,$F$10=2,$AB$15=0,$AB$20=2,$C$6<>\"\",OR($AA$54=TRUE,$AA$55=TRUE),OR($AB$54=TRUE,$AB$55=TRUE)),TABELAS!$E61,IF(AND(TABELAS!F61>=AA83,$F$10=3,$AB$15=0,$AB$20=2,$C$6<>\"\",OR($AA$54=TRUE,$AA$55=TRUE),OR($AB$54=TRUE,$AB$55=TRUE)),\"\",IF(AND($F$10=1,$AB$15=1,$AB$20=2,$C$6<>\"\",OR($AA$54=TRUE,$AA$55=TRUE),OR($AB$54=TRUE,$AB$55=TRUE),TABELAS!H61>=AA83),TABELAS!$G61,IF(AND($F$10=2,$AB$15=1,$AB$20=2,$C$6<>\"\",OR($AA$54=TRUE,$AA$55=TRUE),OR($AB$54=TRUE,$AB$55=TRUE),TABELAS!H61>=AA83),TABELAS!$G61,IF(AND($F$10=3,$AB$15=1,$AB$20=2,$C$6<>\"\",OR($AA$54=TRUE,$AA$55=TRUE),OR($AB$54=TRUE,$AB$55=TRUE),TABELAS!H61>=AA83),\"\",\"\"))))))","v":""},{"$f":"IF(E59<>\"M.T\",IF(AND(TABELAS!J61>=AB83,$F$10=1,$AB$15=0,$AB$20=1,$C$6<>\"\",OR($AA$54=TRUE,$AA$55=TRUE),OR($AB$54=TRUE,$AB$55=TRUE)),TABELAS!$I61,IF(AND(TABELAS!J61>=AB83,$F$10=2,$AB$15=0,$AB$20=1,$C$6<>\"\",OR($AA$54=TRUE,$AA$55=TRUE),OR($AB$54=TRUE,$AB$55=TRUE)),TABELAS!$I61,IF(AND($F$10=1,$AB$15=1,$AB$20=1,$C$6<>\"\",OR($AA$54=TRUE,$AA$55=TRUE),OR($AB$54=TRUE,$AB$55=TRUE),TABELAS!L61>=AB83),TABELAS!$K61,IF(AND($F$10=2,$AB$15=1,$AB$20=1,$C$6<>\"\",OR($AA$54=TRUE,$AA$55=TRUE),OR($AB$54=TRUE,$AB$55=TRUE),TABELAS!L61>=AB83),TABELAS!$K61,\"\")))),\"\")","v":""}," "]
[null,null,null,null,null,null,null,null,null,null,null,null,null,null,null,null,null,null,null,null,null,null,null,null,null," ",{"$f":"IF(AND(TABELAS!F62>=AA83,$F$10=1,$AB$15=0,$AB$20=2,$C$6<>\"\",OR($AA$54=TRUE,$AA$55=TRUE),OR($AB$54=TRUE,$AB$55=TRUE)),TABELAS!$E62,IF(AND(TABELAS!F62>=AA83,$F$10=2,$AB$15=0,$AB$20=2,$C$6<>\"\",OR($AA$54=TRUE,$AA$55=TRUE),OR($AB$54=TRUE,$AB$55=TRUE)),TABELAS!$E62,IF(AND(TABELAS!F62>=AA83,$F$10=3,$AB$15=0,$AB$20=2,$C$6<>\"\",OR($AA$54=TRUE,$AA$55=TRUE),OR($AB$54=TRUE,$AB$55=TRUE)),\"\",IF(AND($F$10=1,$AB$15=1,$AB$20=2,$C$6<>\"\",OR($AA$54=TRUE,$AA$55=TRUE),OR($AB$54=TRUE,$AB$55=TRUE),TABELAS!H62>=AA83),TABELAS!$G62,IF(AND($F$10=2,$AB$15=1,$AB$20=2,$C$6<>\"\",OR($AA$54=TRUE,$AA$55=TRUE),OR($AB$54=TRUE,$AB$55=TRUE),TABELAS!H62>=AA83),TABELAS!$G62,IF(AND($F$10=3,$AB$15=1,$AB$20=2,$C$6<>\"\",OR($AA$54=TRUE,$AA$55=TRUE),OR($AB$54=TRUE,$AB$55=TRUE),TABELAS!H62>=AA83),\"\",\"\"))))))","v":""},{"$f":"IF(E59<>\"M.T\",IF(AND(TABELAS!F62>=AB83,$F$10=1,$AB$15=0,$AB$20=1,$C$6<>\"\",OR($AA$54=TRUE,$AA$55=TRUE),OR($AB$54=TRUE,$AB$55=TRUE)),TABELAS!$I62,IF(AND(TABELAS!F62>=AB83,$F$10=2,$AB$15=0,$AB$20=1,$C$6<>\"\",OR($AA$54=TRUE,$AA$55=TRUE),OR($AB$54=TRUE,$AB$55=TRUE)),TABELAS!$I62,IF(AND($F$10=1,$AB$15=1,$AB$20=1,$C$6<>\"\",OR($AA$54=TRUE,$AA$55=TRUE),OR($AB$54=TRUE,$AB$55=TRUE),TABELAS!H62>=AB83),TABELAS!$K62,IF(AND($F$10=2,$AB$15=1,$AB$20=1,$C$6<>\"\",OR($AA$54=TRUE,$AA$55=TRUE),OR($AB$54=TRUE,$AB$55=TRUE),TABELAS!H62>=AB83),TABELAS!$K62,\"\")))),\"\")","v":""}," "]
[null,null,null,null,null,null,null,null,null,null,null,null,null,null,null,null,null,null,null,null,null,null,null,null,null," ",{"$f":"IF(AND(TABELAS!F63>=AA83,$F$10=1,$AB$15=0,$AB$20=2,$C$6<>\"\",OR($AA$54=TRUE,$AA$55=TRUE),OR($AB$54=TRUE,$AB$55=TRUE)),TABELAS!$E63,IF(AND(TABELAS!F63>=AA83,$F$10=2,$AB$15=0,$AB$20=2,$C$6<>\"\",OR($AA$54=TRUE,$AA$55=TRUE),OR($AB$54=TRUE,$AB$55=TRUE)),TABELAS!$E63,IF(AND(TABELAS!F63>=AA83,$F$10=3,$AB$15=0,$AB$20=2,$C$6<>\"\",OR($AA$54=TRUE,$AA$55=TRUE),OR($AB$54=TRUE,$AB$55=TRUE)),\"\",IF(AND($F$10=1,$AB$15=1,$AB$20=2,$C$6<>\"\",OR($AA$54=TRUE,$AA$55=TRUE),OR($AB$54=TRUE,$AB$55=TRUE),TABELAS!H63>=AA83),TABELAS!$G63,IF(AND($F$10=2,$AB$15=1,$AB$20=2,$C$6<>\"\",OR($AA$54=TRUE,$AA$55=TRUE),OR($AB$54=TRUE,$AB$55=TRUE),TABELAS!H63>=AA83),TABELAS!$G63,IF(AND($F$10=3,$AB$15=1,$AB$20=2,$C$6<>\"\",OR($AA$54=TRUE,$AA$55=TRUE),OR($AB$54=TRUE,$AB$55=TRUE),TABELAS!H63>=AA83),\"\",\"\"))))))","v":""},{"$f":"IF(E59<>\"M.T\",IF(AND(TABELAS!F63>=AB83,$F$10=1,$AB$15=0,$AB$20=1,$C$6<>\"\",OR($AA$54=TRUE,$AA$55=TRUE),OR($AB$54=TRUE,$AB$55=TRUE)),TABELAS!$I63,IF(AND(TABELAS!F63>=AB83,$F$10=2,$AB$15=0,$AB$20=1,$C$6<>\"\",OR($AA$54=TRUE,$AA$55=TRUE),OR($AB$54=TRUE,$AB$55=TRUE)),TABELAS!$I63,IF(AND($F$10=1,$AB$15=1,$AB$20=1,$C$6<>\"\",OR($AA$54=TRUE,$AA$55=TRUE),OR($AB$54=TRUE,$AB$55=TRUE),TABELAS!H63>=AB83),TABELAS!$K63,IF(AND($F$10=2,$AB$15=1,$AB$20=1,$C$6<>\"\",OR($AA$54=TRUE,$AA$55=TRUE),OR($AB$54=TRUE,$AB$55=TRUE),TABELAS!H63>=AB83),\"\",\"\")))),\"\")","v":""}," "]
[null,{"$f":"IF(AND(OR(AB20=2,AB20=1),C6<>\"\",R2<>\"\",G59<>\"\",E64<>\"\"),\"Fique Ligado! A instalaçao do DPS (Dispositivo de Proteção Contra Surtos Atmosféricos) é obrigatória em todas as entradas de Energia Elétrica.\",\"\")","v":""},null,null,null,null,null,null,null,null,null,null,null,null,null,null,null,null,null,null,null,null,null,null,null," ",{"$f":"IF(AND(TABELAS!F64>=AA83,$F$10=1,$AB$15=0,$AB$20=2,$C$6<>\"\",OR($AA$54=TRUE,$AA$55=TRUE),OR($AB$54=TRUE,$AB$55=TRUE)),TABELAS!$E64,IF(AND(TABELAS!F64>=AA83,$F$10=2,$AB$15=0,$AB$20=2,$C$6<>\"\",OR($AA$54=TRUE,$AA$55=TRUE),OR($AB$54=TRUE,$AB$55=TRUE)),TABELAS!$E64,IF(AND(TABELAS!F64>=AA83,$F$10=3,$AB$15=0,$AB$20=2,$C$6<>\"\",OR($AA$54=TRUE,$AA$55=TRUE),OR($AB$54=TRUE,$AB$55=TRUE)),\"\",IF(AND($F$10=1,$AB$15=1,$AB$20=2,$C$6<>\"\",OR($AA$54=TRUE,$AA$55=TRUE),OR($AB$54=TRUE,$AB$55=TRUE),TABELAS!H64>=AA83),TABELAS!$G64,IF(AND($F$10=2,$AB$15=1,$AB$20=2,$C$6<>\"\",OR($AA$54=TRUE,$AA$55=TRUE),OR($AB$54=TRUE,$AB$55=TRUE),TABELAS!H64>=AA83),TABELAS!$G64,IF(AND($F$10=3,$AB$15=1,$AB$20=2,$C$6<>\"\",OR($AA$54=TRUE,$AA$55=TRUE),OR($AB$54=TRUE,$AB$55=TRUE),TABELAS!H64>=AA83),\"\",\"\"))))))","v":""},{"$f":"IF(E59<>\"M.T\",IF(AND(TABELAS!F64>=AB83,$F$10=1,$AB$15=0,$AB$20=1,$C$6<>\"\",OR($AA$54=TRUE,$AA$55=TRUE),OR($AB$54=TRUE,$AB$55=TRUE)),TABELAS!$I64,IF(AND(TABELAS!F64>=AB83,$F$10=2,$AB$15=0,$AB$20=1,$C$6<>\"\",OR($AA$54=TRUE,$AA$55=TRUE),OR($AB$54=TRUE,$AB$55=TRUE)),TABELAS!$I64,IF(AND($F$10=1,$AB$15=1,$AB$20=1,$C$6<>\"\",OR($AA$54=TRUE,$AA$55=TRUE),OR($AB$54=TRUE,$AB$55=TRUE),TABELAS!H64>=AB83),\"\",IF(AND($F$10=2,$AB$15=1,$AB$20=1,$C$6<>\"\",OR($AA$54=TRUE,$AA$55=TRUE),OR($AB$54=TRUE,$AB$55=TRUE),TABELAS!H64>=AB83),\"\",\"\")))),\"\")","v":""}," "]
[null,"O PRESENTE FORMULÁRIO CONSTITUI APENAS UMA FERRAMENTA DE CÁLCULO PARA AUXÍLIO DOS CONSUMIDORES NA SOLICITAÇÃO DO ATENDIMENTO",null,null,null,null,null,null,null,null,null,null,null,null,null,null,null,null,null,null,null,null,null,null,null," ",{"$f":"IF(AND(TABELAS!F65>=AA83,$F$10=1,$AB$15=0,$AB$20=2,$C$6<>\"\",OR($AA$54=TRUE,$AA$55=TRUE),OR($AB$54=TRUE,$AB$55=TRUE)),TABELAS!$E65,IF(AND(TABELAS!F65>=AA83,$F$10=2,$AB$15=0,$AB$20=2,$C$6<>\"\",OR($AA$54=TRUE,$AA$55=TRUE),OR($AB$54=TRUE,$AB$55=TRUE)),TABELAS!$E65,IF(AND(TABELAS!F65>=AA83,$F$10=3,$AB$15=0,$AB$20=2,$C$6<>\"\",OR($AA$54=TRUE,$AA$55=TRUE),OR($AB$54=TRUE,$AB$55=TRUE)),\"\",IF(AND($F$10=1,$AB$15=1,$AB$20=2,$C$6<>\"\",OR($AA$54=TRUE,$AA$55=TRUE),OR($AB$54=TRUE,$AB$55=TRUE),TABELAS!H65>=AA83),TABELAS!$G65,IF(AND($F$10=2,$AB$15=1,$AB$20=2,$C$6<>\"\",OR($AA$54=TRUE,$AA$55=TRUE),OR($AB$54=TRUE,$AB$55=TRUE),TABELAS!H65>=AA83),TABELAS!$G65,IF(AND($F$10=3,$AB$15=1,$AB$20=2,$C$6<>\"\",OR($AA$54=TRUE,$AA$55=TRUE),OR($AB$54=TRUE,$AB$55=TRUE),TABELAS!H65>=AA83),\"\",\"\"))))))","v":""},{"$f":"IF(E59<>\"M.T\",IF(AND(TABELAS!F65>=AB83,$F$10=1,$AB$15=0,$AB$20=1,$C$6<>\"\",OR($AA$54=TRUE,$AA$55=TRUE),OR($AB$54=TRUE,$AB$55=TRUE)),TABELAS!$I65,IF(AND(TABELAS!F65>=AB83,$F$10=2,$AB$15=0,$AB$20=1,$C$6<>\"\",OR($AA$54=TRUE,$AA$55=TRUE),OR($AB$54=TRUE,$AB$55=TRUE)),TABELAS!$I65,IF(AND($F$10=1,$AB$15=1,$AB$20=1,$C$6<>\"\",OR($AA$54=TRUE,$AA$55=TRUE),OR($AB$54=TRUE,$AB$55=TRUE),TABELAS!H65>=AB83),\"\",IF(AND($F$10=2,$AB$15=1,$AB$20=1,$C$6<>\"\",OR($AA$54=TRUE,$AA$55=TRUE),OR($AB$54=TRUE,$AB$55=TRUE),TABELAS!H65>=AB83),\"\",\"\")))),\"\")","v":""}," "]
[null,null,null,null,null,null,null,null,null,null,null,null,null,null,null,null,null,null,null,null,null,null,null,null,null," ",{"$f":"IF(AND(TABELAS!F66>=AA83,$F$10=1,$AB$15=0,$AB$20=2,$C$6<>\"\",OR($AA$54=TRUE,$AA$55=TRUE),OR($AB$54=TRUE,$AB$55=TRUE)),TABELAS!$E66,IF(AND(TABELAS!F66>=AA83,$F$10=2,$AB$15=0,$AB$20=2,$C$6<>\"\",OR($AA$54=TRUE,$AA$55=TRUE),OR($AB$54=TRUE,$AB$55=TRUE)),TABELAS!$E66,IF(AND(TABELAS!F66>=AA83,$F$10=3,$AB$15=0,$AB$20=2,$C$6<>\"\",OR($AA$54=TRUE,$AA$55=TRUE),OR($AB$54=TRUE,$AB$55=TRUE)),\"\",IF(AND($F$10=1,$AB$15=1,$AB$20=2,$C$6<>\"\",OR($AA$54=TRUE,$AA$55=TRUE),OR($AB$54=TRUE,$AB$55=TRUE),TABELAS!H66>=AA83),TABELAS!$G66,IF(AND($F$10=2,$AB$15=1,$AB$20=2,$C$6<>\"\",OR($AA$54=TRUE,$AA$55=TRUE),OR($AB$54=TRUE,$AB$55=TRUE),TABELAS!H66>=AA83),TABELAS!$G66,IF(AND($F$10=3,$AB$15=1,$AB$20=2,$C$6<>\"\",OR($AA$54=TRUE,$AA$55=TRUE),OR($AB$54=TRUE,$AB$55=TRUE),TABELAS!H66>=AA83),\"\",\"\"))))))","v":""},{"$f":"IF(E59<>\"M.T\",IF(AND(TABELAS!F66>=AB83,$F$10=1,$AB$15=0,$AB$20=1,$C$6<>\"\",OR($AA$54=TRUE,$AA$55=TRUE),OR($AB$54=TRUE,$AB$55=TRUE)),TABELAS!$I66,IF(AND(TABELAS!F66>=AB83,$F$10=2,$AB$15=0,$AB$20=1,$C$6<>\"\",OR($AA$54=TRUE,$AA$55=TRUE),OR($AB$54=TRUE,$AB$55=TRUE)),\"\",IF(AND($F$10=1,$AB$15=1,$AB$20=1,$C$6<>\"\",OR($AA$54=TRUE,$AA$55=TRUE),OR($AB$54=TRUE,$AB$55=TRUE),TABELAS!H66>=AB83),\"\",IF(AND($F$10=2,$AB$15=1,$AB$20=1,$C$6<>\"\",OR($AA$54=TRUE,$AA$55=TRUE),OR($AB$54=TRUE,$AB$55=TRUE),TABELAS!H66>=AB83),\"\",\"\")))),\"\")","v":""}," "]
[null,null,null,null,null,null,null,null,null,null,null,null,null,null,null,null,null,null,null,null,null,null,null,null,null," ",{"$f":"IF(AND(TABELAS!F67>=AA83,$F$10=1,$AB$15=0,$AB$20=2,$C$6<>\"\",OR($AA$54=TRUE,$AA$55=TRUE),OR($AB$54=TRUE,$AB$55=TRUE)),TABELAS!$E67,IF(AND(TABELAS!F67>=AA83,$F$10=2,$AB$15=0,$AB$20=2,$C$6<>\"\",OR($AA$54=TRUE,$AA$55=TRUE),OR($AB$54=TRUE,$AB$55=TRUE)),TABELAS!$E67,IF(AND(TABELAS!F67>=AA83,$F$10=3,$AB$15=0,$AB$20=2,$C$6<>\"\",OR($AA$54=TRUE,$AA$55=TRUE),OR($AB$54=TRUE,$AB$55=TRUE)),\"\",IF(AND($F$10=1,$AB$15=1,$AB$20=2,$C$6<>\"\",OR($AA$54=TRUE,$AA$55=TRUE),OR($AB$54=TRUE,$AB$55=TRUE),TABELAS!H67>=AA83),TABELAS!$G67,IF(AND($F$10=2,$AB$15=1,$AB$20=2,$C$6<>\"\",OR($AA$54=TRUE,$AA$55=TRUE),OR($AB$54=TRUE,$AB$55=TRUE),TABELAS!H67>=AA83),TABELAS!$G67,IF(AND($F$10=3,$AB$15=1,$AB$20=2,$C$6<>\"\",OR($AA$54=TRUE,$AA$55=TRUE),OR($AB$54=TRUE,$AB$55=TRUE),TABELAS!H67>=AA83),\"\",\"\"))))))","v":""},{"$f":"IF(E59<>\"M.T\",IF(AND(TABELAS!F67>=AB83,$F$10=1,$AB$15=0,$AB$20=1,$C$6<>\"\",OR($AA$54=TRUE,$AA$55=TRUE),OR($AB$54=TRUE,$AB$55=TRUE)),TABELAS!$I67,IF(AND(TABELAS!F67>=AB83,$F$10=2,$AB$15=0,$AB$20=1,$C$6<>\"\",OR($AA$54=TRUE,$AA$55=TRUE),OR($AB$54=TRUE,$AB$55=TRUE)),TABELAS!I67,IF(AND($F$10=1,$AB$15=1,$AB$20=1,$C$6<>\"\",OR($AA$54=TRUE,$AA$55=TRUE),OR($AB$54=TRUE,$AB$55=TRUE),TABELAS!H67>=AB83),\"\",IF(AND($F$10=2,$AB$15=1,$AB$20=1,$C$6<>\"\",OR($AA$54=TRUE,$AA$55=TRUE),OR($AB$54=TRUE,$AB$55=TRUE),TABELAS!H67>=AB83),\"\",\"\")))),\"\")","v":""}," "]
[null,null,null,null,null,null,null,null,null,null,null,null,null,null,null,null,null,null,null,null,null,null,null,null,null," ",{"$f":"IF(AND(TABELAS!F68>=AA83,$F$10=1,$AB$15=0,$AB$20=2,$C$6<>\"\",OR($AA$54=TRUE,$AA$55=TRUE),OR($AB$54=TRUE,$AB$55=TRUE)),TABELAS!$E68,IF(AND(TABELAS!F68>=AA83,$F$10=2,$AB$15=0,$AB$20=2,$C$6<>\"\",OR($AA$54=TRUE,$AA$55=TRUE),OR($AB$54=TRUE,$AB$55=TRUE)),TABELAS!$E68,IF(AND(TABELAS!F68>=AA83,$F$10=3,$AB$15=0,$AB$20=2,$C$6<>\"\",OR($AA$54=TRUE,$AA$55=TRUE),OR($AB$54=TRUE,$AB$55=TRUE)),\"\",IF(AND($F$10=1,$AB$15=1,$AB$20=2,$C$6<>\"\",OR($AA$54=TRUE,$AA$55=TRUE),OR($AB$54=TRUE,$AB$55=TRUE),TABELAS!H68>=AA83),TABELAS!$G68,IF(AND($F$10=2,$AB$15=1,$AB$20=2,$C$6<>\"\",OR($AA$54=TRUE,$AA$55=TRUE),OR($AB$54=TRUE,$AB$55=TRUE),TABELAS!H68>=AA83),TABELAS!$G68,IF(AND($F$10=3,$AB$15=1,$AB$20=2,$C$6<>\"\",OR($AA$54=TRUE,$AA$55=TRUE),OR($AB$54=TRUE,$AB$55=TRUE),TABELAS!H68>=AA83),\"\",\"\"))))))","v":""},{"$f":"IF(E59<>\"M.T\",IF(AND(TABELAS!F68>=AB83,$F$10=1,$AB$15=0,$AB$20=1,$C$6<>\"\",OR($AA$54=TRUE,$AA$55=TRUE),OR($AB$54=TRUE,$AB$55=TRUE)),TABELAS!$I68,IF(AND(TABELAS!F68>=AB83,$F$10=2,$AB$15=0,$AB$20=1,$C$6<>\"\",OR($AA$54=TRUE,$AA$55=TRUE),OR($AB$54=TRUE,$AB$55=TRUE)),TABELAS!I68,IF(AND($F$10=1,$AB$15=1,$AB$20=1,$C$6<>\"\",OR($AA$54=TRUE,$AA$55=TRUE),OR($AB$54=TRUE,$AB$55=TRUE),TABELAS!H68>=AB83),\"\",IF(AND($F$10=2,$AB$15=1,$AB$20=1,$C$6<>\"\",OR($AA$54=TRUE,$AA$55=TRUE),OR($AB$54=TRUE,$AB$55=TRUE),TABELAS!H68>=AB83),\"\",\"\")))),\"\")","v":""}," "]
[null,null,null,null,null,null,null,null,null,null,null,null,null,null,null,null,null,null,null,null,null,null,null,null,null,null,{"$f":"IFERROR(IF(AND(AB20=2,AB15=0,B15<>\"\",C6<>\"\",G6<>\"\"),VLOOKUP(E59,TABELAS!E59:F68,2,FALSE),IF(AND(AB20=2,AB15=1,B15<>\"\",C6<>\"\",G6<>\"\"),VLOOKUP(E59,TABELAS!G59:H66,2,FALSE),0)),\"\")","v":0},{"$f":"IF(AND(E59<>\"M.T\",E59<>\"FALTANDO DADOS\"),IF(AND(AB20=1,AB15=0,B15<>\"\",C6<>\"\",G6<>\"\"),VLOOKUP(E59,TABELAS!I59:J68,2,FALSE),IF(AND(AB20=1,AB15=1,B15<>\"\",C6<>\"\",G6<>\"\"),VLOOKUP(E59,TABELAS!K59:L63,2,FALSE),0)),\"\")","v":""}]
[null,null,null,null,null,null,null,null,null,null,null,null,null,null,null,null,null,null,null,null,null,null,null,null,null,null,{"$f":"IF(OR(E59=Z86,E59=Z87,E59=Z88),1,0)","v":1}]
[]
[null,null,null,null,null,null,null,null,null,null,null,null,null,null,null,null,null,null,null,null,null,null,null,null,null,"VER NORMAS PARA LIG. COLETIVA/AGRUPADA"]
[null,null,null,null,null,null,null,null,null,null,null,null,null,null,null,null,null,null,null,null,null,null,null,null,null,"LIG. COLETIVA"]
[null,null,null,null,null,null,null,null,null,null,null,null,null,null,null,null,null,null,null,null,null,null,null,null,null,"FALTANDO DADOS"]
[null,null,null,null,null,null,null,null,null,null,null,null,null,null,null,null,null,null,null,null,null,null,null,null,null,"INFORMATIVO Nº LIGAÇÕES"]
[null,null,null,null,null,null,null,null,null,null,null,null,null,null,null,null,null,null,null,null,null,null,null,null,null,"INFORMATIVO 01"]
[null,null,null,null,null,null,null,null,null,null,null,null,null,null,null,null,null,null,null,null,null,null,null,null,null,{"$f":"IF(AND(OR(AB20=2,AB20=1,F10=\"\"),OR(AB19=1,AB19=2,AB19=3,AB19=4),F10=1),\"PADRÃO PARA 1 LIGAÇÃO EM CONFORMIDADE COM AS NORMAS\",IF(AND(AB20=2,OR(AB19=1,AB19=2,AB19=3),F10<>\"\",F10=2,AB10<>\"\"),\"CONFORME ITEM 3.2 GED 13 CPFL PADRÃO MULTI 100/200\",IF(AND(AB20=2,F10<>\"\",F10=3,B60<=12,OR(AB19=1,AB19=2,AB19=3)),\"CONFORME ITEM 3.2 GED 13 CPFL PADRÃO MINI P/ 1,2 E 3\",IF(AND(AB20=1,OR(AB19=1,AB19=2,AB19=3,AB19=4),OR(B62<=38,B62=\"FALTANDO DADOS\"),F10<>\"\",F10=2,AB10<>\"\"),\"O SEGUNDO PADRÃO FICA LIMITADO A POT. INSTAL.:\",IF(AND(AB20=2,F10<>\"\",F10=3),\"CONFORME ITEM 3.2 GED13 CPFL\",IF(AND(F10<>\"\",OR(F10=\"4 ou mais\",F10=\"3 ou mais\"),OR(AB20=2,AB20=1)),\"ESTA OPÇÃO REQUER QUE SEJA\"))))))","v":false}]
[null,null,null,null,null,null,null,null,null,null,null,null,null,null,null,null,null,null,null,null,null,null,null,null,null,"INFORMATIVO 01"]
[null,null,null,null,null,null,null,null,null,null,null,null,null,null,null,null,null,null,null,null,null,null,null,null,null,{"$f":"IF(AND(OR(AB20=2,AB20=1,F10=\"\"),OR(AB19=1,AB19=2,AB19=3,AB19=4),F10=1),\" \",IF(AND(AB20=1,F10=2,OR(AB14<=38,AB14<=66),OR(AB19=1,AB19=2)),AB10,IF(AND(AB20=2,F10=2,OR(AB14<=38,AB14<=66),OR(AB19=1,AB19=2)),\"\",IF(OR(F10=\"3 ou mais\",F10=\"4 ou mais\",F10=3),\"\"))))","v":false}]
[null,null,null,null,null,null,null,null,null,null,null,null,null,null,null,null,null,null,null,null,null,null,null,null,null,"INFORMATIVO 01"]
[null,null,null,null,null,null,null,null,null,null,null,null,null,null,null,null,null,null,null,null,null,null,null,null,null,{"$f":"IF(AND(OR(AB20=2,AB20=1,F10=\"\"),AB19=1,F10=1),\" \",IF(AND(AB20=1,F10=2,B60<=75,AB15=0,OR(AB19=1,AB19=2),AB10<>\"\"),\"kW NORMA NTCD04 CERIM ITEM 2 (127/220)\",IF(AND(AB20=1,F10=2,B60<=75,AB15=1,OR(AB19=1,AB19=2),AB10<>\"\"),\"kW NORMA NTCD04 CERIM ITEM 2 (220/380)\",IF(AND(AB20=2,F10=2,B60<=75,OR(AB19=1,AB19=2,AB19=3),AB10<>\"\"),\"GED 14945 LIMT. A CAT. C3\",IF(AND(AB20=2,F10=3,B60<=12,OR(AB19=1,AB19=2,AB19=3),AB10<>\"\"),\"CLIENTES GED14857 NAS CATEGORIAS A1 E A2\",IF(AND(OR(F10=\"3 ou mais\",F10=\"4 ou mais\"),C6<>\"\",G6<>\"\",OR(AB19=1,AB19=2,AB19=3)),\"CONSULTADA AS NORMAS PARA LIG.COLETIVA\",\"\"))))))","v":""}]
[]
[null,null,null,null,null,null,null,null,null,null,null,null,null,null,null,null,null,null,null,null,null,null,null,null,null,null,"CPFL","CERIM"]
[null,null,null,null,null,null,null,null,null,null,null,null,null,null,null,null,null,null,null,null,null,null,null,null,null,"VALOR 1",null,{"$f":"IF(E59<>\"\",AB83,\"\")","v":""}]
[null,null,null,null,null,null,null,null,null,null,null,null,null,null,null,null,null,null,null,null,null,null,null,null,null,"VALOR 2",{"$f":"IF(AND(B60<>\"\"),B60,\"\")","v":"FALTANDO DADOS"},{"$f":"IF(AND(E59<>\"\",AB20=1,AB15=0),VLOOKUP(E59,TABELAS!I59:J68,2,FALSE),IF(AND(E59<>\"\",AB20=1,AB15=1),VLOOKUP(E59,TABELAS!K59:L63,2,FALSE),\"\"))","v":""}]
[null,null,null,null,null,null,null,null,null,null,null,null,null,null,null,null,null,null,null,null,null,null,null,null,null,"VARIAÇÃO",{"$f":"IF(AB20=2,IFERROR(AA99/AA98,\"\"),IF(AB20=1,IFERROR(AB99/AB98,\"\"),\"\"))","v":""}]
[]
[]
[null,null,null,null,null,null,null,null,null,null,null,null,null,null,null,null,null,null,null,null,null,null,null,null,null,"CPFL"]
[null,null,null,null,null,null,null,null,null,null,null,null,null,null,null,null,null,null,null,null,null,null,null,null,null,3,1000,10]
[null,null,null,null,null,null,null,null,null,null,null,null,null,null,null,null,null,null,null,null,null,null,null,null,null,4,1000,30]
[null,null,null,null,null,null,null,null,null,null,null,null,null,null,null,null,null,null,null,null,null,null,null,null,null,5,1000,30]
[null,null,null,null,null,null,null,null,null,null,null,null,null,null,null,null,null,null,null,null,null,null,null,null,null,6,1000,20]
[null,null,null,null,null,null,null,null,null,null,null,null,null,null,null,null,null,null,null,null,null,null,null,null,null,7,12000,30]
[null,null,null,null,null,null,null,null,null,null,null,null,null,null,null,null,null,null,null,null,null,null,null,null,null,8,20000,30]
[null,null,null,null,null,null,null,null,null,null,null,null,null,null,null,null,null,null,null,null,null,null,null,null,null,9,1000,5]
[null,null,null,null,null,null,null,null,null,null,null,null,null,null,null,null,null,null,null,null,null,null,null,null,null,10,50000,20]
[null,null,null,null,null,null,null,null,null,null,null,null,null,null,null,null,null,null,null,null,null,null,null,null,null,11,20000,20]
[null,null,null,null,null,null,null,null,null,null,null,null,null,null,null,null,null,null,null,null,null,null,null,null,null,12,1000,10]
[null,null,null,null,null,null,null,null,null,null,null,null,null,null,null,null,null,null,null,null,null,null,null,null,null,13,1000,20]
[]
[null,null,null,null,null,null,null,null,null,null,null,null,null,null,null,null,null,null,null,null,null,null,null,null,null,"CERIM"]
[null,null,null,null,null,null,null,null,null,null,null,null,null,null,null,null,null,null,null,null,null,null,null,null,null,3,1000,10]
[null,null,null,null,null,null,null,null,null,null,null,null,null,null,null,null,null,null,null,null,null,null,null,null,null,4,1000,30]
[null,null,null,null,null,null,null,null,null,null,null,null,null,null,null,null,null,null,null,null,null,null,null,null,null,5,1000,30]
[null,null,null,null,null,null,null,null,null,null,null,null,null,null,null,null,null,null,null,null,null,null,null,null,null,6,1000,20]
[null,null,null,null,null,null,null,null,null,null,null,null,null,null,null,null,null,null,null,null,null,null,null,null,null,7,12000,30]
[null,null,null,null,null,null,null,null,null,null,null,null,null,null,null,null,null,null,null,null,null,null,null,null,null,8,20000,30]
[null,null,null,null,null,null,null,null,null,null,null,null,null,null,null,null,null,null,null,null,null,null,null,null,null,9,50000,5]
[null,null,null,null,null,null,null,null,null,null,null,null,null,null,null,null,null,null,null,null,null,null,null,null,null,10,1000,5]
[null,null,null,null,null,null,null,null,null,null,null,null,null,null,null,null,null,null,null,null,null,null,null,null,null,11,50000,20]
[null,null,null,null,null,null,null,null,null,null,null,null,null,null,null,null,null,null,null,null,null,null,null,null,null,12,20000,20]
[null,null,null,null,null,null,null,null,null,null,null,null,null,null,null,null,null,null,null,null,null,null,null,null,null,13,1000,10]
[null,null,null,null,null,null,null,null,null,null,null,null,null,null,null,null,null,null,null,null,null,null,null,null,null,14,1000,20]

{"sheet":"CALCULO","index":1,"n_rows":89,"n_cols":26,"rows_kept":89,"cut":false,"hidden":true,"merged":[[76,17,77,19],[87,13,87,14],[87,15,87,16],[74,13,74,15],[43,9,43,10],[45,5,46,6],[52,13,52,15],[51,17,52,19],[34,7,35,7],[74,17,75,19],[75,13,75,15],[76,13,76,15],[65,13,66,13],[61,13,62,13],[63,13,64,13],[77,13,77,15],[47,5,47,6],[88,13,88,14],[88,15,88,16],[85,13,85,16],[86,13,86,14],[86,15,86,16],[80,13,80,16],[83,13,83,14],[81,13,81,14],[82,13,82,14],[81,15,81,16],[82,15,82,16],[83,15,83,16],[47,1,47,2],[55,2,55,3],[68,13,69,13],[70,13,71,13],[45,13,46,13],[49,1,49,7],[49,17,50,19],[30,13,30,19],[55,13,55,19],[56,18,56,19],[51,13,51,15],[49,13,49,15],[50,13,50,15],[49,9,49,10],[34,9,34,10],[32,13,32,19],[33,18,33,19],[38,13,39,13],[40,13,41,13],[43,13,44,13],[44,1,44,3],[32,5,32,7],[33,5,33,7],[45,1,46,2],[17,9,17,10],[29,1,29,2],[27,1,28,2],[27,3,28,3],[80,1,81,2],[84,1,85,2],[80,5,80,7],[82,1,83,2],[80,3,81,3],[70,1,70,7],[66,7,67,7],[64,1,64,7],[65,1,65,3],[84,3,85,3],[66,1,67,2],[66,3,67,3],[66,5,67,6],[68,1,68,2],[68,5,68,6],[65,5,65,7],[58,2,58,3],[58,6,58,7],[57,1,57,7],[48,5,48,7],[5,1,5,2],[10,7,11,7],[10,5,11,6],[12,5,14,6],[1,1,1,17],[39,1,40,2],[39,3,40,3],[41,1,41,2],[3,16,3,17],[32,1,32,3],[33,1,33,3],[34,1,35,2],[34,3,35,3],[36,1,38,2],[27,5,28,6],[27,7,28,7],[29,5,29,6],[23,9,23,10],[20,5,20,7],[21,5,21,7],[22,5,23,6],[9,5,9,7],[22,7,23,7],[24,5,26,6],[45,3,46,3],[43,1,43,7],[44,5,44,7],[36,5,38,6],[39,5,40,6],[39,7,40,7],[41,5,41,6],[45,7,46,7],[34,5,35,6],[4,19,7,19],[4,20,7,20],[4,21,7,21],[4,22,7,22],[4,23,7,23],[4,24,7,24],[3,19,3,24],[22,21,22,24],[33,21,33,22],[31,21,32,22],[35,21,35,24],[33,23,33,24],[24,23,24,24],[24,21,24,22],[27,23,27,24],[31,23,31,24],[26,23,26,24],[23,21,23,24],[25,21,25,24],[26,21,26,22],[27,21,28,22],[28,23,28,24],[29,21,29,24],[30,21,30,22],[30,23,30,24],[32,23,32,24],[24,1,26,2],[22,1,23,2],[22,3,23,3],[21,1,21,3],[17,1,17,2],[9,1,9,3],[15,3,16,3],[3,13,3,14],[3,9,3,11],[20,1,20,3],[12,1,14,2],[15,5,16,6],[15,7,16,7],[17,5,17,6],[8,5,8,7],[8,1,8,3],[6,1,6,2],[10,1,11,2],[10,3,11,3],[3,1,3,3],[15,1,16,2],[3,5,3,7],[6,5,6,6],[4,2,4,3],[40,21,40,22],[40,23,40,24],[36,21,36,22],[37,21,37,22],[36,23,36,24],[37,23,37,24],[38,21,38,22],[39,23,39,24],[39,21,39,22],[38,23,38,24]]}
[]
[null,"CÁCLULO DE DEMANDA "]
[]
[null,"DADOS GERAIS",null,null,null,"GRUPO 9 - hidromassagem",null,null,null,"DEMANDA GRUPO 01",null,null,null,"DEMANDA GRUPO 02",null,null,"DEMANDA GRUPO 05",null,null,"TABELA 2 POTENCIA MÍNIMA EM FUNÇÃO DA ÁREA CONSTRUÍDA"]
[null,"NORMA:",{"$f":"CALC.D!R2","v":"GED Nº 13 - CPFL"},null,null,"POT INS",{"$f":"IF(AND(F6>0,CALC.D!$AB$20=1),SUM(CALC.D!T48:U49),0)","v":0},"F.D",null,"TIPO:","RESIDENCIAL","COMERCIAL",null,1,1,null,1,1,null,"AREA TOTAL","TOMADAS DE 100W","SUB TOTAL I","TOMADAS DE 600W","SUB TOTAL II","TOTAL SUB I + SUB II"]
[null,"TIPO DE INSTALAÇÃO:",null,{"$f":"IF(AND(CALC.D!C6<>\"\",D7=2,CALC.D!C6<>\"RURAL\"),VLOOKUP(CALC.D!C6,TABELAS!A39:B42,2,FALSE),IF(AND(CALC.D!C6<>\"\",D7=1),VLOOKUP(CALC.D!C6,TABELAS!AF38:AG42,2,FALSE),\"\"))","v":""},null,{"$f":"IF(AND($D$6<>\"\",$C$5<>\"\",CALC.D!$AB$20=1),SUM(CALC.D!V48:V49),0)","v":0},{"$f":"IF(G5>4,4,G5)","v":0},{"$f":"IF(AND(F6<>0,$D$7=1),VLOOKUP(G6,J45:K48,2,FALSE),0)","v":0},null,0,0.86,1,null,2,1,null,2,0.6]
[null,"VINCULO",null,{"$f":"IF(C5=\"GED Nº 13 - CPFL\",2,IF(C5=\"NTC-D-04 - FECOERESP\",1,\"\"))","v":2},null,"DEMANDA",null,{"$f":"F6*H6","v":0},null,1000,0.75,"INDUSTRIAL",null,3,0.84,null,3,0.48]
[null,null,null,null,null,null,null,null,null,2000,0.66,1,null,4,0.76,null,4,0.4]
[null,"GRUPO 01 - ilum/tom (RESIDENCIAL)",null,null,null,"GRUPO 02 - chu/ferr/sec/",null,null,null,3000,0.59,null,null,5,0.7,null,5,0.37,null,8,1,{"$f":"100*U9","v":100},1,{"$f":"600*W9","v":600},{"$f":"X9+V9","v":700}]
[null,null,null,null,null,null,null,null,null,4000,0.52,null,null,6,0.65,null,6,0.35,null,15,3,{"$f":"100*U10","v":300},1,{"$f":"600*W10","v":600},{"$f":"X10+V10","v":900}]
[null,"POTENCIA INSTALADA",null,{"$f":"IF(AND($D$6<>\"\",$C$5<>\"\",$F$6<>\"\",$F$6<>TABELAS!$AN$40),SUM(CALC.D!$J$21:$J$30),IF(AND($Y$14=1,$B$6<>\"\",$F$6<>\"\",F6=TABELAS!$AN$40),CALCULO!$Q$77*(CALC.D!$T$8*0.7),0))","v":0},null,"POTENCIA INSTALADA",null,{"$f":"IF(AND($D$6<>\"\",$C$5<>\"\"),SUM(CALC.D!J34:J38),0)","v":0},null,5000,0.45,null,null,7,0.6,null,7,0.33,null,20,4,400,2,1200,1600]
[null,null,null,null,null,null,null,null,null,6000,0.4,null,null,8,0.56999999999999995,null,8,0.32,null,30,5,500,2,1200,1700]
[null,"Nº DE APARELHOS",null,{"$f":"IF(D11>0,SUM(CALC.D!H21:I30),0)","v":0},null,"Nº DE APARELHOS",null,{"$f":"IF(H11>0,SUM(CALC.D!H34:I38),0)","v":0},null,7000,0.35,null,null,9,0.54,null,9,0.31,null,50,6,600,3,1800,2400]
[null,null,null,{"$f":"IF(D13>5,10,D13)","v":0},null,null,null,{"$f":"IF(H13>25,25,H13)","v":0},null,8000,0.31,null,null,10,0.52,null,10,0.3,null,70,7,700,3,1800,2500]
[null,null,null,{"$f":"IF(AND(D16<>0,D16<>\"\"),VLOOKUP(D16,J6:K16,2,FALSE),0)","v":0},null,null,null,{"$f":"IF(AND(H11<>0),VLOOKUP(H14,N5:O29,2,FALSE),0)","v":0},null,9000,0.27,null,null,11,0.49,null,11,0.3,null,90,8,800,3,1800,2600]
[null,"FATOR DE DEMANDA",null,{"$f":"IF(D11>0,IF(D11<=1000,0,IF(AND(D11>1000,D11<=2000),1000,IF(AND(D11>2000,D11<=3000),2000,IF(AND(D11>3000,D11<=4000),3000,IF(AND(D11>3000,D11<=4000),3000,IF(AND(D11>4000,D11<=5000),4000,IF(AND(D11>5000,D11<=6000),5000,IF(AND(D11>6000,D11<=7000),6000,IF(AND(D11>7000,D11<=8000),7000,IF(AND(D11>8000,D11<=7000),8000,IF(AND(D11>9000,D11<=10000),9000,IF(AND(D11>10000),10000,\"\")))))))))))),0)","v":0},null,"FATOR DE DEMANDA",null,{"$f":"IF(H11>0,IF(H11<=1000,0,IF(AND(H11>1000,H11<=2000),1000,IF(AND(H11>2000,H11<=3000),2000,IF(AND(H11>3000,H11<=4000),3000,IF(AND(H11>3000,H11<=4000),3000,IF(AND(H11>4000,H11<=5000),4000,IF(AND(H11>5000,H11<=6000),5000,IF(AND(H11>6000,H11<=7000),6000,IF(AND(H11>7000,H11<=8000),7000,IF(AND(H11>8000,H11<=7000),8000,IF(AND(H11>9000,H11<=10000),9000,IF(AND(H11>10000),10000,\"\")))))))))))),0)","v":0},null,10000,0.24,null,null,12,0.48,null,12,0.28000000000000003,null,110,9,900,3,1800,2700]
[null,null,null,null,null,null,null,null,null,null,null,null,null,13,0.46,null,13,0.28000000000000003,null,140,10,1000,3,1800,2800]
[null,"DEMANDA:",null,{"$f":"IF(D11>0,(D11*D15),0)","v":0},null,"DEMANDA:",null,{"$f":"IF(H11>0,(H11*H15),0)","v":0},null,"DEMANDA GRUPO 03",null,null,null,14,0.45,null,14,0.28000000000000003,null,170,11,1100,3,1800,2900]
[null,null,null,null,null,null,null,null,null,1,1,null,null,15,0.44,null,15,0.28000000000000003,null,200,12,1200,3,1800,3000]
[null,null,null,null,null,null,null,null,null,2,0.72,null,null,16,0.43,null,16,0.26,null,220,13,1300,3,1800,3100]
[null,"GRUPO 03 - aquecedor",null,null,null,"GRUPO 04 - lava roup./forno ele./et",null,null,null,3,0.62,null,null,17,0.42,null,17,0.26,null,250,14,1400,3,1800,3200]
[null,null,null,null,null,null,null,null,null,4,0.62,null,null,18,0.41,null,18,0.26]
[null,"POTENCIA INSTALADA",null,{"$f":"IF(AND($D$6<>\"\",$C$5<>\"\"),SUM(CALC.D!J42:J43),0)","v":0},null,"POTENCIA INSTALADA",null,{"$f":"IF(AND($D$6<>\"\",$C$5<>\"\"),SUM(CALC.D!J47:J49),0)","v":0},null,null,null,null,null,19,0.4,null,19,0.26,null,null,null,"GRUPO 01 - TOM/ILUM (POT. MÍNIMA)"]
[null,null,null,null,null,null,null,null,null,"DEMANDA GRUPO 04",null,null,null,20,0.4,null,20,0.26,null,null,null,"ILUMINAÇÃO"]
[null,"Nº DE APARELHOS",null,{"$f":"IF(D23>0,SUM(CALC.D!H42:I43),0)","v":0},null,"Nº DE APARELHOS",null,{"$f":"IF(H23>0,SUM(CALC.D!H47:I49),0)","v":0},null,1,1,null,null,21,0.39,null,21,0.26,null,null,null,"POTENCIA INSTALADA",null,{"$f":"CALC.D!P10*100","v":0}]
[null,null,null,{"$f":"IF(D25>4,4,D25)","v":0},null,null,null,{"$f":"IF(H25>8,9,H25)","v":0},null,2,0.7,null,null,22,0.39,null,22,0.26,null,null,null,"TOMADA"]
[null,null,null,{"$f":"IF(AND(D23<>0),VLOOKUP(D26,J19:K22,2,FALSE),0)","v":0},null,null,null,{"$f":"IF(AND(H23<>0),VLOOKUP(H26,J25:K33,2,FALSE),0)","v":0},null,3,0.7,null,null,23,0.39,null,23,0.26,null,null,null,"AREA CONSTRUIDA",null,{"$f":"IF(CALC.D!T6<>\"\",CALC.D!T6,\"\")","v":""}]
[null,"FATOR DE DEMANDA",null,{"$f":"IF(D23>0,IF(D23<=1000,0,IF(AND(D23>1000,D23<=2000),1000,IF(AND(D23>2000,D23<=3000),2000,IF(AND(D23>3000,D23<=4000),3000,IF(AND(D23>3000,D23<=4000),3000,IF(AND(D23>4000,D23<=5000),4000,IF(AND(D23>5000,D23<=6000),5000,IF(AND(D23>6000,D23<=7000),6000,IF(AND(D23>7000,D23<=8000),7000,IF(AND(D23>8000,D23<=7000),8000,IF(AND(D23>9000,D23<=10000),9000,IF(AND(D23>10000),10000,\"\")))))))))))),0)","v":0},null,"FATOR DE DEMANDA",null,{"$f":"IF(H23>0,IF(H23<=1000,0,IF(AND(H23>1000,H23<=2000),1000,IF(AND(H23>2000,H23<=3000),2000,IF(AND(H23>3000,H23<=4000),3000,IF(AND(H23>3000,H23<=4000),3000,IF(AND(H23>4000,H23<=5000),4000,IF(AND(H23>5000,H23<=6000),5000,IF(AND(H23>6000,H23<=7000),6000,IF(AND(H23>7000,H23<=8000),7000,IF(AND(H23>8000,H23<=7000),8000,IF(AND(H23>9000,H23<=10000),9000,IF(AND(H23>10000),10000,\"\")))))))))))),0)","v":0},null,4,0.7,null,null,24,0.38,null,24,0.26,null,null,null,"POTENCIA INSTALADA",null,{"$f":"IF(X27>0,IF(X27<=8,8,IF(AND(X27>8,X27<=15),15,IF(AND(X27>15,X27<=20),20,IF(AND(X27>20,X27<=30),30,IF(AND(X27>30,X27<=50),50,IF(AND(X27>50,X27<=70),70,IF(AND(X27>70,X27<=90),90,IF(AND(X27>90,X27<=110),110,IF(AND(X27>110,X27<=140),140,IF(AND(X27>140,X27<=170),170,IF(AND(X27>170,X27<=200),200,IF(AND(X27>200,X27<=220),220,IF(AND(X27>220,X27<=250),250,IF(X27>250,D11,\"\")))))))))))))),\"\")","v":0}]
[null,null,null,null,null,null,null,null,null,5,0.6,null,null,25,0.38,null,25,0.26,null,null,null,null,null,{"$f":"IF(X27<=250,IF(AND(X28<>\"\",X28>0),VLOOKUP(X28,T9:Y21,6,FALSE),\"\"),(VLOOKUP(\"TOMADAS DE USO GERAL 100W\",CALC.D!B21:J30,9,FALSE))+(VLOOKUP(\"TOMADAS DE USO ESPECÍFICO 600W\",CALC.D!B21:J30,9,FALSE)))","v":{"$error":"#N/A"}}]
[null,"DEMANDA:",null,{"$f":"IF(D23>0,(D23*D27),0)","v":0},null,"DEMANDA:",null,{"$f":"IF(H23>0,(H23*H27),0)","v":0},null,6,0.6,null,null,null,null,null,null,null,null,null,null,"TOTAL POT. INSTALADA"]
[null,null,null,null,null,null,null,null,null,7,0.5,null,null,"CALCULA DEMANDA COMERCIAL/INDUSTRIAL PARA O GRUPO 01",null,null,null,null,null,null,null,"POTENCIA INSTALADA",null,{"$f":"X29+X25","v":{"$error":"#N/A"}}]
[null,null,null,null,null,null,null,null,null,8,0.5,null,null,null,null,null,null,null,null,null,null,"FATOR DE DEMANDA",null,{"$f":"IF(X31>0,IF(X31<=1000,0,IF(AND(X31>1000,X31<=2000),1000,IF(AND(X31>2000,X31<=3000),2000,IF(AND(X31>3000,X31<=4000),3000,IF(AND(X31>3000,X31<=4000),3000,IF(AND(X31>4000,X31<=5000),4000,IF(AND(X31>5000,X31<=6000),5000,IF(AND(X31>6000,X31<=7000),6000,IF(AND(X31>7000,X31<=8000),7000,IF(AND(X31>8000,X31<=7000),8000,IF(AND(X31>9000,X31<=10000),9000,IF(AND(X31>10000),10000,\"\")))))))))))),0)","v":{"$error":"#N/A"}}]
[null,"GRUPO 05 - fogões elétricos",null,null,null,"GRUPO 06 - Ar Condicionado",null,null,null,9,0.5,null,null,"DEMANDA GRUPO 01 - CPFL (COMERCIAL)",null,null,null,null,null,null,null,null,null,{"$f":"IF(AND(X25<>0),VLOOKUP(X32,J6:K16,2,FALSE),0)","v":0}]
[null,null,null,null,null,null,null,null,null,null,null,null,null,"ITEM","ESTIMADA","W/M²","FD","POT. INSTA","DEMANDA",null,null,"DEMANDA",null,{"$f":"X33*X31","v":{"$error":"#N/A"}}]
[null,"POTENCIA INSTALADA",null,{"$f":"IF(AND($D$6<>\"\",$C$5<>\"\"),SUM(CALC.D!V21:V22),0)","v":0},null,"POTENCIA INSTALADA",null,{"$f":"IF(AND($D$6<>\"\",$C$5<>\"\",D7=2),SUM(CALC.D!Z36:Z39),IF(AND($D$6<>\"\",$C$5<>\"\",D7=1),SUM(CALC.D!AA36:AA39),0))","v":0},null,"DEMANDA GRUPO 06",null,null,null,3,1000,10,1,{"$f":"IF(AND(CALC.D!$T$6<>\"\"),(CALC.D!$T$6*P35*Q35),0)","v":0},{"$f":"R35*Q35","v":0},{"$f":"S35","v":0}]
[null,null,null,null,null,null,null,null,null,10,1,null,null,4,1000,30,1,{"$f":"IF(AND(CALC.D!$T$6<>\"\"),(CALC.D!$T$6*P36*Q36),0)","v":0},{"$f":"R36*Q36","v":0},{"$f":"S36","v":0},null,"RESULTADO DO CÁLCULO"]
[null,"Nº DE APARELHOS",null,{"$f":"IF(D35>0,SUM(CALC.D!T21:U22),0)","v":0},null,"Nº DE APARELHOS",null,{"$f":"IF(H35>0,SUM(CALC.D!T26:U29),0)","v":0},null,20,0.9,null,null,5,1000,30,1,{"$f":"IF(AND(CALC.D!$T$6<>\"\"),(CALC.D!$T$6*P37*Q37),0)","v":0},0,0,null,"POT. INST. ESCOLHA",null,{"$f":"D11","v":0}]
[null,null,null,{"$f":"IF(D37>25,25,D37)","v":0},null,null,null,{"$f":"IF(H37<=10,10,IF(H37<=20,20,IF(H37<=30,30,IF(H37<=40,40,IF(H37<=50,50,IF(H37<=75,75,IF(H37<=100,100,100)))))))","v":10},null,30,0.82,null,null,6,1000,20,1,{"$f":"IF(AND(CALC.D!$T$6<>\"\"),(CALC.D!$T$6*P38*Q38),0)","v":0},0,0,null,"POT. INST. MÍNIMO",null,{"$f":"X31","v":{"$error":"#N/A"}}]
[null,null,null,{"$f":"IF(AND(D35<>0,$D$7=1),VLOOKUP(D38,Q5:R29,2,FALSE),IF(AND(D35<>0,$D$7=2),VLOOKUP(D38,Q5:R29,2,FALSE),0))","v":0},null,null,null,{"$f":"IF(AND(H35<>0),VLOOKUP(H38,J36:K42,2,FALSE),0)","v":0},null,40,0.8,null,null,7,12000,30,1,{"$f":"IF(AND(CALC.D!$T$6<>\"\"),(CALC.D!$T$6*P39),0)","v":0},{"$f":"IF(R39<=O39,R39*Q39,IF(R39>O39,O39*Q39,0))","v":0},{"$f":"S39+S40","v":0},null,"DEMANDA ESCOLHIDA",null,{"$f":"D18","v":0}]
[null,"FATOR DE DEMANDA",null,{"$f":"IF(D35>0,IF(D35<=1000,0,IF(AND(D35>1000,D35<=2000),1000,IF(AND(D35>2000,D35<=3000),2000,IF(AND(D35>3000,D35<=4000),3000,IF(AND(D35>3000,D35<=4000),3000,IF(AND(D35>4000,D35<=5000),4000,IF(AND(D35>5000,D35<=6000),5000,IF(AND(D35>6000,D35<=7000),6000,IF(AND(D35>7000,D35<=8000),7000,IF(AND(D35>8000,D35<=7000),8000,IF(AND(D35>9000,D35<=10000),9000,IF(AND(D35>10000),10000,\"\")))))))))))),0)","v":0},null,"FATOR DE DEMANDA",null,{"$f":"IF(H35>0,IF(H35<=1000,0,IF(AND(H35>1000,H35<=2000),1000,IF(AND(H35>2000,H35<=3000),2000,IF(AND(H35>3000,H35<=4000),3000,IF(AND(H35>3000,H35<=4000),3000,IF(AND(H35>4000,H35<=5000),4000,IF(AND(H35>5000,H35<=6000),5000,IF(AND(H35>6000,H35<=7000),6000,IF(AND(H35>7000,H35<=8000),7000,IF(AND(H35>8000,H35<=7000),8000,IF(AND(H35>9000,H35<=10000),9000,IF(AND(H35>10000),10000,\"\")))))))))))),0)","v":0},null,50,0.77,null,null,null,12000,30,0.5,{"$f":"IF(AND(CALC.D!$T$6<>\"\"),(CALC.D!$T$6*P40),0)","v":0},{"$f":"IF(R40>O40,((R40-O40)*Q40),0)","v":0},{"$f":"S40+S39","v":0},null,"DEMANDA MINIMA",null,{"$f":"X34","v":{"$error":"#N/A"}},null,"VINC"]
[null,null,null,null,null,null,null,null,null,75,0.75,null,null,8,20000,30,1,{"$f":"IF(AND(CALC.D!$T$6<>\"\"),(CALC.D!$T$6*P41),0)","v":0},{"$f":"IF(R41<=O41,R41*Q41,IF(R41>O41,O41*Q41,0))","v":0},{"$f":"S41+S42","v":0},null,"FATO DE DEMANDA",null,{"$f":"IF(Z41=1,X33,IF(Z41=2,D15,))","v":{"$error":"#N/A"}},null,{"$f":"IF(X38>X37,1,IF(X37>X38,2,0))","v":{"$error":"#N/A"}}]
[null,"DEMANDA:",null,{"$f":"IF(D35>0,(D35*D39),0)","v":0},null,"DEMANDA:",null,{"$f":"IF(H35>0,(H35*H39),0)","v":0},null,100,0.75,null,null,null,20000,30,0.7,{"$f":"IF(AND(CALC.D!$T$6<>\"\"),(CALC.D!$T$6*P42),0)","v":0},{"$f":"IF(R42>O42,((R42-O42)*Q42),0)","v":0},{"$f":"S42+S41","v":0}]
[null,null,null,null,null,null,null,null,null,null,null,null,null,9,1000,5,1,{"$f":"IF(AND(CALC.D!$T$6<>\"\"),(CALC.D!$T$6*P43*Q43),0)","v":0},{"$f":"R43*Q43","v":0},{"$f":"S43","v":0}]
[null,"GRUPO 08 - Eqpto Especiais",null,null,null,null,null,null,null,"DEMANDA GRUPO 09",null,null,null,10,50000,20,0.4,{"$f":"IF(AND(CALC.D!$T$6<>\"\"),(CALC.D!$T$6*P44),0)","v":0},{"$f":"IF(R44<=O44,R44*Q44,IF(R44>O44,O44*Q44,0))","v":0},{"$f":"S44+S45","v":0}]
[null,"CPFL",null,null,null,"CERIM",null,null,null,1,1,null,null,null,50000,20,0.2,{"$f":"IF(AND(CALC.D!$T$6<>\"\"),(CALC.D!$T$6*P45),0)","v":0},{"$f":"IF(R45>O45,((R45-O45)*Q45),0)","v":0},{"$f":"S45+S44","v":0}]
[null,"POTENCIA INSTALADA",null,{"$f":"IF(AND($D$6<>\"\",$C$5<>\"\",D7=2),SUM(CALC.D!V43:V44),0)","v":0},null,"POTENCIA INSTALADA",null,{"$f":"IF(AND($D$6<>\"\",$C$5<>\"\",$D$7=1),SUM(CALC.D!V43:V44),0)","v":0},null,2,0.56000000000000005,null,null,11,20000,20,0.5,{"$f":"IF(AND(CALC.D!$T$6<>\"\"),(CALC.D!$T$6*P46),0)","v":0},{"$f":"IF(R46<=O46,R46*Q46,IF(R46>O46,O46*Q46,0))","v":0},{"$f":"S46+S47","v":0}]
[null,null,null,null,null,null,null,null,null,3,0.47,null,null,null,20000,20,0.4,{"$f":"IF(AND(CALC.D!$T$6<>\"\"),(CALC.D!$T$6*P47),0)","v":0},{"$f":"IF(R47>O47,((R47-O47)*Q47),0)","v":0},{"$f":"S47+S46","v":0}]
[null,"DEMANDA:",null,{"$f":"IF($D$7=2,SUM(C60:C63),\"\")","v":0},null,"DEMANDA:",null,{"$f":"IF($D$7=1,SUM(G60:G61),\"\")","v":""},null,4,0.39,null,null,12,1000,10,1,{"$f":"IF(AND(CALC.D!$T$6<>\"\"),(CALC.D!$T$6*P48*Q48),0)","v":0},{"$f":"R48*Q48","v":0},{"$f":"S48","v":0}]
[null,{"$f":"IF(AND(D52<>\"\",D53<>\"\",D54<>\"\",D55<>\"\"),AVERAGE(D60:D63),IF(AND(D52<>\"\",D53<>\"\",D54<>\"\"),AVERAGE(D60:D62),IF(AND(D52<>\"\",D53<>\"\"),AVERAGE(D60:D61),IF(D52<>\"\",D60,\"\"))))","v":""},null,null,null,{"$f":"IF($D$7=1,H48,IF($D$7=2,D48,0))","v":0},null,null,null,null,null,null,null,13,1000,20,1,{"$f":"IF(AND(CALC.D!$T$6<>\"\"),(CALC.D!$T$6*P49*Q49),0)","v":0},0,{"$f":"S49","v":0}]
[null,"CÁLCULOS",null,null,null,null,null,null,null,"DEMANDA GRUPO 07",null,null,null,"POTENCIA INSTALADA W/m²",null,null,{"$f":"IF(AND(CALC.D!C6=\"COMERCIAL\",D7=2,CALC.D!$G$6<>TABELAS!$G$41),VLOOKUP(Q51,N35:T49,5,FALSE),IF(AND(CALC.D!C6=\"COMERCIAL\",D7=2,CALC.D!$G$6=TABELAS!$G$41),(VLOOKUP(Q51,N35:T49,5,FALSE))+(CALC.D!T8*700),0))","v":0},"POTENCIA INSTALADA PELA SOMA DOS EQUIPAMENTOS"]
[null,"CALC.","MAIORES","VALORES",null,"CALC.","MAIORES","VALORES",null,1,1,null,null,"INSTALAÇÃO COMERCIAL",null,null,{"$f":"IF(AND(CALC.D!C6=\"COMERCIAL\",D7=2),VLOOKUP(CALC.D!G6,TABELAS!G40:L50,6,FALSE),0)","v":0}]
[null,{"$f":"IF(AND(CALC.D!$V43<>\"\",$D$7=2),CALC.D!$V43/CALC.D!$T43,\"\")","v":""},"1º",{"$f":"IF(AND(B59>0,B52<>\"\",B52<>0),(LARGE(B52:B53,1))/0.75,IF(AND(B59>0,B53<>\"\",B53<>0),(LARGE(B52:B53,2))*0.75,\"\"))","v":""},null,{"$f":"IF(AND(CALC.D!$V43<>\"\",$D$7=1),CALC.D!$V$43/CALC.D!$T43,\"\")","v":""},"MAIOR",{"$f":"IF(F59>0,(LARGE(F52:F53,1))/0.75,\"\")","v":""},null,2,0.9,null,null,"DEMANDA PELA TABELA",null,null,{"$f":"IF(AND(CALC.D!C6=\"COMERCIAL\",D7=2),(VLOOKUP(Q51,N35:T49,4,FALSE))*Q50,0)","v":0},{"$f":"IF(AND($D$6<>\"\",$C$5<>\"\",D7=2,CALC.D!AB20=2,CALC.D!AB19=2),SUM(CALC.D!$J$21:$J$30),0)","v":0}]
[null,{"$f":"IF(AND(CALC.D!$V44<>\"\",$D$7=2),CALC.D!$V44/CALC.D!$T44,\"\")","v":""},"2º",{"$f":"IF(AND(OR(C57>1,D57>1),B52<>0,B52<>\"\"),(LARGE(B52:B53,1))/0.75,IF(AND(OR(C57>1,D57>1),B53<>0,B53<>\"\"),(LARGE(B52:B53,2))/0.75,\"\"))","v":""},null,{"$f":"IF(AND(CALC.D!$V44<>\"\",$D$7=1),CALC.D!$V$44/CALC.D!$T44,\"\")","v":""},"SOMA",{"$f":"IF(F59>1,((SUM(F52:F56)/0.75)-H52),\"\")","v":""},null,3,0.8,null,null,"DEMANDA PELA SOMA",null,null,{"$f":"IF(AND(CALC.D!C6=\"COMERCIAL\",D7=2),D18,0)","v":0}]
[null,"SOMA","3º",{"$f":"IF(AND(OR(C57>2,D57>2),B52<>0,B52<>\"\"),(LARGE(B52:B53,1))/0.75,IF(AND(OR(C57>2,D57>2),B53<>0,B53<>\"\"),(LARGE(B52:B53,2))/0.75,\"\"))","v":""},null,null,null,null,null,4,0.8]
[null,{"$f":"IF(AND(CALC.D!$V43<>\"\",$D$7=2),CALC.D!$V43,\"\")","v":""},"SOMA",{"$f":"IF(AND(OR(C57>3,D57>3),B52<>0,B52<>\"\"),(LARGE(B52:B53,1))/0.75,IF(AND(OR(C57>3,D57>3),B53<>0,B53<>\"\"),(LARGE(B52:B53,2))/0.75,\"\"))","v":""},null,null,null,null,null,5,0.7]
[null,{"$f":"IF(AND(CALC.D!$V44<>\"\",$D$7=2),CALC.D!$V44/CALC.D!$T44,\"\")","v":""},"QTDE",null,null,null,null,null,null,null,null,null,null,"DEMANDA GRUPO 01 - FECOERESP (COMERCIAL)"]
[null,null,{"$f":"CALC.D!T43","v":0},{"$f":"CALC.D!T44","v":0},null,null,null,null,null,null,null,null,null,"ITEM","ESTIMADA","W/M²","FD","POT. INSTA","DEMANDA"]
[null,"DEMANDA GRUPO 08",null,null,null,null,null,null,null,null,null,null,null,3,1000,10,1,{"$f":"IF(AND(CALC.D!$T$6<>\"\"),(CALC.D!$T$6*P58*Q58),0)","v":0},{"$f":"R58*Q58","v":0},{"$f":"S58","v":0}]
[null,{"$f":"COUNTIF(B52:B53,\">0\")","v":0},"CPFL",null,null,{"$f":"COUNTIF(F52:F56,\">0\")","v":0},"CERIM",null,null,null,null,null,null,4,1000,30,1,{"$f":"IF(AND(CALC.D!$T$6<>\"\"),(CALC.D!$T$6*P59*Q59),0)","v":0},{"$f":"R59*Q59","v":0},{"$f":"S59","v":0}]
[null,"1º",{"$f":"IF(D52<>\"\",D52*D60,0)","v":0},1,null,"MAIOR",{"$f":"IF(H52<>\"\",H52*H60,0)","v":0},1,null,null,null,null,null,5,1000,30,1,{"$f":"IF(AND(CALC.D!$T$6<>\"\"),(CALC.D!$T$6*P60*Q60),0)","v":0},0,0]
[null,"2º",{"$f":"IF(D53<>\"\",D53*D61,0)","v":0},0.7,null,"SOMA",{"$f":"IF(H53<>\"\",H53*H61,0)","v":0},0.6,null,null,null,null,null,6,1000,20,1,{"$f":"IF(AND(CALC.D!$T$6<>\"\"),(CALC.D!$T$6*P61*Q61),0)","v":0},0,0]
[null,"3º",{"$f":"IF(D54<>\"\",D54*D62,0)","v":0},0.4,null,null,null,{"$f":"IF(AND(OR(F52<>\"\",F53<>\"\"),F59<>\"\"),AVERAGE(H60:H61),0)","v":0},null,null,null,null,null,7,12000,30,1,{"$f":"IF(AND(CALC.D!$T$6<>\"\"),(CALC.D!$T$6*P62),0)","v":0},{"$f":"IF(R62<=O62,R62*Q62,IF(R62>O62,O62*Q62,0))","v":0},{"$f":"S62+S63","v":0}]
[null,"SOMA",{"$f":"IF(D55<>\"\",D55*D63,0)","v":0},0.3,null,null,null,null,null,null,null,null,null,null,12000,30,0.5,{"$f":"IF(AND(CALC.D!$T$6<>\"\"),(CALC.D!$T$6*P63),0)","v":0},{"$f":"IF(R63>O63,((R63-O63)*Q63),0)","v":0},{"$f":"S63+S62","v":0}]
[null,null,null,null,null,null,null,null,null,null,null,null,null,8,20000,30,1,{"$f":"IF(AND(CALC.D!$T$6<>\"\"),(CALC.D!$T$6*P64),0)","v":0},{"$f":"IF(R64<=O64,R64*Q64,IF(R64>O64,O64*Q64,0))","v":0},{"$f":"S64+S65","v":0}]
[null,"GRUPO 07 - motores",null,null,null,null,null,null,null,null,null,null,null,null,20000,30,0.7,{"$f":"IF(AND(CALC.D!$T$6<>\"\"),(CALC.D!$T$6*P65),0)","v":0},{"$f":"IF(R65>O65,((R65-O65)*Q65),0)","v":0},{"$f":"S65+S64","v":0}]
[null,"CPFL",null,null,null,"CERIM",null,null,null,null,null,null,null,9,50000,5,0.4,{"$f":"IF(AND(CALC.D!$T$6<>\"\"),(CALC.D!$T$6*P66),0)","v":0},{"$f":"IF(R66<=O66,R66*Q66,IF(R66>O66,O66*Q66,0))","v":0},{"$f":"S66+S67","v":0}]
[null,"POTENCIA INSTALADA",null,{"$f":"IF(AND($D$6<>\"\",$C$5<>\"\",D7=2),SUM(CALC.D!V33:V39),0)","v":0},null,"POTENCIA INSTALADA",null,{"$f":"IF(AND($D$6<>\"\",$C$5<>\"\",$D$7=1),SUM(CALC.D!V33:V39),0)","v":0},null,null,null,null,null,null,50000,5,0.2,{"$f":"IF(AND(CALC.D!$T$6<>\"\"),(CALC.D!$T$6*P67),0)","v":0},{"$f":"IF(R67>O67,((R67-O67)*Q67),0)","v":0},{"$f":"S67+S66","v":0}]
[null,null,null,null,null,null,null,null,null,null,null,null,null,10,1000,5,1,{"$f":"IF(AND(CALC.D!$T$6<>\"\"),(CALC.D!$T$6*P68*Q68),0)","v":0},{"$f":"R68*Q68","v":0},{"$f":"S68","v":0}]
[null,"DEMANDA:",null,{"$f":"IF($D$7=2,D77+D78,\"\")","v":0},null,"DEMANDA:",null,{"$f":"IF($D$7=1,SUM(H77:H78),\"\")","v":""},null,null,null,null,null,11,50000,20,1,{"$f":"IF(AND(CALC.D!$T$6<>\"\"),(CALC.D!$T$6*P69),0)","v":0},{"$f":"IF(R69<=O69,R69*Q69,IF(R69>O69,O69*Q69,0))","v":0},{"$f":"S69+S70","v":0}]
[null,{"$f":"(D79+D80)/2","v":0.5},null,null,null,{"$f":"IF($D$7=1,H69,IF($D$7=2,D69,0))","v":0},null,{"$f":"IF(AND(H67>0,H69>0),AVERAGE(H79:H80),0)","v":0},null,null,null,null,null,null,50000,20,0.2,{"$f":"IF(AND(CALC.D!$T$6<>\"\"),(CALC.D!$T$6*P70),0)","v":0},{"$f":"IF(R70>O70,((R70-O70)*Q70),0)","v":0},{"$f":"S70+S69","v":0}]
[null,"CÁLCULOS",null,null,null,null,null,null,null,null,null,null,null,12,20000,20,0.5,{"$f":"IF(AND(CALC.D!$T$6<>\"\"),(CALC.D!$T$6*P71),0)","v":0},{"$f":"IF(R71<=O71,R71*Q71,IF(R71>O71,O71*Q71,0))","v":0},{"$f":"S71+S72","v":0}]
[null,"CALC.","MAIORES","VALORES",null,"CALC.","MAIORES","VALORES",null,null,null,null,null,null,20000,20,0.4,{"$f":"IF(AND(CALC.D!$T$6<>\"\"),(CALC.D!$T$6*P72),0)","v":0},{"$f":"IF(R72>O72,((R72-O72)*Q72),0)","v":0},{"$f":"S72+S71","v":0}]
[null,{"$f":"IF(AND(CALC.D!$L$33<>\"\",CALC.D!$N$33<>\"\",CALC.D!$T$33<>\"\",CALC.D!$V$33<>\"\",$D$7=2),CALC.D!$Z$21/CALC.D!$T$33,\"\")","v":""},"MAIOR",{"$f":"IF(D76>0,(LARGE(B73:B79,1)),\"\")","v":""},null,{"$f":"IF(AND(CALC.D!$L$33<>\"\",CALC.D!$N$33<>\"\",CALC.D!$T$33<>\"\",CALC.D!$V$33<>\"\",$D$7=1),CALC.D!$AA$21/CALC.D!$T$33,\"\")","v":""},"MAIOR",{"$f":"IF(H76>0,(LARGE(F73:F79,1)),\"\")","v":""},null,null,null,null,null,13,1000,10,1,{"$f":"IF(AND(CALC.D!$T$6<>\"\"),(CALC.D!$T$6*P73*Q73),0)","v":0},{"$f":"R73*Q73","v":0},{"$f":"S73","v":0}]
[null,{"$f":"IF(AND(CALC.D!$L$34<>\"\",CALC.D!$N$34<>\"\",CALC.D!$T$34<>\"\",CALC.D!$V$34<>\"\",$D$7=2),CALC.D!$Z$22/CALC.D!$T$34,\"\")","v":""},"SOMA",{"$f":"IF(D76>=1,(SUM(H82:H88)-D73),\"\")","v":""},null,{"$f":"IF(AND(CALC.D!$L$34<>\"\",CALC.D!$N$34<>\"\",CALC.D!$T$34<>\"\",CALC.D!$V$34<>\"\",$D$7=1),CALC.D!$AA$22/CALC.D!$T$34,\"\")","v":""},"SOMA",{"$f":"IF(H76>=1,(SUM(H82:H88)-H73),\"\")","v":""},null,null,null,null,null,14,1000,20,1,{"$f":"IF(AND(CALC.D!$T$6<>\"\"),(CALC.D!$T$6*P74*Q74),0)","v":0},{"$f":"R74*Q74","v":0},{"$f":"S74","v":0}]
[null,{"$f":"IF(AND(CALC.D!$L$35<>\"\",CALC.D!$N$35<>\"\",CALC.D!$T$35<>\"\",CALC.D!$V$35<>\"\",$D$7=2),CALC.D!$Z$23/CALC.D!$T$35,\"\")","v":""},null,null,null,{"$f":"IF(AND(CALC.D!$L$35<>\"\",CALC.D!$N$35<>\"\",CALC.D!$T$35<>\"\",CALC.D!$V$35<>\"\",$D$7=1),CALC.D!$AA$23/CALC.D!$T$35,\"\")","v":""},null,null,null,null,null,null,null,"POTENCIA INSTALADA W/m²",null,null,{"$f":"IF(AND(CALC.D!C6=\"COMERCIAL\",D7=1,CALC.D!$G$6<>TABELAS!AN40),VLOOKUP(Q76,N58:T74,5,FALSE),IF(AND(CALC.D!C6=\"COMERCIAL\",D7=1,CALC.D!$G$6=TABELAS!AN40),(VLOOKUP(Q76,N58:T74,5,FALSE))+(CALC.D!T8*700),0))","v":0},"POTENCIA INSTALADA PELA SOMA DOS EQUIPAMENTOS"]
[null,{"$f":"IF(AND(CALC.D!$L$36<>\"\",CALC.D!$N$36<>\"\",CALC.D!$T$36<>\"\",CALC.D!$V$36<>\"\",$D$7=2),CALC.D!$Z$24/CALC.D!$T$36,\"\")","v":""},null,{"$f":"COUNTIF(B73:B79,\">0\")","v":0},null,{"$f":"IF(AND(CALC.D!$L$36<>\"\",CALC.D!$N$36<>\"\",CALC.D!$T$36<>\"\",CALC.D!$V$36<>\"\",$D$7=1),CALC.D!$AA$24/CALC.D!$T$36,\"\")","v":""},null,{"$f":"COUNTIF(F73:F79,\">0\")","v":0},null,null,null,null,null,"INSTALAÇÃO COMERCIAL",null,null,{"$f":"IF(AND(CALC.D!C6=\"COMERCIAL\",D7=1),VLOOKUP(CALC.D!G6,TABELAS!AN39:AU50,8,FALSE),0)","v":0}]
[null,{"$f":"IF(AND(CALC.D!$L$37<>\"\",CALC.D!$N$37<>\"\",CALC.D!$T$37<>\"\",CALC.D!$V$37<>\"\",$D$7=2),CALC.D!$Z$25/CALC.D!$T$37,\"\")","v":""},"MAIOR",{"$f":"IF(D73<>\"\",D73*D79,0)","v":0},null,{"$f":"IF(AND(CALC.D!$L$37<>\"\",CALC.D!$N$37<>\"\",CALC.D!$T$37<>\"\",CALC.D!$V$37<>\"\",$D$7=1),CALC.D!$AA$25/CALC.D!$T$37,\"\")","v":""},"MAIOR",{"$f":"IF(H73<>\"\",H73*H79,0)","v":0},null,null,null,null,null,"DEMANDA PELA TABELA",null,null,{"$f":"IF(AND(CALC.D!C6=\"COMERCIAL\",D7=1),(VLOOKUP(Q76,N58:T74,4,FALSE))*Q75,0)","v":0},{"$f":"IF(AND($D$6<>\"\",$C$5<>\"\",CALC.D!$AB$19=2,D7=1),SUM(CALC.D!$J$21:$J$30),0)","v":0}]
[null,{"$f":"IF(AND(CALC.D!$L$38<>\"\",CALC.D!$N$38<>\"\",CALC.D!$T$38<>\"\",CALC.D!$V$38<>\"\",$D$7=2),CALC.D!$Z417/CALC.D!$T$38,\"\")","v":""},"SOMA",{"$f":"IF(D74<>\"\",D74*D80,0)","v":0},null,{"$f":"IF(AND(CALC.D!$L$38<>\"\",CALC.D!$N$38<>\"\",CALC.D!$T$38<>\"\",CALC.D!$V$38<>\"\",$D$7=1),CALC.D!$AA$26/CALC.D!$T$38,\"\")","v":""},"SOMA",{"$f":"IF(H74<>\"\",H74*H80,0)","v":0},null,null,null,null,null,"DEMANDA PELA SOMA",null,null,{"$f":"IF(AND(CALC.D!C6=\"COMERCIAL\",D7=1),D18,0)","v":0}]
[null,{"$f":"IF(AND(CALC.D!$L$39<>\"\",CALC.D!$N$39<>\"\",CALC.D!$T$39<>\"\",CALC.D!$V$39<>\"\",$D$7=2),CALC.D!$Z$27/CALC.D!$T428,\"\")","v":""},"FD",1,null,{"$f":"IF(AND(CALC.D!$L$39<>\"\",CALC.D!$N$39<>\"\",CALC.D!$T$39<>\"\",CALC.D!$V$39<>\"\",$D$7=1),CALC.D!$AA$27/CALC.D!$T$39,\"\")","v":""},"FD",1]
[null,"VAZIO","FD",{"$f":"IF(AND($D$7<>\"\",D74<>\"\"),VLOOKUP(D84,J51:K55,2,FALSE),0)","v":0},null,"VAZIO","FD",0.5]
[null,"POTENCIA INSTALADA",null,{"$f":"IF(AND($D$6<>\"\",$C$5<>\"\"),SUM(CALC.D!V33:V39),0)","v":0},null,"QUANTIDADE CERIM E CPFL",null,null,null,null,null,null,null,"CALCULO DE DEMANDA PARA INDUSTRIAS"]
[null,null,null,null,null,{"$f":"IF(AND(CALC.D!$C$6<>\"\",CALC.D!$G$6<>\"\",$D$6<>\"\",$D$7<>\"\",CALC.D!$L33<>\"\",CALC.D!$N33<>\"\"),CALC.D!N33,\"\")","v":""},{"$f":"IF(AND(CALC.D!$C$6<>\"\",CALC.D!$G$6<>\"\",$D$6<>\"\",$D$7<>\"\",CALC.D!$L33<>\"\",CALC.D!$N33<>\"\"),CALC.D!T33,\"\")","v":""},{"$f":"IF(AND(CALC.D!$C$6<>\"\",CALC.D!$G$6<>\"\",$D$6<>\"\",$D$7<>\"\",$D$7=2,CALC.D!$L33<>\"\",CALC.D!$N33<>\"\"),CALC.D!Z21,IF(AND(CALC.D!$C$6<>\"\",CALC.D!$G$6<>\"\",$D$6<>\"\",$D$7<>\"\",$D$7=1,CALC.D!$L33<>\"\",CALC.D!$N33<>\"\"),G82*F73,\"\"))","v":""},null,null,null,null,null,"POTENCIA INSTALADA",null,{"$f":"IF(AND(CALC.D!C6=\"INDUSTRIAL\",CALC.D!C6<>\"\",CALC.D!N8>0),CALC.D!T6*CALC.D!N8,0)","v":0}]
[null,"Nº DE APARELHOS",null,{"$f":"IF(D81>0,SUM(CALC.D!T33:U39),0)","v":0},null,{"$f":"IF(AND(CALC.D!$C$6<>\"\",CALC.D!$G$6<>\"\",$D$6<>\"\",$D$7<>\"\",CALC.D!$L34<>\"\",CALC.D!$N34<>\"\"),CALC.D!N34,\"\")","v":""},{"$f":"IF(AND(CALC.D!$C$6<>\"\",CALC.D!$G$6<>\"\",$D$6<>\"\",$D$7<>\"\",CALC.D!$L34<>\"\",CALC.D!$N34<>\"\"),CALC.D!T34,\"\")","v":""},{"$f":"IF(AND(CALC.D!$C$6<>\"\",CALC.D!$G$6<>\"\",$D$6<>\"\",$D$7<>\"\",$D$7=2,CALC.D!$L34<>\"\",CALC.D!$N34<>\"\"),CALC.D!Z22,IF(AND(CALC.D!$C$6<>\"\",CALC.D!$G$6<>\"\",$D$6<>\"\",$D$7<>\"\",$D$7=1,CALC.D!$L34<>\"\",CALC.D!$N34<>\"\"),G83*F74,\"\"))","v":""},null,null,null,null,null,"FATOR DE DEMANDA",null,1]
[null,null,null,{"$f":"IF(D83>5,5,D83)","v":0},null,{"$f":"IF(AND(CALC.D!$C$6<>\"\",CALC.D!$G$6<>\"\",$D$6<>\"\",$D$7<>\"\",CALC.D!$L35<>\"\",CALC.D!$N35<>\"\"),CALC.D!N35,\"\")","v":""},{"$f":"IF(AND(CALC.D!$C$6<>\"\",CALC.D!$G$6<>\"\",$D$6<>\"\",$D$7<>\"\",CALC.D!$L35<>\"\",CALC.D!$N35<>\"\"),CALC.D!T35,\"\")","v":""},{"$f":"IF(AND(CALC.D!$C$6<>\"\",CALC.D!$G$6<>\"\",$D$6<>\"\",$D$7<>\"\",$D$7=2,CALC.D!$L35<>\"\",CALC.D!$N35<>\"\"),CALC.D!Z23,IF(AND(CALC.D!$C$6<>\"\",CALC.D!$G$6<>\"\",$D$6<>\"\",$D$7<>\"\",$D$7=1,CALC.D!$L35<>\"\",CALC.D!$N35<>\"\"),G84*F75,\"\"))","v":""},null,null,null,null,null,"DEMANDA",null,{"$f":"P82*P83","v":0}]
[null,"FATOR DE DEMANDA",null,{"$f":"IF(D81>0,IF(D81<=1000,0,IF(AND(D81>1000,D81<=2000),1000,IF(AND(D81>2000,D81<=3000),2000,IF(AND(D81>3000,D81<=4000),3000,IF(AND(D81>3000,D81<=4000),3000,IF(AND(D81>4000,D81<=5000),4000,IF(AND(D81>5000,D81<=6000),5000,IF(AND(D81>6000,D81<=7000),6000,IF(AND(D81>7000,D81<=8000),7000,IF(AND(D81>8000,D81<=7000),8000,IF(AND(D81>9000,D81<=10000),9000,IF(AND(D81>10000),10000,\"\")))))))))))),0)","v":0},null,{"$f":"IF(AND(CALC.D!$C$6<>\"\",CALC.D!$G$6<>\"\",$D$6<>\"\",$D$7<>\"\",CALC.D!$L36<>\"\",CALC.D!$N36<>\"\"),CALC.D!N36,\"\")","v":""},{"$f":"IF(AND(CALC.D!$C$6<>\"\",CALC.D!$G$6<>\"\",$D$6<>\"\",$D$7<>\"\",CALC.D!$L36<>\"\",CALC.D!$N36<>\"\"),CALC.D!T36,\"\")","v":""},{"$f":"IF(AND(CALC.D!$C$6<>\"\",CALC.D!$G$6<>\"\",$D$6<>\"\",$D$7<>\"\",$D$7=2,CALC.D!$L36<>\"\",CALC.D!$N36<>\"\"),CALC.D!Z24,IF(AND(CALC.D!$C$6<>\"\",CALC.D!$G$6<>\"\",$D$6<>\"\",$D$7<>\"\",$D$7=1,CALC.D!$L36<>\"\",CALC.D!$N36<>\"\"),G85*F76,\"\"))","v":""}]
[null,null,null,null,null,{"$f":"IF(AND(CALC.D!$C$6<>\"\",CALC.D!$G$6<>\"\",$D$6<>\"\",$D$7<>\"\",CALC.D!$L37<>\"\",CALC.D!$N37<>\"\"),CALC.D!N37,\"\")","v":""},{"$f":"IF(AND(CALC.D!$C$6<>\"\",CALC.D!$G$6<>\"\",$D$6<>\"\",$D$7<>\"\",CALC.D!$L37<>\"\",CALC.D!$N37<>\"\"),CALC.D!T37,\"\")","v":""},{"$f":"IF(AND(CALC.D!$C$6<>\"\",CALC.D!$G$6<>\"\",$D$6<>\"\",$D$7<>\"\",$D$7=2,CALC.D!$L37<>\"\",CALC.D!$N37<>\"\"),CALC.D!Z25,IF(AND(CALC.D!$C$6<>\"\",CALC.D!$G$6<>\"\",$D$6<>\"\",$D$7<>\"\",$D$7=1,CALC.D!$L37<>\"\",CALC.D!$N37<>\"\"),G86*F77,\"\"))","v":""},null,null,null,null,null,"CALCULO DE DEMANDA PARA RURAIS"]
[null,null,null,null,null,{"$f":"IF(AND(CALC.D!$C$6<>\"\",CALC.D!$G$6<>\"\",$D$6<>\"\",$D$7<>\"\",CALC.D!$L38<>\"\",CALC.D!$N38<>\"\"),CALC.D!N38,\"\")","v":""},{"$f":"IF(AND(CALC.D!$C$6<>\"\",CALC.D!$G$6<>\"\",$D$6<>\"\",$D$7<>\"\",CALC.D!$L38<>\"\",CALC.D!$N38<>\"\"),CALC.D!T38,\"\")","v":""},{"$f":"IF(AND(CALC.D!$C$6<>\"\",CALC.D!$G$6<>\"\",$D$6<>\"\",$D$7<>\"\",$D$7=2,CALC.D!$L38<>\"\",CALC.D!$N38<>\"\"),CALC.D!Z26,IF(AND(CALC.D!$C$6<>\"\",CALC.D!$G$6<>\"\",$D$6<>\"\",$D$7<>\"\",$D$7=1,CALC.D!$L38<>\"\",CALC.D!$N38<>\"\"),G87*F78,\"\"))","v":""},null,null,null,null,null,"POTENCIA INSTALADA",null,{"$f":"IF(AND(CALC.D!C6=\"RURAL\",CALC.D!C6<>\"\",CALC.D!N8>0,D7=1),CALC.D!T6*CALC.D!N8,0)","v":0}]
[null,null,null,null,null,{"$f":"IF(AND(CALC.D!$C$6<>\"\",CALC.D!$G$6<>\"\",$D$6<>\"\",$D$7<>\"\",CALC.D!$L39<>\"\",CALC.D!$N39<>\"\"),CALC.D!N39,\"\")","v":""},{"$f":"IF(AND(CALC.D!$C$6<>\"\",CALC.D!$G$6<>\"\",$D$6<>\"\",$D$7<>\"\",CALC.D!$L39<>\"\",CALC.D!$N39<>\"\"),CALC.D!T39,\"\")","v":""},{"$f":"IF(AND(CALC.D!$C$6<>\"\",CALC.D!$G$6<>\"\",$D$6<>\"\",$D$7<>\"\",$D$7=2,CALC.D!$L39<>\"\",CALC.D!$N39<>\"\"),CALC.D!Z27,IF(AND(CALC.D!$C$6<>\"\",CALC.D!$G$6<>\"\",$D$6<>\"\",$D$7<>\"\",$D$7=1,CALC.D!$L39<>\"\",CALC.D!$N39<>\"\"),G88*F79,\"\"))","v":""},null,null,null,null,null,"FATOR DE DEMANDA",null,1]
[null,null,null,null,null,null,null,null,null,null,null,null,null,"DEMANDA",null,{"$f":"P87*P88","v":0}]

{"sheet":"DIMENSIONAMENTO","index":2,"n_rows":105,"n_cols":73,"rows_kept":105,"cut":false,"hidden":true,"merged":[[76,0,76,24],[41,4,41,8],[41,9,41,10],[37,0,38,16],[40,0,40,16],[42,12,42,16],[43,12,44,16],[46,0,46,16],[27,48,30,48],[27,46,30,46],[31,46,33,46],[31,48,33,48],[45,46,48,46],[41,48,44,48],[41,46,44,46],[39,46,40,46],[39,48,40,48],[34,46,36,46],[22,14,27,15],[28,14,29,15],[31,0,31,10],[47,9,47,11],[47,12,47,16],[48,9,48,11],[17,46,20,46],[17,48,20,48],[21,48,24,48],[21,46,24,46],[34,48,36,48],[37,46,38,46],[37,48,38,48],[25,47,25,49],[0,61,0,68],[7,46,9,46],[7,48,9,48],[13,48,14,48],[13,46,14,46],[10,46,12,46],[15,46,16,46],[15,48,16,48],[10,48,12,48],[0,50,0,59],[13,39,13,40],[1,47,1,49],[1,0,1,17],[0,19,0,24],[1,26,1,42],[2,40,3,40],[2,42,3,42],[2,3,3,3],[2,4,3,4],[2,8,3,8],[2,9,3,9],[2,17,3,17],[1,19,2,20],[2,10,3,10],[2,11,3,11],[2,16,3,16],[2,5,2,7],[2,41,3,41],[2,12,2,13],[2,14,2,15],[3,48,6,48],[3,46,6,46],[10,26,10,27],[10,28,10,30],[102,53,104,53],[102,55,104,55],[2,2,3,2],[91,54,91,56],[93,53,95,53],[93,55,95,55],[96,53,98,53],[96,55,98,55],[99,53,101,53],[99,55,101,55],[77,54,77,56],[79,53,81,53],[79,55,81,55],[82,53,84,53],[82,55,84,55],[85,53,87,53],[85,55,87,55],[88,53,90,53],[88,55,90,55],[89,5,89,6],[92,20,92,22],[93,20,93,22],[84,20,84,22],[45,48,48,48],[80,48,81,48],[80,49,81,49],[94,23,94,24],[91,23,91,24],[92,23,92,24],[93,23,93,24],[89,23,89,24],[90,23,90,24],[77,26,77,37],[87,33,87,34],[87,35,87,37],[87,38,87,40],[87,41,87,43],[80,47,81,47],[87,23,87,24],[88,23,88,24],[81,23,81,24],[82,23,82,24],[77,23,78,24],[79,23,79,24],[80,23,80,24],[83,23,83,24],[84,23,84,24],[85,23,85,24],[86,23,86,24],[86,20,86,22],[85,20,85,22],[80,20,80,22],[81,20,81,22],[82,20,82,22],[83,20,83,22],[87,20,87,22],[77,10,79,10],[77,11,78,11],[88,20,88,22],[87,5,87,6],[88,5,88,6],[94,20,94,22],[77,19,78,22],[90,5,90,6],[91,5,91,6],[92,5,92,6],[94,5,94,6],[77,5,79,6],[77,12,77,15],[77,7,78,9],[78,12,78,13],[78,14,78,15],[93,5,93,6],[84,5,84,6],[85,5,85,6],[86,5,86,6],[91,20,91,22],[89,20,89,22],[90,20,90,22],[10,34,10,36],[78,35,78,45],[78,26,79,28],[78,33,79,34],[77,16,78,17],[79,20,79,22],[17,0,18,45],[19,0,19,17],[20,2,21,2],[20,3,21,3],[20,4,21,4],[20,5,20,7],[20,8,21,8],[20,9,21,9],[20,10,21,10],[20,11,21,11],[20,12,20,13],[20,16,21,16],[20,17,21,17],[20,14,21,15],[77,0,79,2],[77,3,79,3],[77,4,79,4],[77,18,79,18],[54,0,54,16],[55,0,55,4],[55,5,55,9],[55,10,55,16],[56,0,56,4],[56,5,56,9],[56,10,56,16],[48,12,48,16],[10,31,10,33],[50,0,50,16],[51,0,51,2],[52,0,52,2],[51,3,51,5],[52,3,52,5],[51,6,51,9],[51,10,51,16],[52,6,52,9],[52,10,52,16]]}
[null,null,null,null,null,null,null,null,null,null,null,null,null,null,null,null,null,null,null,"MOTORES",null,null,null,null,null,null,null,null,null,null,null,null,null,null,null,null,null,null,null,null,null,null,null,null,null,null,null,null,null,null,"DIMENSIONANDO O PADRÃO DE ENTRADA PARAS AS TABELAS 1A/1C/1D/1E",null,null,null,null,null,null,null,null,null,null,"DIMENSIONANDO O PADRÃO DE ENTRADA PARA A TABELA 1B (TENSÃO EM 220/380V)"]
["NORMA CPFL PIRATININGA - TABELA 1A/ 1C/ 1D/ 1E CPFL",null,null,null,null,null,null,null,null,null,null,null,null,null,null,null,null,null,null,"Descrição",null,null,"FN","FF","FFFN",null,"MOTORES",null,null,null,null,null,null,null,null,null,null,null,null,null,null,null,null,"MONO","BIFASI","TRIF","FACE A",{"$f":"IF(AND(CALC.D!AB15=0,CALC.D!E64=TABELAS!A61,CALC.D!G59<>\"\"),VLOOKUP(AW4,AX4:BH7,AX3,FALSE),IF(AND(CALC.D!AB15=0,CALC.D!E64=TABELAS!A66,CALC.D!G59<>\"\"),VLOOKUP(AW18,AX18:BH21,AX3,FALSE),IF(AND(CALC.D!AB15=0,CALC.D!E64=TABELAS!A67,CALC.D!G59<>\"\"),VLOOKUP(AW22,AX22:BH25,AX3,FALSE),IF(AND(CALC.D!AB15=0,CALC.D!E64=TABELAS!A62,CALC.D!G59<>\"\"),VLOOKUP(AW8,AX8:BH10,AX3,FALSE),IF(AND(CALC.D!AB15=0,CALC.D!E64=TABELAS!A63,CALC.D!G59<>\"\"),VLOOKUP(AW11,AX11:BH13,AX3,FALSE),IF(AND(CALC.D!AB15=0,CALC.D!E64=TABELAS!A64,CALC.D!G59<>\"\"),VLOOKUP(AW14,AX14:BH15,AX3,FALSE),IF(AND(CALC.D!AB15=0,CALC.D!E64=TABELAS!A65,CALC.D!G59<>\"\"),VLOOKUP(AW16,AX16:BH17,AX3,FALSE),IF(AND(CALC.D!AB15=1,CALC.D!E64=TABELAS!A61,CALC.D!G59<>\"\"),VLOOKUP(AW4,BI4:BQ7,AX3,FALSE),IF(AND(CALC.D!AB15=1,CALC.D!E64=TABELAS!A66,CALC.D!G59<>\"\"),VLOOKUP(AW18,BI18:BQ21,AX3,FALSE),IF(AND(CALC.D!AB15=1,CALC.D!E64=TABELAS!A67,CALC.D!G59<>\"\"),VLOOKUP(AW22,BI22:BQ25,AX3,FALSE),IF(AND(CALC.D!AB15=1,CALC.D!E64=TABELAS!A62,CALC.D!G59<>\"\"),VLOOKUP(AW8,BI8:BQ10,AX3,FALSE),IF(AND(CALC.D!AB15=1,CALC.D!E64=TABELAS!A63,CALC.D!G59<>\"\"),VLOOKUP(AW11,BI11:BQ13,AX3,FALSE),IF(AND(CALC.D!AB15=1,CALC.D!E64=TABELAS!A64,CALC.D!G59<>\"\"),VLOOKUP(AW14,BI14:BQ15,AX3,FALSE),IF(AND(CALC.D!AB15=1,CALC.D!E64=TABELAS!A64,CALC.D!G59<>\"\"),VLOOKUP(AW16,BI16:BQ17,AX3,FALSE),\"\"))))))))))))))","v":""},null,null,"A1 MONOFÁSICO","A2 MONOFÁSICO","B1 BIFÁSICO","B2 BIFÁSICO","C1 TRIFÁSICO","C2 TRIFÁSICO","C3 TRIFÁSICO","C4 TRIFÁSICO","C5 TRIFÁSICO","C6 TRIFÁSICO",null,"A3 MONOFÁSICO","A4 MONOFÁSICO","B3 BIFÁSICO","C7 TRIFÁSICO","C8 TRIFÁSICO","C9 TRIFÁSICO","C10 TRIFÁSICO","C11 TRIFÁSICO"]
[null,null,"CATEGORIA","CARGA INSTALADA","DEMANDA","LIMITAÇÃO DOS MOTORES",null,null,"CABOS","CAIXA","DISJUNTOR","ELETRODUTO","ATERRAMENTO",null,"POSTE PADRÃO",null,"PONTALETE","RAMAL DE LIGAÇÃO",null,null,null,null,"Potencia","Potencia","Potencia",null,"TOTAL",null,"MONO","UNIT","QTDE","BIFASI","UNIT","QTDE","TRIF","UNIT","QTDE","POT. GERAL","CV","PESO","MAIOR MONO","MAIOR BIFASI","MAIOR TRIF",{"$f":"IF(AND(CALC.D!$L$33<>\"\",CALC.D!$L$33=\"MONOFÁSICO FN\",CALC.D!$AB$20=2),VLOOKUP(\"MONOFÁSICO FN\",CALC.D!$L$33:$V$33,11,FALSE),0)","v":0},{"$f":"IF(AND(CALC.D!$L$33<>\"\",CALC.D!$L$33=\"BIFÁSICO FFN\",CALC.D!$AB$20=2),VLOOKUP(\"BIFÁSICO FFN\",CALC.D!$L$33:$V$33,11,FALSE),0)","v":0},{"$f":"IF(AND(CALC.D!$L$33<>\"\",CALC.D!$L$33=\"TRIFÁSICO FFFN\",CALC.D!$AB$20=2),VLOOKUP(\"TRIFÁSICO FFFN\",CALC.D!$L$33:$V$33,11,FALSE),0)","v":0},"LIGAÇÕES",{"$f":"IF(AND(CALC.D!E64<>\"\",CALC.D!$AB$20=2),VLOOKUP(CALC.D!$E$64,TABELAS!$A$60:$C$67,3,FALSE),\"\")","v":2},"FACE A",{"$f":"IF(CALC.D!G59<>\"\",HLOOKUP(CALC.D!$G$59,DIMENSIONAMENTO!AY2:BQ3,2,FALSE),\"\")","v":""},2,3,4,5,6,7,8,9,10,11,null,2,3,4,5,6,7,8,9]
[null,null,null,null,null,"FN","FF","FFFN",null,null,null,null,"CONDUTOR","ELETRODUTO","FACE A","FACE B",null,null,null,"1CV",1,1560,{"$f":"CALC.D!AI27","v":1560},"x","X","1CV",{"$f":"IF(AND(CALC.D!$N$33<>\"\",CALC.D!$L$33<>\"\",CALCULO!$D$7=2,CALC.D!$T$33>0,CALC.D!$AB$20=2),CALC.D!$V$33/CALC.D!$T$33,0)","v":0},{"$f":"IF(AND(AA4>0,CALC.D!$AB$20=2),IF(AA4<=$W$4,$W$4,IF(AA4<=$W$5,$W$5,IF(AA4<=$W$6,$W$6,IF(AA4<=$W$7,$W$7,IF(AA4<=$W$8,$W$8,IF(AA4<=$X$9,$X$9,IF(AA4<=$X$10,$X$10,IF(AA4<=$X$11,$X$11,IF(AA4<=$Y$12,$Y$12,IF(AA4<=$Y$13,$Y$13,IF(AA4<=$Y$14,$Y$14,IF(AA4<=$Y$15,$Y$15,IF(AA4<=$Y$16,$Y$16))))))))))))),0)","v":0},{"$f":"IF(AND(CALC.D!$L$33<>\"\",CALC.D!$N$33<>\"\",CALC.D!$T$33<>\"\",CALC.D!$L$33=\"MONOFÁSICO FN\",CALC.D!$AB$20=2),VLOOKUP(\"MONOFÁSICO FN\",CALC.D!$L$33:$V$33,11,FALSE),\"\")","v":""},{"$f":"IF(AND(AC4<>\"\",AE4<>\"\"),AC4/AE4,\"\")","v":""},{"$f":"IF(AND(AC4<>\"\",CALC.D!$AB$20=2),CALC.D!T33,\"\")","v":""},{"$f":"IF(AND(CALC.D!$L$33<>\"\",CALC.D!$N$33<>\"\",CALC.D!$T$33<>\"\",CALC.D!$L$33=\"BIFÁSICO FFN\",CALC.D!$AB$20=2),VLOOKUP(\"BIFÁSICO FFN\",CALC.D!$L$33:$V$33,11,FALSE),\"\")","v":""},{"$f":"IF(AND(AF4<>\"\",AH4<>\"\"),AF4/AH4,\"\")","v":""},{"$f":"IF(AND(AF4<>\"\",CALC.D!$AB$20=2),CALC.D!T33,\"\")","v":""},{"$f":"IF(AND(CALC.D!$L$33<>\"\",CALC.D!$N$33<>\"\",CALC.D!$T$33<>\"\",CALC.D!$L$33=\"TRIFÁSICO FFFN\",CALC.D!$AB$20=2),VLOOKUP(\"TRIFÁSICO FFFN\",CALC.D!$L$33:$V$33,11,FALSE),\"\")","v":""},{"$f":"IF(AND(AI4<>\"\",AK4<>\"\"),AI4/AK4,\"\")","v":""},{"$f":"IF(AND(AI4<>\"\",CALC.D!$AB$20=2),CALC.D!T33,\"\")","v":""},"POTENCIA","CV","PESO",null,null,null,{"$f":"IF(AND(CALC.D!$L$34<>\"\",CALC.D!$L$34=\"MONOFÁSICO FN\",CALC.D!$AB$20=2),VLOOKUP(\"MONOFÁSICO FN\",CALC.D!$L$34:$V$34,11,FALSE),0)","v":0},{"$f":"IF(AND(CALC.D!$L$34<>\"\",CALC.D!$L$34=\"BIFÁSICO FFN\",CALC.D!$AB$20=2),VLOOKUP(\"BIFÁSICO FFN\",CALC.D!$L$34:$V$34,11,FALSE),0)","v":0},{"$f":"IF(AND(CALC.D!$L$34<>\"\",CALC.D!$L$34=\"TRIFÁSICO FFFN\",CALC.D!$AB$20=2),VLOOKUP(\"TRIFÁSICO FFFN\",CALC.D!$L$34:$V$34,11,FALSE),0)","v":0},"POSTE PADRÃO",1,{"$f":"IF(CALC.D!$E$64=TABELAS!A61,VLOOKUP(CALC.D!$F$10,$AV$4:$AX$7,3,FALSE),0)","v":{"$error":"#N/A"}},1,{"$f":"IF(AND(CALC.D!$C$6<>\"\",CALC.D!$G$6<>\"\",CALC.D!$R$2<>\"\",CALC.D!$AB$20=2,CALC.D!$F$10<>\"\",CALC.D!$E$64<>\"\"),IF(AND($AV$3=2,CALC.D!$G$59=$AY$2,CALC.D!$F$10=1),TABELAS!$C$79,0))","v":false},{"$f":"IF(AND(CALC.D!$C$6<>\"\",CALC.D!$G$6<>\"\",CALC.D!$R$2<>\"\",CALC.D!$AB$20=2,CALC.D!$F$10<>\"\",CALC.D!$E$64<>\"\"),IF(AND($AV$3=2,CALC.D!$G$59=$AZ$2,CALC.D!$F$10=1),TABELAS!$C$80,0))","v":false},{"$f":"IF(AND(CALC.D!$C$6<>\"\",CALC.D!$G$6<>\"\",CALC.D!$R$2<>\"\",CALC.D!$AB$20=2,CALC.D!$F$10<>\"\",CALC.D!$E$64<>\"\"),IF(AND($AV$3=2,CALC.D!$G$59=$BA$2,CALC.D!$F$10=1),TABELAS!$C$83,0))","v":false},{"$f":"IF(AND(CALC.D!$C$6<>\"\",CALC.D!$G$6<>\"\",CALC.D!$R$2<>\"\",CALC.D!$AB$20=2,CALC.D!$F$10<>\"\",CALC.D!$E$64<>\"\"),IF(AND($AV$3=2,CALC.D!$G$59=$BB$2,CALC.D!$F$10=1),TABELAS!$C$84,0))","v":false},{"$f":"IF(AND(CALC.D!$C$6<>\"\",CALC.D!$G$6<>\"\",CALC.D!$R$2<>\"\",CALC.D!$AB$20=2,CALC.D!$F$10<>\"\",CALC.D!$E$64<>\"\"),IF(AND($AV$3=2,CALC.D!$G$59=$BC$2,CALC.D!$F$10=1),TABELAS!$C$86,0))","v":false},{"$f":"IF(AND(CALC.D!$C$6<>\"\",CALC.D!$G$6<>\"\",CALC.D!$R$2<>\"\",CALC.D!$AB$20=2,CALC.D!$F$10<>\"\",CALC.D!$E$64<>\"\"),IF(AND($AV$3=2,CALC.D!$G$59=$BD$2,CALC.D!$F$10=1),TABELAS!$C$87,0))","v":false},{"$f":"IF(AND(CALC.D!$C$6<>\"\",CALC.D!$G$6<>\"\",CALC.D!$R$2<>\"\",CALC.D!$AB$20=2,CALC.D!$F$10<>\"\",CALC.D!$E$64<>\"\"),IF(AND($AV$3=2,CALC.D!$G$59=$BE$2,CALC.D!$F$10=1),TABELAS!$C$88,0))","v":false},{"$f":"IF(AND(CALC.D!$C$6<>\"\",CALC.D!$G$6<>\"\",CALC.D!$R$2<>\"\",CALC.D!$AB$20=2,CALC.D!$F$10<>\"\",CALC.D!$E$64<>\"\"),IF(AND($AV$3=2,CALC.D!$G$59=$BF$2,CALC.D!$F$10=1),TABELAS!$C$89,0))","v":false},{"$f":"IF(AND(CALC.D!$C$6<>\"\",CALC.D!$G$6<>\"\",CALC.D!$R$2<>\"\",CALC.D!$AB$20=2,CALC.D!$F$10<>\"\",CALC.D!$E$64<>\"\"),IF(AND($AV$3=2,CALC.D!$G$59=$BG$2,CALC.D!$F$10=1),TABELAS!$C$90,0))","v":false},{"$f":"IF(AND(CALC.D!$C$6<>\"\",CALC.D!$G$6<>\"\",CALC.D!$R$2<>\"\",CALC.D!$AB$20=2,CALC.D!$F$10<>\"\",CALC.D!$E$64<>\"\"),IF(AND($AV$3=2,CALC.D!$G$59=$BH$2,CALC.D!$F$10=1),TABELAS!$C$91,0))","v":false},1,{"$f":"IF(AND(CALC.D!$C$6<>\"\",CALC.D!$G$6<>\"\",CALC.D!$R$2<>\"\",CALC.D!$AB$20=2,CALC.D!$F$10<>\"\",CALC.D!$E$64<>\"\"),IF(AND($AV$3=2,CALC.D!$G$59=$BJ$2,CALC.D!$F$10=1),TABELAS!$C$81,0))","v":false},{"$f":"IF(AND(CALC.D!$C$6<>\"\",CALC.D!$G$6<>\"\",CALC.D!$R$2<>\"\",CALC.D!$AB$20=2,CALC.D!$F$10<>\"\",CALC.D!$E$64<>\"\"),IF(AND($AV$3=2,CALC.D!$G$59=$BK$2,CALC.D!$F$10=1),TABELAS!$C$82,0))","v":false},{"$f":"IF(AND(CALC.D!$C$6<>\"\",CALC.D!$G$6<>\"\",CALC.D!$R$2<>\"\",CALC.D!$AB$20=2,CALC.D!$F$10<>\"\",CALC.D!$E$64<>\"\"),IF(AND($AV$3=2,CALC.D!$G$59=$BL$2,CALC.D!$F$10=1),TABELAS!$C$85,0))","v":false},{"$f":"IF(AND(CALC.D!$C$6<>\"\",CALC.D!$G$6<>\"\",CALC.D!$R$2<>\"\",CALC.D!$AB$20=2,CALC.D!$F$10<>\"\",CALC.D!$E$64<>\"\"),IF(AND($AV$3=2,CALC.D!$G$59=$BM$2,CALC.D!$F$10=1),TABELAS!$C$92,0))","v":false},{"$f":"IF(AND(CALC.D!$C$6<>\"\",CALC.D!$G$6<>\"\",CALC.D!$R$2<>\"\",CALC.D!$AB$20=2,CALC.D!$F$10<>\"\",CALC.D!$E$64<>\"\"),IF(AND($AV$3=2,CALC.D!$G$59=$BN$2,CALC.D!$F$10=1),TABELAS!$C$93,0))","v":false},{"$f":"IF(AND(CALC.D!$C$6<>\"\",CALC.D!$G$6<>\"\",CALC.D!$R$2<>\"\",CALC.D!$AB$20=2,CALC.D!$F$10<>\"\",CALC.D!$E$64<>\"\"),IF(AND($AV$3=2,CALC.D!$G$59=$BO$2,CALC.D!$F$10=1),TABELAS!$C$94,0))","v":false},{"$f":"IF(AND(CALC.D!$C$6<>\"\",CALC.D!$G$6<>\"\",CALC.D!$R$2<>\"\",CALC.D!$AB$20=2,CALC.D!$F$10<>\"\",CALC.D!$E$64<>\"\"),IF(AND($AV$3=2,CALC.D!$G$59=$BP$2,CALC.D!$F$10=1),TABELAS!$C$95,0))","v":false},{"$f":"IF(AND(CALC.D!$C$6<>\"\",CALC.D!$G$6<>\"\",CALC.D!$R$2<>\"\",CALC.D!$AB$20=2,CALC.D!$F$10<>\"\",CALC.D!$E$64<>\"\"),IF(AND($AV$3=2,CALC.D!$G$59=$BQ$2,CALC.D!$F$10=1),TABELAS!$C$96,0))","v":false}]
[{"$f":"IF(AND(CALC.D!$B$60<=D5,$AO$5<=$W$4,$AL$9=0,$AM$7=0,CALC.D!B62=\"\",CALC.D!$AB$20=2,G49<=3),1,0)","v":0},{"$f":"A5","v":0},"A1 MONOFÁSICO",6,"-",1,null,null,{"$f":"IF(AND(CALC.D!B15<>\"\",OR(CALC.D!AB16=1,CALC.D!AB16=2)),\"6 mm²\",IF(AND(CALC.D!B15<>\"\",CALC.D!AB16=3),\"10 mm²\",\"\"))","v":""},"TIPO: II OU Iv","DJ 32 A","32 mm² OU 1''","6 mm²","20 ou 1/2''","90 MINI ou  MULTI 100","140 MINI OU MULTI 200","60.33x3.35 (DIAMETRO EXT. X ESPESSURA)","10 mm² - Duplex",null,"2CV",2,2970,{"$f":"CALC.D!AI29","v":2970},"x","X","2CV",{"$f":"IF(AND(CALC.D!$N$34<>\"\",CALC.D!$L$34<>\"\",CALCULO!$D$7=2,CALC.D!$T$34>0,CALC.D!$AB$20=2),CALC.D!$V$34/CALC.D!$T$34,0)","v":0},{"$f":"IF(AND(AA5>0,CALC.D!$AB$20=2),IF(AA5<=$W$4,$W$4,IF(AA5<=$W$5,$W$5,IF(AA5<=$W$6,$W$6,IF(AA5<=$W$7,$W$7,IF(AA5<=$W$8,$W$8,IF(AA5<=$X$9,$X$9,IF(AA5<=$X$10,$X$10,IF(AA5<=$X$11,$X$11,IF(AA5<=$Y$12,$Y$12,IF(AA5<=$Y$13,$Y$13,IF(AA5<=$Y$14,$Y$14,IF(AA5<=$Y$15,$Y$15,IF(AA5<=$Y$16,$Y$16))))))))))))),0)","v":0},{"$f":"IF(AND(CALC.D!$L$34<>\"\",CALC.D!$N$34<>\"\",CALC.D!$T$34<>\"\",CALC.D!$L$34=\"MONOFÁSICO FN\",CALC.D!$AB$20=2),VLOOKUP(\"MONOFÁSICO FN\",CALC.D!$L$34:$V$34,11,FALSE),\"\")","v":""},{"$f":"IF(AND(AC5<>\"\",AE5<>\"\"),AC5/AE5,\"\")","v":""},{"$f":"IF(AND(AC5<>\"\",CALC.D!$AB$20=2),CALC.D!T34,\"\")","v":""},{"$f":"IF(AND(CALC.D!$L$34<>\"\",CALC.D!$N$34<>\"\",CALC.D!$T$34<>\"\",CALC.D!$L$34=\"BIFÁSICO FFN\",CALC.D!$AB$20=2),VLOOKUP(\"BIFÁSICO FFN\",CALC.D!$L$34:$V$34,11,FALSE),\"\")","v":""},{"$f":"IF(AND(AF5<>\"\",AH5<>\"\"),AF5/AH5,\"\")","v":""},{"$f":"IF(AND(AF5<>\"\",CALC.D!$AB$20=2),CALC.D!T34,\"\")","v":""},{"$f":"IF(AND(CALC.D!$L$34<>\"\",CALC.D!$N$34<>\"\",CALC.D!$T$34<>\"\",CALC.D!$L$34=\"TRIFÁSICO FFFN\",CALC.D!$AB$20=2),VLOOKUP(\"TRIFÁSICO FFFN\",CALC.D!$L$34:$V$34,11,FALSE),\"\")","v":""},{"$f":"IF(AND(AI5<>\"\",AK5<>\"\"),AI5/AK5,\"\")","v":""},{"$f":"IF(AND(AI5<>\"\",CALC.D!$AB$20=2),CALC.D!T34,\"\")","v":""},{"$f":"LARGE(AO5:AQ5,1)","v":0},{"$f":"IFERROR(IF(AL5>0,VLOOKUP(AL5,V4:Z16,5,FALSE),0),0)","v":0},{"$f":"IFERROR(IF(AL5>0,VLOOKUP(AM5,T4:U16,2,FALSE),0),0)","v":0},{"$f":"IF(AND(AL7>0,CALC.D!$AB$20=2,AR11=0),LARGE(AD4:AD10,1),0)","v":0},{"$f":"(IF(AND(AM7>0,CALC.D!$AB$20=2,AS11=0),LARGE(AG4:AG10,1),0))","v":0},{"$f":"IF(AND(AL9>0,CALC.D!$AB$20=2,AT11=0),LARGE(AI4:AI10,1),0)","v":0},{"$f":"IF(AND(CALC.D!$L$35<>\"\",CALC.D!$L$35=\"MONOFÁSICO FN\",CALC.D!$AB$20=2),VLOOKUP(\"MONOFÁSICO FN\",CALC.D!$L$35:$V$35,11,FALSE),0)","v":0},{"$f":"IF(AND(CALC.D!$L$35<>\"\",CALC.D!$L$35=\"BIFÁSICO FFN\",CALC.D!$AB$20=2),VLOOKUP(\"BIFÁSICO FFN\",CALC.D!$L$35:$V$35,11,FALSE),0)","v":0},{"$f":"IF(AND(CALC.D!$L$35<>\"\",CALC.D!$L$35=\"TRIFÁSICO FFFN\",CALC.D!$AB$20=2),VLOOKUP(\"TRIFÁSICO FFFN\",CALC.D!$L$35:$V$35,11,FALSE),0)","v":0},null,2,null,2,{"$f":"IF(AND(CALC.D!$C$6<>\"\",CALC.D!$G$6<>\"\",CALC.D!$R$2<>\"\",CALC.D!$AB$20=2,CALC.D!$F$10<>\"\",CALC.D!$E$64<>\"\"),IF(AND($AV$3=2,CALC.D!$G$59=$AY$2,CALC.D!$F$10=2),TABELAS!$C$79,0))","v":false},{"$f":"IF(AND(CALC.D!$C$6<>\"\",CALC.D!$G$6<>\"\",CALC.D!$R$2<>\"\",CALC.D!$AB$20=2,CALC.D!$F$10<>\"\",CALC.D!$E$64<>\"\"),IF(AND($AV$3=2,CALC.D!$G$59=$AZ$2,CALC.D!$F$10=2),TABELAS!$C$80,0))","v":false},{"$f":"IF(AND(CALC.D!$C$6<>\"\",CALC.D!$G$6<>\"\",CALC.D!$R$2<>\"\",CALC.D!$AB$20=2,CALC.D!$F$10<>\"\",CALC.D!$E$64<>\"\"),IF(AND($AV$3=2,CALC.D!$G$59=$BA$2,CALC.D!$F$10=2),TABELAS!$C$83,0))","v":false},{"$f":"IF(AND(CALC.D!$C$6<>\"\",CALC.D!$G$6<>\"\",CALC.D!$R$2<>\"\",CALC.D!$AB$20=2,CALC.D!$F$10<>\"\",CALC.D!$E$64<>\"\"),IF(AND($AV$3=2,CALC.D!$G$59=$BB$2,CALC.D!$F$10=2),TABELAS!$C$84,0))","v":false},{"$f":"IF(AND(CALC.D!$C$6<>\"\",CALC.D!$G$6<>\"\",CALC.D!$R$2<>\"\",CALC.D!$AB$20=2,CALC.D!$F$10<>\"\",CALC.D!$E$64<>\"\"),IF(AND($AV$3=2,CALC.D!$G$59=$BC$2,CALC.D!$F$10=2),TABELAS!$C$86,0))","v":false},{"$f":"IF(AND(CALC.D!$C$6<>\"\",CALC.D!$G$6<>\"\",CALC.D!$R$2<>\"\",CALC.D!$AB$20=2,CALC.D!$F$10<>\"\",CALC.D!$E$64<>\"\"),IF(AND($AV$3=2,CALC.D!$G$59=$BD$2,CALC.D!$F$10=2),TABELAS!$C$87,0))","v":false},{"$f":"IF(AND(CALC.D!$C$6<>\"\",CALC.D!$G$6<>\"\",CALC.D!$R$2<>\"\",CALC.D!$AB$20=2,CALC.D!$F$10<>\"\",CALC.D!$E$64<>\"\"),IF(AND($AV$3=2,CALC.D!$G$59=$BE$2,CALC.D!$F$10=2),TABELAS!$C$88,0))","v":false},{"$f":"IF(AND(CALC.D!$C$6<>\"\",CALC.D!$G$6<>\"\",CALC.D!$R$2<>\"\",CALC.D!$AB$20=2,CALC.D!$F$10<>\"\",CALC.D!$E$64<>\"\"),IF(AND($AV$3=2,CALC.D!$G$59=$BF$2,CALC.D!$F$10=2),TABELAS!$C$89,0))","v":false},{"$f":"IF(AND(CALC.D!$C$6<>\"\",CALC.D!$G$6<>\"\",CALC.D!$R$2<>\"\",CALC.D!$AB$20=2,CALC.D!$F$10<>\"\",CALC.D!$E$64<>\"\"),IF(AND($AV$3=2,CALC.D!$G$59=$BG$2,CALC.D!$F$10=2),TABELAS!$C$90,0))","v":false},{"$f":"IF(AND(CALC.D!$C$6<>\"\",CALC.D!$G$6<>\"\",CALC.D!$R$2<>\"\",CALC.D!$AB$20=2,CALC.D!$F$10<>\"\",CALC.D!$E$64<>\"\"),IF(AND($AV$3=2,CALC.D!$G$59=$BH$2,CALC.D!$F$10=2,OR(CALC.D!AB19=1,CALC.D!AB19=2)),TABELAS!$C$91,IF(AND($AV$3=2,CALC.D!$G$59=$BH$2,CALC.D!$F$10=2,CALC.D!AB19=3),\"CONSULTAR AS NORMAS PARA LIGAÇÃO \",0)))","v":false},2,{"$f":"IF(AND(CALC.D!$C$6<>\"\",CALC.D!$G$6<>\"\",CALC.D!$R$2<>\"\",CALC.D!$AB$20=2,CALC.D!$F$10<>\"\",CALC.D!$E$64<>\"\"),IF(AND($AV$3=2,CALC.D!$G$59=$BJ$2,CALC.D!$F$10=2),TABELAS!$C$81,0))","v":false},{"$f":"IF(AND(CALC.D!$C$6<>\"\",CALC.D!$G$6<>\"\",CALC.D!$R$2<>\"\",CALC.D!$AB$20=2,CALC.D!$F$10<>\"\",CALC.D!$E$64<>\"\"),IF(AND($AV$3=2,CALC.D!$G$59=$BK$2,CALC.D!$F$10=2),TABELAS!$C$82,0))","v":false},{"$f":"IF(AND(CALC.D!$C$6<>\"\",CALC.D!$G$6<>\"\",CALC.D!$R$2<>\"\",CALC.D!$AB$20=2,CALC.D!$F$10<>\"\",CALC.D!$E$64<>\"\"),IF(AND($AV$3=2,CALC.D!$G$59=$BL$2,CALC.D!$F$10=2),TABELAS!$C$85,0))","v":false},{"$f":"IF(AND(CALC.D!$C$6<>\"\",CALC.D!$G$6<>\"\",CALC.D!$R$2<>\"\",CALC.D!$AB$20=2,CALC.D!$F$10<>\"\",CALC.D!$E$64<>\"\"),IF(AND($AV$3=2,CALC.D!$G$59=$BM$2,CALC.D!$F$10=2),TABELAS!$C$92,0))","v":false},{"$f":"IF(AND(CALC.D!$C$6<>\"\",CALC.D!$G$6<>\"\",CALC.D!$R$2<>\"\",CALC.D!$AB$20=2,CALC.D!$F$10<>\"\",CALC.D!$E$64<>\"\"),IF(AND($AV$3=2,CALC.D!$G$59=$BN$2,CALC.D!$F$10=2),TABELAS!$C$93,0))","v":false},{"$f":"IF(AND(CALC.D!$C$6<>\"\",CALC.D!$G$6<>\"\",CALC.D!$R$2<>\"\",CALC.D!$AB$20=2,CALC.D!$F$10<>\"\",CALC.D!$E$64<>\"\"),IF(AND($AV$3=2,CALC.D!$G$59=$BO$2,CALC.D!$F$10=2),TABELAS!$C$94,0))","v":false},{"$f":"IF(AND(CALC.D!$C$6<>\"\",CALC.D!$G$6<>\"\",CALC.D!$R$2<>\"\",CALC.D!$AB$20=2,CALC.D!$F$10<>\"\",CALC.D!$E$64<>\"\"),IF(AND($AV$3=2,CALC.D!$G$59=$BP$2,CALC.D!$F$10=2),TABELAS!$C$95,0))","v":false},{"$f":"IF(AND(CALC.D!$C$6<>\"\",CALC.D!$G$6<>\"\",CALC.D!$R$2<>\"\",CALC.D!$AB$20=2,CALC.D!$F$10<>\"\",CALC.D!$E$64<>\"\"),IF(AND($AV$3=2,CALC.D!$G$59=$BQ$2,CALC.D!$F$10=2),TABELAS!$C$96,0))","v":false}]
[{"$f":"IF(AND(CALC.D!$B$60<=D6,$AO$5<=$W$5,$AL$9=0,$AM$7=0,CALC.D!B62=\"\",CALC.D!$AB$20=2,G49<=3),1,0)","v":0},{"$f":"A6-A5","v":0},"A2 MONOFÁSICO",12,"-",2,null,null,{"$f":"IF(AND(CALC.D!B15<>\"\",OR(CALC.D!AB16=1,CALC.D!AB16=3)),\"16 mm²\",IF(AND(CALC.D!B15<>\"\",CALC.D!AB16=2),\"10 mm²\",\"\"))","v":""},"TIPO: II OU Iv","DJ 63 A","32 mm² OU 1''","10 mm²","20 ou 1/2''","90 MINI ou  MULTI 100","140 MINI OU MULTI 200","60.33x3.35 (DIAMETRO EXT. X ESPESSURA)","10 mm² - Triplex",null,"3CV",3,4070,{"$f":"CALC.D!AI30","v":4070},{"$f":"CALC.D!AI30","v":4070},"X","3CV",{"$f":"IF(AND(CALC.D!$N$35<>\"\",CALC.D!$L$35<>\"\",CALCULO!$D$7=2,CALC.D!$T$35>0,CALC.D!$AB$20=2),CALC.D!$V$35/CALC.D!$T$35,0)","v":0},{"$f":"IF(AND(AA6>0,CALC.D!$AB$20=2),IF(AA6<=$W$4,$W$4,IF(AA6<=$W$5,$W$5,IF(AA6<=$W$6,$W$6,IF(AA6<=$W$7,$W$7,IF(AA6<=$W$8,$W$8,IF(AA6<=$X$9,$X$9,IF(AA6<=$X$10,$X$10,IF(AA6<=$X$11,$X$11,IF(AA6<=$Y$12,$Y$12,IF(AA6<=$Y$13,$Y$13,IF(AA6<=$Y$14,$Y$14,IF(AA6<=$Y$15,$Y$15,IF(AA6<=$Y$16,$Y$16))))))))))))),0)","v":0},{"$f":"IF(AND(CALC.D!$L$35<>\"\",CALC.D!$N$35<>\"\",CALC.D!$T$35<>\"\",CALC.D!$L$35=\"MONOFÁSICO FN\",CALC.D!$AB$20=2),VLOOKUP(\"MONOFÁSICO FN\",CALC.D!$L$35:$V$35,11,FALSE),\"\")","v":""},"",{"$f":"IF(AND(AC6<>\"\",CALC.D!$AB$20=2),CALC.D!T35,\"\")","v":""},{"$f":"IF(AND(CALC.D!$L$35<>\"\",CALC.D!$N$35<>\"\",CALC.D!$T$35<>\"\",CALC.D!$L$35=\"BIFÁSICO FFN\",CALC.D!$AB$20=2),VLOOKUP(\"BIFÁSICO FFN\",CALC.D!$L$35:$V$35,11,FALSE),\"\")","v":""},"",{"$f":"IF(AND(AF6<>\"\",CALC.D!$AB$20=2),CALC.D!T35,\"\")","v":""},{"$f":"IF(AND(CALC.D!$L$35<>\"\",CALC.D!$N$35<>\"\",CALC.D!$T$35<>\"\",CALC.D!$L$35=\"TRIFÁSICO FFFN\",CALC.D!$AB$20=2),VLOOKUP(\"TRIFÁSICO FFFN\",CALC.D!$L$35:$V$35,11,FALSE),\"\")","v":""},"",{"$f":"IF(AND(AI6<>\"\",CALC.D!$AB$20=2),CALC.D!T35,\"\")","v":""},"MONO","BIFI",null,null,null,null,{"$f":"IF(AND(CALC.D!$L$36<>\"\",CALC.D!$L$36=\"MONOFÁSICO FN\",CALC.D!$AB$20=2),VLOOKUP(\"MONOFÁSICO FN\",CALC.D!$L$36:$V$36,11,FALSE),0)","v":0},{"$f":"IF(AND(CALC.D!$L$36<>\"\",CALC.D!$L$36=\"BIFÁSICO FFN\",CALC.D!$AB$20=2),VLOOKUP(\"BIFÁSICO FFN\",CALC.D!$L$36:$V$36,11,FALSE),0)","v":0},{"$f":"IF(AND(CALC.D!$L$36<>\"\",CALC.D!$L$36=\"TRIFÁSICO FFFN\",CALC.D!$AB$20=2),VLOOKUP(\"TRIFÁSICO FFFN\",CALC.D!$L$36:$V$36,11,FALSE),0)","v":0},null,3,null,3,{"$f":"IF(AND(CALC.D!$C$6<>\"\",CALC.D!$G$6<>\"\",CALC.D!$R$2<>\"\",CALC.D!$AB$20=2,CALC.D!$F$10<>\"\",CALC.D!$E$64<>\"\"),IF(AND($AV$3=2,CALC.D!$G$59=$AY$2,CALC.D!$F$10=3),TABELAS!$C$79,0))","v":false},{"$f":"IF(AND(CALC.D!$C$6<>\"\",CALC.D!$G$6<>\"\",CALC.D!$R$2<>\"\",CALC.D!$AB$20=2,CALC.D!$F$10<>\"\",CALC.D!$E$64<>\"\"),IF(AND($AV$3=2,CALC.D!$G$59=$AZ$2,CALC.D!$F$10=3),TABELAS!$C$80,0))","v":false},{"$f":"IF(AND(CALC.D!$C$6<>\"\",CALC.D!$G$6<>\"\",CALC.D!$R$2<>\"\",CALC.D!$AB$20=2,CALC.D!$F$10<>\"\",CALC.D!$E$64<>\"\"),IF(AND($AV$3=2,CALC.D!$G$59=$BA$2,CALC.D!$F$10=3),TABELAS!$C$83,0))","v":false},{"$f":"IF(AND(CALC.D!$C$6<>\"\",CALC.D!$G$6<>\"\",CALC.D!$R$2<>\"\",CALC.D!$AB$20=2,CALC.D!$F$10<>\"\",CALC.D!$E$64<>\"\"),IF(AND($AV$3=2,CALC.D!$G$59=$BB$2,CALC.D!$F$10=3),TABELAS!$C$84,0))","v":false},{"$f":"IF(AND(CALC.D!$C$6<>\"\",CALC.D!$G$6<>\"\",CALC.D!$R$2<>\"\",CALC.D!$AB$20=2,CALC.D!$F$10<>\"\",CALC.D!$E$64<>\"\"),IF(AND($AV$3=2,CALC.D!$G$59=$BC$2,CALC.D!$F$10=3),TABELAS!$C$86,0))","v":false},{"$f":"IF(AND(CALC.D!$C$6<>\"\",CALC.D!$G$6<>\"\",CALC.D!$R$2<>\"\",CALC.D!$AB$20=2,CALC.D!$F$10<>\"\",CALC.D!$E$64<>\"\"),IF(AND($AV$3=2,CALC.D!$G$59=$BD$2,CALC.D!$F$10=3),TABELAS!$C$87,0))","v":false},{"$f":"IF(AND(CALC.D!$C$6<>\"\",CALC.D!$G$6<>\"\",CALC.D!$R$2<>\"\",CALC.D!$AB$20=2,CALC.D!$F$10<>\"\",CALC.D!$E$64<>\"\"),IF(AND($AV$3=2,CALC.D!$G$59=$BE$2,CALC.D!$F$10=3),TABELAS!$C$88,0))","v":false},{"$f":"IF(AND(CALC.D!$C$6<>\"\",CALC.D!$G$6<>\"\",CALC.D!$R$2<>\"\",CALC.D!$AB$20=2,CALC.D!$F$10<>\"\",CALC.D!$E$64<>\"\"),IF(AND($AV$3=2,CALC.D!$G$59=$BF$2,CALC.D!$F$10=3),TABELAS!$C$89,0))","v":false},{"$f":"IF(AND(CALC.D!$C$6<>\"\",CALC.D!$G$6<>\"\",CALC.D!$R$2<>\"\",CALC.D!$AB$20=2,CALC.D!$F$10<>\"\",CALC.D!$E$64<>\"\"),IF(AND($AV$3=2,CALC.D!$G$59=$BG$2,CALC.D!$F$10=3),TABELAS!$C$90,0))","v":false},{"$f":"IF(AND(CALC.D!$C$6<>\"\",CALC.D!$G$6<>\"\",CALC.D!$R$2<>\"\",CALC.D!$AB$20=2,CALC.D!$F$10<>\"\",CALC.D!$E$64<>\"\"),IF(AND($AV$3=2,CALC.D!$G$59=$BH$2,CALC.D!$F$10=3,OR(CALC.D!AB19=1,CALC.D!AB19=2)),TABELAS!$C$91,IF(AND($AV$3=2,CALC.D!$G$59=$BH$2,CALC.D!$F$10=3,CALC.D!AB19=3),\"CONSULTAR NORMAS PARA LIGAÇÃO \",0)))","v":false},3,{"$f":"IF(AND(CALC.D!$C$6<>\"\",CALC.D!$G$6<>\"\",CALC.D!$R$2<>\"\",CALC.D!$AB$20=2,CALC.D!$F$10<>\"\",CALC.D!$E$64<>\"\"),IF(AND($AV$3=2,CALC.D!$G$59=$BJ$2,CALC.D!$F$10=3),TABELAS!$C$81,0))","v":false},{"$f":"IF(AND(CALC.D!$C$6<>\"\",CALC.D!$G$6<>\"\",CALC.D!$R$2<>\"\",CALC.D!$AB$20=2,CALC.D!$F$10<>\"\",CALC.D!$E$64<>\"\"),IF(AND($AV$3=2,CALC.D!$G$59=$BK$2,CALC.D!$F$10=3),TABELAS!$C$82,0))","v":false},{"$f":"IF(AND(CALC.D!$C$6<>\"\",CALC.D!$G$6<>\"\",CALC.D!$R$2<>\"\",CALC.D!$AB$20=2,CALC.D!$F$10<>\"\",CALC.D!$E$64<>\"\"),IF(AND($AV$3=2,CALC.D!$G$59=$BL$2,CALC.D!$F$10=3),TABELAS!$C$85,0))","v":false},{"$f":"IF(AND(CALC.D!$C$6<>\"\",CALC.D!$G$6<>\"\",CALC.D!$R$2<>\"\",CALC.D!$AB$20=2,CALC.D!$F$10<>\"\",CALC.D!$E$64<>\"\"),IF(AND($AV$3=2,CALC.D!$G$59=$BM$2,CALC.D!$F$10=3),TABELAS!$C$92,0))","v":false},{"$f":"IF(AND(CALC.D!$C$6<>\"\",CALC.D!$G$6<>\"\",CALC.D!$R$2<>\"\",CALC.D!$AB$20=2,CALC.D!$F$10<>\"\",CALC.D!$E$64<>\"\"),IF(AND($AV$3=2,CALC.D!$G$59=$BN$2,CALC.D!$F$10=3),TABELAS!$C$93,0))","v":false},{"$f":"IF(AND(CALC.D!$C$6<>\"\",CALC.D!$G$6<>\"\",CALC.D!$R$2<>\"\",CALC.D!$AB$20=2,CALC.D!$F$10<>\"\",CALC.D!$E$64<>\"\"),IF(AND($AV$3=2,CALC.D!$G$59=$BO$2,CALC.D!$F$10=3),TABELAS!$C$94,0))","v":false},{"$f":"IF(AND(CALC.D!$C$6<>\"\",CALC.D!$G$6<>\"\",CALC.D!$R$2<>\"\",CALC.D!$AB$20=2,CALC.D!$F$10<>\"\",CALC.D!$E$64<>\"\"),IF(AND($AV$3=2,CALC.D!$G$59=$BP$2,CALC.D!$F$10=3),TABELAS!$C$95,0))","v":false},{"$f":"IF(AND(CALC.D!$C$6<>\"\",CALC.D!$G$6<>\"\",CALC.D!$R$2<>\"\",CALC.D!$AB$20=2,CALC.D!$F$10<>\"\",CALC.D!$E$64<>\"\"),IF(AND($AV$3=2,CALC.D!$G$59=$BQ$2,CALC.D!$F$10=3),TABELAS!$C$96,0))","v":false}]
[{"$f":"IF(AND(CALC.D!$B$60<=D7,$AO$5<=$W$5,$AL$9=0,$AP$5<=$X$6,CALC.D!$B$62=\"\",CALC.D!$AB$20=2,G49<=2),1,0)","v":0},0,"B1 BIFÁSICO",18,"-",2,3,null,{"$f":"IF(AND(CALC.D!B15<>\"\",OR(CALC.D!AB16=1,CALC.D!AB16=3)),\"16 mm²\",IF(AND(CALC.D!B15<>\"\",CALC.D!AB16=2),\"10 mm²\",\"\"))","v":""},"TIPO: II OU Iv","DJ 63 A","32 mm² OU 1''","10 mm²","20 ou 1/2''","100 - MULTI 100","200 - MULTI 100","60.33x3.35 (DIAMETRO EXT. X ESPESSURA)","16 mm² Triplex",null,"5CV",4,6160,{"$f":"CALC.D!AI32","v":6160},{"$f":"CALC.D!AI32","v":6160},"X","5CV",{"$f":"IF(AND(CALC.D!$N$36<>\"\",CALC.D!$L$36<>\"\",CALCULO!$D$7=2,CALC.D!$T$36>0,CALC.D!$AB$20=2),CALC.D!$V$36/CALC.D!$T$36,0)","v":0},{"$f":"IF(AND(AA7>0,CALC.D!$AB$20=2),IF(AA7<=$W$4,$W$4,IF(AA7<=$W$5,$W$5,IF(AA7<=$W$6,$W$6,IF(AA7<=$W$7,$W$7,IF(AA7<=$W$8,$W$8,IF(AA7<=$X$9,$X$9,IF(AA7<=$X$10,$X$10,IF(AA7<=$X$11,$X$11,IF(AA7<=$Y$12,$Y$12,IF(AA7<=$Y$13,$Y$13,IF(AA7<=$Y$14,$Y$14,IF(AA7<=$Y$15,$Y$15,IF(AA7<=$Y$16,$Y$16))))))))))))),0)","v":0},{"$f":"IF(AND(CALC.D!$L$36<>\"\",CALC.D!$N$36<>\"\",CALC.D!$T$36<>\"\",CALC.D!$L$36=\"MONOFÁSICO FN\",CALC.D!$AB$20=2),VLOOKUP(\"MONOFÁSICO FN\",CALC.D!$L$36:$V$36,11,FALSE),\"\")","v":""},"",{"$f":"IF(AND(AC7<>\"\",CALC.D!$AB$20=2),CALC.D!T36,\"\")","v":""},{"$f":"IF(AND(CALC.D!$L$36<>\"\",CALC.D!$N$36<>\"\",CALC.D!$T$36<>\"\",CALC.D!$L$36=\"BIFÁSICO FFN\",CALC.D!$AB$20=2),VLOOKUP(\"BIFÁSICO FFN\",CALC.D!$L$36:$V$36,11,FALSE),\"\")","v":""},"",{"$f":"IF(AND(AF7<>\"\",CALC.D!$AB$20=2),CALC.D!T36,\"\")","v":""},{"$f":"IF(AND(CALC.D!$L$36<>\"\",CALC.D!$N$36<>\"\",CALC.D!$T$36<>\"\",CALC.D!$L$36=\"TRIFÁSICO FFFN\",CALC.D!$AB$20=2),VLOOKUP(\"TRIFÁSICO FFFN\",CALC.D!$L$36:$V$36,11,FALSE),\"\")","v":""},"",{"$f":"IF(AND(AI7<>\"\",CALC.D!$AB$20=2),CALC.D!T36,\"\")","v":""},{"$f":"COUNTIF(CALC.D!$L$33:$L$39,\"MONOFÁSICO FN\")","v":0},{"$f":"COUNTIF(CALC.D!$L$33:$L$39,\"BIFÁSICO FFN\")","v":0},null,null,null,null,{"$f":"IF(AND(CALC.D!$L$37<>\"\",CALC.D!$L$37=\"MONOFÁSICO FN\",CALC.D!$AB$20=2),VLOOKUP(\"MONOFÁSICO FN\",CALC.D!$L$37:$V$37,11,FALSE),0)","v":0},{"$f":"IF(AND(CALC.D!$L$37<>\"\",CALC.D!$L$37=\"BIFÁSICO FFN\",CALC.D!$AB$20=2),VLOOKUP(\"BIFÁSICO FFN\",CALC.D!$L$37:$V$37,11,FALSE),0)","v":0},{"$f":"IF(AND(CALC.D!$L$37<>\"\",CALC.D!$L$37=\"TRIFÁSICO FFFN\",CALC.D!$AB$20=2),VLOOKUP(\"TRIFÁSICO FFFN\",CALC.D!$L$37:$V$37,11,FALSE),0)","v":0},null,"4 ou mais",null,4,{"$f":"IF(AND(CALC.D!$C$6<>\"\",CALC.D!$G$6<>\"\",CALC.D!$R$2<>\"\",CALC.D!$AB$20=2,CALC.D!$F$10<>\"\",CALC.D!$E$64<>\"\"),IF(AND($AV$3=2,CALC.D!$G$59=$AY$2,CALC.D!$F$10=\"4 ou mais\"),\"Consultar Normas de Ligação Agrupada\",0))","v":false},{"$f":"IF(AND(CALC.D!$C$6<>\"\",CALC.D!$G$6<>\"\",CALC.D!$R$2<>\"\",CALC.D!$AB$20=2,CALC.D!$F$10<>\"\",CALC.D!$E$64<>\"\"),IF(AND($AV$3=2,CALC.D!$G$59=$AZ$2,CALC.D!$F$10=\"4 ou mais\"),\"Consultar Normas de Ligação Agrupada\",0))","v":false},{"$f":"IF(AND(CALC.D!$C$6<>\"\",CALC.D!$G$6<>\"\",CALC.D!$R$2<>\"\",CALC.D!$AB$20=2,CALC.D!$F$10<>\"\",CALC.D!$E$64<>\"\"),IF(AND($AV$3=2,CALC.D!$G$59=$BA$2,CALC.D!$F$10=\"4 ou mais\"),\"Consultar Normas de Ligação Agrupada\",0))","v":false},{"$f":"IF(AND(CALC.D!$C$6<>\"\",CALC.D!$G$6<>\"\",CALC.D!$R$2<>\"\",CALC.D!$AB$20=2,CALC.D!$F$10<>\"\",CALC.D!$E$64<>\"\"),IF(AND($AV$3=2,CALC.D!$G$59=$BB$2,CALC.D!$F$10=\"4 ou mais\"),\"Consultar Normas de Ligação Agrupada\",0))","v":false},{"$f":"IF(AND(CALC.D!$C$6<>\"\",CALC.D!$G$6<>\"\",CALC.D!$R$2<>\"\",CALC.D!$AB$20=2,CALC.D!$F$10<>\"\",CALC.D!$E$64<>\"\"),IF(AND($AV$3=2,CALC.D!$G$59=$BC$2,CALC.D!$F$10=\"4 ou mais\"),\"Consultar Normas de Ligação Agrupada\",0))","v":false},{"$f":"IF(AND(CALC.D!$C$6<>\"\",CALC.D!$G$6<>\"\",CALC.D!$R$2<>\"\",CALC.D!$AB$20=2,CALC.D!$F$10<>\"\",CALC.D!$E$64<>\"\"),IF(AND($AV$3=2,CALC.D!$G$59=$BD$2,CALC.D!$F$10=\"4 ou mais\"),\"Consultar Normas de Ligação Agrupada\",0))","v":false},{"$f":"IF(AND(CALC.D!$C$6<>\"\",CALC.D!$G$6<>\"\",CALC.D!$R$2<>\"\",CALC.D!$AB$20=2,CALC.D!$F$10<>\"\",CALC.D!$E$64<>\"\"),IF(AND($AV$3=2,CALC.D!$G$59=$BE$2,CALC.D!$F$10=\"4 ou mais\"),\"Consultar Normas de Ligação Agrupada\",0))","v":false},{"$f":"IF(AND(CALC.D!$C$6<>\"\",CALC.D!$G$6<>\"\",CALC.D!$R$2<>\"\",CALC.D!$AB$20=2,CALC.D!$F$10<>\"\",CALC.D!$E$64<>\"\"),IF(AND($AV$3=2,CALC.D!$G$59=$BF$2,CALC.D!$F$10=\"4 ou mais\"),\"Consultar Normas de Ligação Agrupada\",0))","v":false},{"$f":"IF(AND(CALC.D!$C$6<>\"\",CALC.D!$G$6<>\"\",CALC.D!$R$2<>\"\",CALC.D!$AB$20=2,CALC.D!$F$10<>\"\",CALC.D!$E$64<>\"\"),IF(AND($AV$3=2,CALC.D!$G$59=$BG$2,CALC.D!$F$10=\"4 ou mais\"),\"Consultar Normas de Ligação Agrupada\",0))","v":false},{"$f":"IF(AND(CALC.D!$C$6<>\"\",CALC.D!$G$6<>\"\",CALC.D!$R$2<>\"\",CALC.D!$AB$20=2,CALC.D!$F$10<>\"\",CALC.D!$E$64<>\"\"),IF(AND($AV$3=2,CALC.D!$G$59=$BH$2,CALC.D!$F$10=\"4 ou mais\",OR(CALC.D!AB19=1,CALC.D!AB19=2)),\"Consultar Normas de Ligação Agrupada\",0))","v":false},4,{"$f":"IF(AND(CALC.D!$C$6<>\"\",CALC.D!$G$6<>\"\",CALC.D!$R$2<>\"\",CALC.D!$AB$20=2,CALC.D!$F$10<>\"\",CALC.D!$E$64<>\"\"),IF(AND($AV$3=2,CALC.D!$G$59=$BJ$2,CALC.D!$F$10=\"4 ou mais\"),\"Consultar Normas de Ligação Agrupada\",0))","v":false},{"$f":"IF(AND(CALC.D!$C$6<>\"\",CALC.D!$G$6<>\"\",CALC.D!$R$2<>\"\",CALC.D!$AB$20=2,CALC.D!$F$10<>\"\",CALC.D!$E$64<>\"\"),IF(AND($AV$3=2,CALC.D!$G$59=$BK$2,CALC.D!$F$10=\"4 ou mais\"),\"Consultar Normas de Ligação Agrupada\",0))","v":false},{"$f":"IF(AND(CALC.D!$C$6<>\"\",CALC.D!$G$6<>\"\",CALC.D!$R$2<>\"\",CALC.D!$AB$20=2,CALC.D!$F$10<>\"\",CALC.D!$E$64<>\"\"),IF(AND($AV$3=2,CALC.D!$G$59=$BL$2,CALC.D!$F$10=\"4 ou mais\"),\"Consultar Normas de Ligação Agrupada\",0))","v":false},{"$f":"IF(AND(CALC.D!$C$6<>\"\",CALC.D!$G$6<>\"\",CALC.D!$R$2<>\"\",CALC.D!$AB$20=2,CALC.D!$F$10<>\"\",CALC.D!$E$64<>\"\"),IF(AND($AV$3=2,CALC.D!$G$59=$BM$2,CALC.D!$F$10=\"4 ou mais\"),\"Consultar Normas de Ligação Agrupada\",0))","v":false},{"$f":"IF(AND(CALC.D!$C$6<>\"\",CALC.D!$G$6<>\"\",CALC.D!$R$2<>\"\",CALC.D!$AB$20=2,CALC.D!$F$10<>\"\",CALC.D!$E$64<>\"\"),IF(AND($AV$3=2,CALC.D!$G$59=$BN$2,CALC.D!$F$10=\"4 ou mais\"),\"Consultar Normas de Ligação Agrupada\",0))","v":false},{"$f":"IF(AND(CALC.D!$C$6<>\"\",CALC.D!$G$6<>\"\",CALC.D!$R$2<>\"\",CALC.D!$AB$20=2,CALC.D!$F$10<>\"\",CALC.D!$E$64<>\"\"),IF(AND($AV$3=2,CALC.D!$G$59=$BO$2,CALC.D!$F$10=\"4 ou mais\"),\"Consultar Normas de Ligação Agrupada\",0))","v":false},{"$f":"IF(AND(CALC.D!$C$6<>\"\",CALC.D!$G$6<>\"\",CALC.D!$R$2<>\"\",CALC.D!$AB$20=2,CALC.D!$F$10<>\"\",CALC.D!$E$64<>\"\"),IF(AND($AV$3=2,CALC.D!$G$59=$BP$2,CALC.D!$F$10=\"4 ou mais\"),\"Consultar Normas de Ligação Agrupada\",0))","v":false},{"$f":"IF(AND(CALC.D!$C$6<>\"\",CALC.D!$G$6<>\"\",CALC.D!$R$2<>\"\",CALC.D!$AB$20=2,CALC.D!$F$10<>\"\",CALC.D!$E$64<>\"\"),IF(AND($AV$3=2,CALC.D!$G$59=$BQ$2,CALC.D!$F$10=\"4 ou mais\"),\"Consultar Normas de Ligação Agrupada\",0))","v":false}]
[{"$f":"IF(AND(CALC.D!$B$60<=D8,$AO$5<=$W$5,$AL$9=0,$AP$5<=$X$7,CALC.D!$B$62=\"\",CALC.D!$AB$20=2,G49<=2),1,0)","v":0},0,"B2 BIFÁSICO",25,"-",2,5,null,{"$f":"IF(AND(CALC.D!B15<>\"\",OR(CALC.D!AB16=1,CALC.D!AB16=3)),\"25 mm²\",IF(AND(CALC.D!B15<>\"\",CALC.D!AB16=2),\"16 mm²\",\"\"))","v":""},"TIPO: II OU Iv",{"$f":"IF(AND(CALC.D!B15<>\"\",OR(CALC.D!AB16=2,CALC.D!AB16=3)),\"DJ 70 A\",IF(AND(CALC.D!B15<>\"\",CALC.D!AB16=1),\"DJ 80 A\",\"\"))","v":""},"40 mm² OU 1 1/4''","10 mm²","20 ou 1/2''","100 - MULTI 100","200 - MULTI 100","60.33x3.35 (DIAMETRO EXT. X ESPESSURA)","25 mm² - Triplex",null,"7 1/2CV",5,8840,{"$f":"CALC.D!AI34","v":8840},{"$f":"CALC.D!AI34","v":8840},"X","7 1/2CV",{"$f":"IF(AND(CALC.D!$N$37<>\"\",CALC.D!$L$37<>\"\",CALCULO!$D$7=2,CALC.D!$T$37>0,CALC.D!$AB$20=2),CALC.D!$V$37/CALC.D!$T$37,0)","v":0},{"$f":"IF(AND(AA8>0,CALC.D!$AB$20=2),IF(AA8<=$W$4,$W$4,IF(AA8<=$W$5,$W$5,IF(AA8<=$W$6,$W$6,IF(AA8<=$W$7,$W$7,IF(AA8<=$W$8,$W$8,IF(AA8<=$X$9,$X$9,IF(AA8<=$X$10,$X$10,IF(AA8<=$X$11,$X$11,IF(AA8<=$Y$12,$Y$12,IF(AA8<=$Y$13,$Y$13,IF(AA8<=$Y$14,$Y$14,IF(AA8<=$Y$15,$Y$15,IF(AA8<=$Y$16,$Y$16))))))))))))),0)","v":0},{"$f":"IF(AND(CALC.D!$L$37<>\"\",CALC.D!$N$37<>\"\",CALC.D!$T$37<>\"\",CALC.D!$L$37=\"MONOFÁSICO FN\",CALC.D!$AB$20=2),VLOOKUP(\"MONOFÁSICO FN\",CALC.D!$L$37:$V$37,11,FALSE),\"\")","v":""},"",{"$f":"IF(AND(AC8<>\"\",CALC.D!$AB$20=2),CALC.D!T37,\"\")","v":""},{"$f":"IF(AND(CALC.D!$L$37<>\"\",CALC.D!$N$37<>\"\",CALC.D!$T$37<>\"\",CALC.D!$L$37=\"BIFÁSICO FFN\",CALC.D!$AB$20=2),VLOOKUP(\"BIFÁSICO FFN\",CALC.D!$L$37:$V$37,11,FALSE),\"\")","v":""},"",{"$f":"IF(AND(AF8<>\"\",CALC.D!$AB$20=2),CALC.D!T37,\"\")","v":""},{"$f":"IF(AND(CALC.D!$L$37<>\"\",CALC.D!$N$37<>\"\",CALC.D!$T$37<>\"\",CALC.D!$L$37=\"TRIFÁSICO FFFN\",CALC.D!$AB$20=2),VLOOKUP(\"TRIFÁSICO FFFN\",CALC.D!$L$37:$V$37,11,FALSE),\"\")","v":""},"",{"$f":"IF(AND(AI8<>\"\",CALC.D!$AB$20=2),CALC.D!T37,\"\")","v":""},"TRIF",null,null,null,null,null,{"$f":"IF(AND(CALC.D!$L$38<>\"\",CALC.D!$L$38=\"MONOFÁSICO FN\",CALC.D!$AB$20=2),VLOOKUP(\"MONOFÁSICO FN\",CALC.D!$L$38:$V$38,11,FALSE),0)","v":0},{"$f":"IF(AND(CALC.D!$L$38<>\"\",CALC.D!$L$38=\"BIFÁSICO FFN\",CALC.D!$AB$20=2),VLOOKUP(\"BIFÁSICO FFN\",CALC.D!$L$38:$V$38,11,FALSE),0)","v":0},{"$f":"IF(AND(CALC.D!$L$38<>\"\",CALC.D!$L$38=\"TRIFÁSICO FFFN\",CALC.D!$AB$20=2),VLOOKUP(\"TRIFÁSICO FFFN\",CALC.D!$L$38:$V$38,11,FALSE),0)","v":0},"POSTE CONCRETO",1,{"$f":"IF(CALC.D!$E$64=TABELAS!A62,VLOOKUP(CALC.D!$F$10,$AV$8:$AX$10,3,FALSE),0)","v":0},5,{"$f":"IF(AND(CALC.D!$C$6<>\"\",CALC.D!$G$6<>\"\",CALC.D!$R$2<>\"\",CALC.D!$AB$20=2,CALC.D!$F$10<>\"\",CALC.D!$E$64<>\"\",CALC.D!$F$10=1,$AV$3=3,CALC.D!$G$59=$AY$2),TABELAS!$F$79,0)","v":0},{"$f":"IF(AND(CALC.D!$C$6<>\"\",CALC.D!$G$6<>\"\",CALC.D!$R$2<>\"\",CALC.D!$AB$20=2,CALC.D!$F$10<>\"\",CALC.D!$E$64<>\"\",CALC.D!$F$10=1,$AV$3=3,CALC.D!$G$59=$AZ$2),TABELAS!$F$80,0)","v":0},{"$f":"IF(AND(CALC.D!$C$6<>\"\",CALC.D!$G$6<>\"\",CALC.D!$R$2<>\"\",CALC.D!$AB$20=2,CALC.D!$F$10<>\"\",CALC.D!$E$64<>\"\",CALC.D!$F$10=1,$AV$3=3,CALC.D!$G$59=$BA$2),TABELAS!$F$83,0)","v":0},{"$f":"IF(AND(CALC.D!$C$6<>\"\",CALC.D!$G$6<>\"\",CALC.D!$R$2<>\"\",CALC.D!$AB$20=2,CALC.D!$F$10<>\"\",CALC.D!$E$64<>\"\",CALC.D!$F$10=1,$AV$3=3,CALC.D!$G$59=$BB$2),TABELAS!$F$84,0)","v":0},{"$f":"IF(AND(CALC.D!$C$6<>\"\",CALC.D!$G$6<>\"\",CALC.D!$R$2<>\"\",CALC.D!$AB$20=2,CALC.D!$F$10<>\"\",CALC.D!$E$64<>\"\",CALC.D!$F$10=1,$AV$3=3,CALC.D!$G$59=$BC$2),TABELAS!$F$86,0)","v":0},{"$f":"IF(AND(CALC.D!$C$6<>\"\",CALC.D!$G$6<>\"\",CALC.D!$R$2<>\"\",CALC.D!$AB$20=2,CALC.D!$F$10<>\"\",CALC.D!$E$64<>\"\",CALC.D!$F$10=1,$AV$3=3,CALC.D!$G$59=$BD$2),TABELAS!$F$87,0)","v":0},{"$f":"IF(AND(CALC.D!$C$6<>\"\",CALC.D!$G$6<>\"\",CALC.D!$R$2<>\"\",CALC.D!$AB$20=2,CALC.D!$F$10<>\"\",CALC.D!$E$64<>\"\",CALC.D!$F$10=1,$AV$3=3,CALC.D!$G$59=$BE$2),TABELAS!$F$88,0)","v":0},{"$f":"IF(AND(CALC.D!$C$6<>\"\",CALC.D!$G$6<>\"\",CALC.D!$R$2<>\"\",CALC.D!$AB$20=2,CALC.D!$F$10<>\"\",CALC.D!$E$64<>\"\",CALC.D!$F$10=1,$AV$3=3,CALC.D!$G$59=$BF$2),TABELAS!$F$89,0)","v":0},{"$f":"IF(AND(CALC.D!$C$6<>\"\",CALC.D!$G$6<>\"\",CALC.D!$R$2<>\"\",CALC.D!$AB$20=2,CALC.D!$F$10<>\"\",CALC.D!$E$64<>\"\",CALC.D!$F$10=1,$AV$3=3,CALC.D!$G$59=$BG$2),TABELAS!$F$90,0)","v":0},{"$f":"IF(AND(CALC.D!$C$6<>\"\",CALC.D!$G$6<>\"\",CALC.D!$R$2<>\"\",CALC.D!$AB$20=2,CALC.D!$F$10<>\"\",CALC.D!$E$64<>\"\",CALC.D!$F$10=1,$AV$3=3,CALC.D!$G$59=$BH$2),TABELAS!$F$91,0)","v":0},5,{"$f":"IF(AND(CALC.D!$C$6<>\"\",CALC.D!$G$6<>\"\",CALC.D!$R$2<>\"\",CALC.D!$AB$20=2,CALC.D!$F$10<>\"\",CALC.D!$E$64<>\"\",CALC.D!$F$10=1,$AV$3=3,CALC.D!$G$59=$BJ$2),TABELAS!$F$81,0)","v":0},{"$f":"IF(AND(CALC.D!$C$6<>\"\",CALC.D!$G$6<>\"\",CALC.D!$R$2<>\"\",CALC.D!$AB$20=2,CALC.D!$F$10<>\"\",CALC.D!$E$64<>\"\",CALC.D!$F$10=1,$AV$3=3,CALC.D!$G$59=$BK$2),TABELAS!$F$82,0)","v":0},{"$f":"IF(AND(CALC.D!$C$6<>\"\",CALC.D!$G$6<>\"\",CALC.D!$R$2<>\"\",CALC.D!$AB$20=2,CALC.D!$F$10<>\"\",CALC.D!$E$64<>\"\",CALC.D!$F$10=1,$AV$3=3,CALC.D!$G$59=$BL$2),TABELAS!$F$85,0)","v":0},{"$f":"IF(AND(CALC.D!$C$6<>\"\",CALC.D!$G$6<>\"\",CALC.D!$R$2<>\"\",CALC.D!$AB$20=2,CALC.D!$F$10<>\"\",CALC.D!$E$64<>\"\",CALC.D!$F$10=1,$AV$3=3,CALC.D!$G$59=$BM$2),TABELAS!$F$92,0)","v":0},{"$f":"IF(AND(CALC.D!$C$6<>\"\",CALC.D!$G$6<>\"\",CALC.D!$R$2<>\"\",CALC.D!$AB$20=2,CALC.D!$F$10<>\"\",CALC.D!$E$64<>\"\",CALC.D!$F$10=1,$AV$3=3,CALC.D!$G$59=$BN$2),TABELAS!$F$93,0)","v":0},{"$f":"IF(AND(CALC.D!$C$6<>\"\",CALC.D!$G$6<>\"\",CALC.D!$R$2<>\"\",CALC.D!$AB$20=2,CALC.D!$F$10<>\"\",CALC.D!$E$64<>\"\",CALC.D!$F$10=1,$AV$3=3,CALC.D!$G$59=$BO$2),TABELAS!$F$94,0)","v":0},{"$f":"IF(AND(CALC.D!$C$6<>\"\",CALC.D!$G$6<>\"\",CALC.D!$R$2<>\"\",CALC.D!$AB$20=2,CALC.D!$F$10<>\"\",CALC.D!$E$64<>\"\",CALC.D!$F$10=1,$AV$3=3,CALC.D!$G$59=$BP$2),TABELAS!$F$95,0)","v":0},{"$f":"IF(AND(CALC.D!$C$6<>\"\",CALC.D!$G$6<>\"\",CALC.D!$R$2<>\"\",CALC.D!$AB$20=2,CALC.D!$F$10<>\"\",CALC.D!$E$64<>\"\",CALC.D!$F$10=1,$AV$3=3,CALC.D!$G$59=$BQ$2),TABELAS!$F$96,0)","v":0}]
[{"$f":"IF(AND(CALC.D!$B$60<=D9,OR(CALC.D!$B$62<=E9,CALC.D!B62=\"\"),$AO$5<=$W$5,$AP$5<=$X$6,$AQ$5<=Y11,CALC.D!$AB$20=2,G49<=2),1,0)","v":0},0,"C1 TRIFÁSICO",75,23,2,3,15,{"$f":"IF(AND(CALC.D!B15<>\"\",CALC.D!AB16=1),\"16 mm²\",IF(AND(CALC.D!B15<>\"\",CALC.D!AB16=2),\"10 mm²\",IF(AND(CALC.D!B15<>\"\",CALC.D!AB16=3),\"25 mm²\",\"\")))","v":""},"TIPO: III OU V","DJ 63 A","40 mm² OU 1 1/4''","10 mm²","20 ou 1/2''","100 - MULTI 100","200 - MULTI 100","60.33x3.35 (DIAMETRO EXT. X ESPESSURA)","10 mm² - Quadruplex",null,"10CV",6,11640,"X",{"$f":"CALC.D!AI35","v":11640},"X","10CV",{"$f":"IF(AND(CALC.D!$N$38<>\"\",CALC.D!$L$38<>\"\",CALCULO!$D$7=2,CALC.D!$T$38>0,CALC.D!$AB$20=2),CALC.D!$V$38/CALC.D!$T$38,0)","v":0},{"$f":"IF(AND(AA9>0,CALC.D!$AB$20=2),IF(AA9<=$W$4,$W$4,IF(AA9<=$W$5,$W$5,IF(AA9<=$W$6,$W$6,IF(AA9<=$W$7,$W$7,IF(AA9<=$W$8,$W$8,IF(AA9<=$X$9,$X$9,IF(AA9<=$X$10,$X$10,IF(AA9<=$X$11,$X$11,IF(AA9<=$Y$12,$Y$12,IF(AA9<=$Y$13,$Y$13,IF(AA9<=$Y$14,$Y$14,IF(AA9<=$Y$15,$Y$15,IF(AA9<=$Y$16,$Y$16))))))))))))),0)","v":0},{"$f":"IF(AND(CALC.D!$L$38<>\"\",CALC.D!$N$38<>\"\",CALC.D!$T$38<>\"\",CALC.D!$L$38=\"MONOFÁSICO FN\",CALC.D!$AB$20=2),VLOOKUP(\"MONOFÁSICO FN\",CALC.D!$L$38:$V$38,11,FALSE),\"\")","v":""},"",{"$f":"IF(AND(AC9<>\"\",CALC.D!$AB$20=2),CALC.D!T38,\"\")","v":""},{"$f":"IF(AND(CALC.D!$L$38<>\"\",CALC.D!$N$38<>\"\",CALC.D!$T$38<>\"\",CALC.D!$L$38=\"BIFÁSICO FFN\",CALC.D!$AB$20=2),VLOOKUP(\"BIFÁSICO FFN\",CALC.D!$L$38:$V$38,11,FALSE),\"\")","v":""},"",{"$f":"IF(AND(AF9<>\"\",CALC.D!$AB$20=2),CALC.D!T38,\"\")","v":""},{"$f":"IF(AND(CALC.D!$L$38<>\"\",CALC.D!$N$38<>\"\",CALC.D!$T$38<>\"\",CALC.D!$L$38=\"TRIFÁSICO FFFN\",CALC.D!$AB$20=2),VLOOKUP(\"TRIFÁSICO FFFN\",CALC.D!$L$38:$V$38,11,FALSE),\"\")","v":""},"",{"$f":"IF(AND(AI9<>\"\",CALC.D!$AB$20=2),CALC.D!T38,\"\")","v":""},{"$f":"COUNTIF(CALC.D!$L$33:$L$39,\"TRIFÁSICO FFFN\")","v":0},null,null,null,null,null,{"$f":"IF(AND(CALC.D!$L$39<>\"\",CALC.D!$L$39=\"MONOFÁSICO FN\",CALC.D!$AB$20=2),VLOOKUP(\"MONOFÁSICO FN\",CALC.D!$L$39:$V$39,11,FALSE),0)","v":0},{"$f":"IF(AND(CALC.D!$L$39<>\"\",CALC.D!$L$39=\"BIFÁSICO FFN\",CALC.D!$AB$20=2),VLOOKUP(\"BIFÁSICO FFN\",CALC.D!$L$39:$V$39,11,FALSE),0)","v":0},{"$f":"IF(AND(CALC.D!$L$39<>\"\",CALC.D!$L$39=\"TRIFÁSICO FFFN\",CALC.D!$AB$20=2),VLOOKUP(\"TRIFÁSICO FFFN\",CALC.D!$L$39:$V$39,11,FALSE),0)","v":0},null,2,null,6,{"$f":"IF(AND(CALC.D!$C$6<>\"\",CALC.D!$G$6<>\"\",CALC.D!$R$2<>\"\",CALC.D!$AB$20=2,CALC.D!$F$10<>\"\",CALC.D!$E$64<>\"\",CALC.D!$F$10=2,$AV$3=3,CALC.D!$G$59=$AY$2),TABELAS!$F$79,0)","v":0},{"$f":"IF(AND(CALC.D!$C$6<>\"\",CALC.D!$G$6<>\"\",CALC.D!$R$2<>\"\",CALC.D!$AB$20=2,CALC.D!$F$10<>\"\",CALC.D!$E$64<>\"\",CALC.D!$F$10=2,$AV$3=3,CALC.D!$G$59=$AZ$2),TABELAS!$F$80,0)","v":0},{"$f":"IF(AND(CALC.D!$C$6<>\"\",CALC.D!$G$6<>\"\",CALC.D!$R$2<>\"\",CALC.D!$AB$20=2,CALC.D!$F$10<>\"\",CALC.D!$E$64<>\"\",CALC.D!$F$10=2,$AV$3=3,CALC.D!$G$59=$BA$2),TABELAS!$F$83,0)","v":0},{"$f":"IF(AND(CALC.D!$C$6<>\"\",CALC.D!$G$6<>\"\",CALC.D!$R$2<>\"\",CALC.D!$AB$20=2,CALC.D!$F$10<>\"\",CALC.D!$E$64<>\"\",CALC.D!$F$10=2,$AV$3=3,CALC.D!$G$59=$BB$2),TABELAS!$F$84,0)","v":0},{"$f":"IF(AND(CALC.D!$C$6<>\"\",CALC.D!$G$6<>\"\",CALC.D!$R$2<>\"\",CALC.D!$AB$20=2,CALC.D!$F$10<>\"\",CALC.D!$E$64<>\"\",CALC.D!$F$10=2,$AV$3=3,CALC.D!$G$59=$BC$2),TABELAS!$F$86,0)","v":0},{"$f":"IF(AND(CALC.D!$C$6<>\"\",CALC.D!$G$6<>\"\",CALC.D!$R$2<>\"\",CALC.D!$AB$20=2,CALC.D!$F$10<>\"\",CALC.D!$E$64<>\"\",CALC.D!$F$10=2,$AV$3=3,CALC.D!$G$59=$BD$2),TABELAS!$F$87,0)","v":0},{"$f":"IF(AND(CALC.D!$C$6<>\"\",CALC.D!$G$6<>\"\",CALC.D!$R$2<>\"\",CALC.D!$AB$20=2,CALC.D!$F$10<>\"\",CALC.D!$E$64<>\"\",CALC.D!$F$10=2,$AV$3=3,CALC.D!$G$59=$BE$2),TABELAS!$F$88,0)","v":0},{"$f":"IF(AND(CALC.D!$C$6<>\"\",CALC.D!$G$6<>\"\",CALC.D!$R$2<>\"\",CALC.D!$AB$20=2,CALC.D!$F$10<>\"\",CALC.D!$E$64<>\"\",CALC.D!$F$10=2,$AV$3=3,CALC.D!$G$59=$BF$2),TABELAS!$F$89,0)","v":0},{"$f":"IF(AND(CALC.D!$C$6<>\"\",CALC.D!$G$6<>\"\",CALC.D!$R$2<>\"\",CALC.D!$AB$20=2,CALC.D!$F$10<>\"\",CALC.D!$E$64<>\"\",CALC.D!$F$10=2,$AV$3=3,CALC.D!$G$59=$BG$2),TABELAS!$F$90,0)","v":0},{"$f":"IF(AND(CALC.D!$C$6<>\"\",CALC.D!$G$6<>\"\",CALC.D!$R$2<>\"\",CALC.D!$AB$20=2,CALC.D!$F$10<>\"\",CALC.D!$E$64<>\"\",CALC.D!$F$10=2,$AV$3=3,CALC.D!$G$59=$BH$2),TABELAS!$F$91,0)","v":0},6,{"$f":"IF(AND(CALC.D!$C$6<>\"\",CALC.D!$G$6<>\"\",CALC.D!$R$2<>\"\",CALC.D!$AB$20=2,CALC.D!$F$10<>\"\",CALC.D!$E$64<>\"\",CALC.D!$F$10=2,$AV$3=3,CALC.D!$G$59=$BJ$2),TABELAS!$F$81,0)","v":0},{"$f":"IF(AND(CALC.D!$C$6<>\"\",CALC.D!$G$6<>\"\",CALC.D!$R$2<>\"\",CALC.D!$AB$20=2,CALC.D!$F$10<>\"\",CALC.D!$E$64<>\"\",CALC.D!$F$10=2,$AV$3=3,CALC.D!$G$59=$BK$2),TABELAS!$F$82,0)","v":0},{"$f":"IF(AND(CALC.D!$C$6<>\"\",CALC.D!$G$6<>\"\",CALC.D!$R$2<>\"\",CALC.D!$AB$20=2,CALC.D!$F$10<>\"\",CALC.D!$E$64<>\"\",CALC.D!$F$10=2,$AV$3=3,CALC.D!$G$59=$BL$2),TABELAS!$F$85,0)","v":0},{"$f":"IF(AND(CALC.D!$C$6<>\"\",CALC.D!$G$6<>\"\",CALC.D!$R$2<>\"\",CALC.D!$AB$20=2,CALC.D!$F$10<>\"\",CALC.D!$E$64<>\"\",CALC.D!$F$10=2,$AV$3=3,CALC.D!$G$59=$BM$2),TABELAS!$F$92,0)","v":0},{"$f":"IF(AND(CALC.D!$C$6<>\"\",CALC.D!$G$6<>\"\",CALC.D!$R$2<>\"\",CALC.D!$AB$20=2,CALC.D!$F$10<>\"\",CALC.D!$E$64<>\"\",CALC.D!$F$10=2,$AV$3=3,CALC.D!$G$59=$BN$2),TABELAS!$F$93,0)","v":0},{"$f":"IF(AND(CALC.D!$C$6<>\"\",CALC.D!$G$6<>\"\",CALC.D!$R$2<>\"\",CALC.D!$AB$20=2,CALC.D!$F$10<>\"\",CALC.D!$E$64<>\"\",CALC.D!$F$10=2,$AV$3=3,CALC.D!$G$59=$BO$2),TABELAS!$F$94,0)","v":0},{"$f":"IF(AND(CALC.D!$C$6<>\"\",CALC.D!$G$6<>\"\",CALC.D!$R$2<>\"\",CALC.D!$AB$20=2,CALC.D!$F$10<>\"\",CALC.D!$E$64<>\"\",CALC.D!$F$10=2,$AV$3=3,CALC.D!$G$59=$BP$2),TABELAS!$F$95,0)","v":0},{"$f":"IF(AND(CALC.D!$C$6<>\"\",CALC.D!$G$6<>\"\",CALC.D!$R$2<>\"\",CALC.D!$AB$20=2,CALC.D!$F$10<>\"\",CALC.D!$E$64<>\"\",CALC.D!$F$10=2,$AV$3=3,CALC.D!$G$59=$BQ$2),TABELAS!$F$96,0)","v":0}]
[{"$f":"IF(AND(CALC.D!$B$60<=D10,OR(CALC.D!$B$62<=E10,CALC.D!B62=\"\"),$AO$5<=W5,$AQ$5<=Y12,AP5<=X7,CALC.D!$AB$20=2,G49<=2),1,0)","v":0},0,"C2 TRIFÁSICO",75,30,2,5,20,{"$f":"IF(AND(CALC.D!B15<>\"\",OR(CALC.D!AB16=1,CALC.D!AB16=3)),\"25 mm²\",IF(AND(CALC.D!B15<>\"\",CALC.D!AB16=2),\"16 mm²\",\"\"))","v":""},"TIPO: III OU V"," DJ 80 A","40 mm² OU 1 1/4''","10 mm²","20 ou 1/2''","100 - MULTI 100","200 - MULTI 100",null,"16 mm² - Quadruplex",null,"12CV",7,14940,"X",14940,14940,"12CV",{"$f":"IF(AND(CALC.D!$N$39<>\"\",CALC.D!$L$39<>\"\",CALCULO!$D$7=2,CALC.D!$T$39>0,CALC.D!$AB$20=2),CALC.D!$V$39/CALC.D!$T$39,0)","v":0},{"$f":"IF(AND(AA10>0,CALC.D!$AB$20=2),IF(AA10<=$W$4,$W$4,IF(AA10<=$W$5,$W$5,IF(AA10<=$W$6,$W$6,IF(AA10<=$W$7,$W$7,IF(AA10<=$W$8,$W$8,IF(AA10<=$X$9,$X$9,IF(AA10<=$X$10,$X$10,IF(AA10<=$X$11,$X$11,IF(AA10<=$Y$12,$Y$12,IF(AA10<=$Y$13,$Y$13,IF(AA10<=$Y$14,$Y$14,IF(AA10<=$Y$15,$Y$15,IF(AA10<=$Y$16,$Y$16))))))))))))),0)","v":0},{"$f":"IF(AND(CALC.D!$L$39<>\"\",CALC.D!$N$39<>\"\",CALC.D!$T$39<>\"\",CALC.D!$L$39=\"MONOFÁSICO FN\",CALC.D!$AB$20=2),VLOOKUP(\"MONOFÁSICO FN\",CALC.D!$L$39:$V$39,11,FALSE),\"\")","v":""},"",{"$f":"IF(AND(AC10<>\"\",CALC.D!$AB$20=2),CALC.D!T39,\"\")","v":""},{"$f":"IF(AND(CALC.D!$L$39<>\"\",CALC.D!$N$39<>\"\",CALC.D!$T$39<>\"\",CALC.D!$L$39=\"BIFÁSICO FFN\",CALC.D!$AB$20=2),VLOOKUP(\"BIFÁSICO FFN\",CALC.D!$L$39:$V$39,11,FALSE),\"\")","v":""},"",{"$f":"IF(AND(AF10<>\"\",CALC.D!$AB$20=2),CALC.D!T39,\"\")","v":""},{"$f":"IF(AND(CALC.D!$L$39<>\"\",CALC.D!$N$39<>\"\",CALC.D!$T$39<>\"\",CALC.D!$L$39=\"TRIFÁSICO FFFN\",CALC.D!$AB$20=2),VLOOKUP(\"TRIFÁSICO FFFN\",CALC.D!$L$39:$V$39,11,FALSE),\"\")","v":""},"",{"$f":"IF(AND(AI10<>\"\",CALC.D!$AB$20=2),CALC.D!T39,\"\")","v":""},null,null,null,null,null,null,{"$f":"IF(AND(CALC.D!$L$18<>\"\",CALC.D!$L$18=\"MONOFÁSICO FN\",CALC.D!$AB$20=2),VLOOKUP(\"MONOFÁSICO FN\",CALC.D!$L$18:$V$18,11,FALSE),0)","v":0},{"$f":"IF(AND(CALC.D!$L$18<>\"\",CALC.D!$L$18=\"BIFÁSICO FFN\",CALC.D!$AB$20=2),VLOOKUP(\"BIFÁSICO FFN\",CALC.D!$L$18:$V$18,11,FALSE),0)","v":0},{"$f":"IF(AND(CALC.D!$L$18<>\"\",CALC.D!$L$18=\"TRIFÁSICO FFFN\",CALC.D!$AB$20=2),VLOOKUP(\"TRIFÁSICO FFFN\",CALC.D!$L$18:$V$18,11,FALSE),0)","v":0},null,"4 ou mais",null,8,{"$f":"IF(AND(CALC.D!$C$6<>\"\",CALC.D!$G$6<>\"\",CALC.D!$R$2<>\"\",CALC.D!$AB$20=2,CALC.D!$F$10<>\"\",CALC.D!$E$64<>\"\",CALC.D!$F$10=\"4 ou mais\",$AV$3=3,CALC.D!$G$59=$AY$2),\"Consultar Normas de Ligação Agrupada\",0)","v":0},{"$f":"IF(AND(CALC.D!$C$6<>\"\",CALC.D!$G$6<>\"\",CALC.D!$R$2<>\"\",CALC.D!$AB$20=2,CALC.D!$F$10<>\"\",CALC.D!$E$64<>\"\",CALC.D!$F$10=\"4 ou mais\",$AV$3=3,CALC.D!$G$59=$AZ$2),\"Consultar Normas de Ligação Agrupada\",0)","v":0},{"$f":"IF(AND(CALC.D!$C$6<>\"\",CALC.D!$G$6<>\"\",CALC.D!$R$2<>\"\",CALC.D!$AB$20=2,CALC.D!$F$10<>\"\",CALC.D!$E$64<>\"\",CALC.D!$F$10=\"4 ou mais\",$AV$3=3,CALC.D!$G$59=$BA$2),\"Consultar Normas de Ligação Agrupada\",0)","v":0},{"$f":"IF(AND(CALC.D!$C$6<>\"\",CALC.D!$G$6<>\"\",CALC.D!$R$2<>\"\",CALC.D!$AB$20=2,CALC.D!$F$10<>\"\",CALC.D!$E$64<>\"\",CALC.D!$F$10=\"4 ou mais\",$AV$3=3,CALC.D!$G$59=$BB$2),\"Consultar Normas de Ligação Agrupada\",0)","v":0},{"$f":"IF(AND(CALC.D!$C$6<>\"\",CALC.D!$G$6<>\"\",CALC.D!$R$2<>\"\",CALC.D!$AB$20=2,CALC.D!$F$10<>\"\",CALC.D!$E$64<>\"\",CALC.D!$F$10=3,$AV$3=\"4 ou mais\",CALC.D!$G$59=$BC$2),\"Consultar Normas de Ligação Agrupada\",0)","v":0},{"$f":"IF(AND(CALC.D!$C$6<>\"\",CALC.D!$G$6<>\"\",CALC.D!$R$2<>\"\",CALC.D!$AB$20=2,CALC.D!$F$10<>\"\",CALC.D!$E$64<>\"\",CALC.D!$F$10=\"4 ou mais\",$AV$3=3,CALC.D!$G$59=$BD$2),\"Consultar Normas de Ligação Agrupada\",0)","v":0},{"$f":"IF(AND(CALC.D!$C$6<>\"\",CALC.D!$G$6<>\"\",CALC.D!$R$2<>\"\",CALC.D!$AB$20=2,CALC.D!$F$10<>\"\",CALC.D!$E$64<>\"\",CALC.D!$F$10=\"4 ou mais\",$AV$3=3,CALC.D!$G$59=$BE$2),\"Consultar Normas de Ligação Agrupada\",0)","v":0},{"$f":"IF(AND(CALC.D!$C$6<>\"\",CALC.D!$G$6<>\"\",CALC.D!$R$2<>\"\",CALC.D!$AB$20=2,CALC.D!$F$10<>\"\",CALC.D!$E$64<>\"\",CALC.D!$F$10=\"4 ou mais\",$AV$3=3,CALC.D!$G$59=$BF$2),\"Consultar Normas de Ligação Agrupada\",0)","v":0},{"$f":"IF(AND(CALC.D!$C$6<>\"\",CALC.D!$G$6<>\"\",CALC.D!$R$2<>\"\",CALC.D!$AB$20=2,CALC.D!$F$10<>\"\",CALC.D!$E$64<>\"\",CALC.D!$F$10=\"4 ou mais\",$AV$3=3,CALC.D!$G$59=$BG$2),\"Consultar Normas de Ligação Agrupada\",0)","v":0},{"$f":"IF(AND(CALC.D!$C$6<>\"\",CALC.D!$G$6<>\"\",CALC.D!$R$2<>\"\",CALC.D!$AB$20=2,CALC.D!$F$10<>\"\",CALC.D!$E$64<>\"\",CALC.D!$F$10=\"4 ou mais\",$AV$3=3,CALC.D!$G$59=$BH$2),\"Consultar Normas de Ligação Agrupada\",0)","v":0},8,{"$f":"IF(AND(CALC.D!$C$6<>\"\",CALC.D!$G$6<>\"\",CALC.D!$R$2<>\"\",CALC.D!$AB$20=2,CALC.D!$F$10<>\"\",CALC.D!$E$64<>\"\",CALC.D!$F$10=\"4 ou mais\",$AV$3=3,CALC.D!$G$59=$BJ$2),\"Consultar Normas de Ligação Agrupada\",0)","v":0},{"$f":"IF(AND(CALC.D!$C$6<>\"\",CALC.D!$G$6<>\"\",CALC.D!$R$2<>\"\",CALC.D!$AB$20=2,CALC.D!$F$10<>\"\",CALC.D!$E$64<>\"\",CALC.D!$F$10=\"4 ou mais\",$AV$3=3,CALC.D!$G$59=$BK$2),\"Consultar Normas de Ligação Agrupada\",0)","v":0},{"$f":"IF(AND(CALC.D!$C$6<>\"\",CALC.D!$G$6<>\"\",CALC.D!$R$2<>\"\",CALC.D!$AB$20=2,CALC.D!$F$10<>\"\",CALC.D!$E$64<>\"\",CALC.D!$F$10=\"4 ou mais\",$AV$3=3,CALC.D!$G$59=$BL$2),\"Consultar Normas de Ligação Agrupada\",0)","v":0},{"$f":"IF(AND(CALC.D!$C$6<>\"\",CALC.D!$G$6<>\"\",CALC.D!$R$2<>\"\",CALC.D!$AB$20=2,CALC.D!$F$10<>\"\",CALC.D!$E$64<>\"\",CALC.D!$F$10=\"4 ou mais\",$AV$3=3,CALC.D!$G$59=$BM$2),\"Consultar Normas de Ligação Agrupada\",0)","v":0},{"$f":"IF(AND(CALC.D!$C$6<>\"\",CALC.D!$G$6<>\"\",CALC.D!$R$2<>\"\",CALC.D!$AB$20=2,CALC.D!$F$10<>\"\",CALC.D!$E$64<>\"\",CALC.D!$F$10=\"4 ou mais\",$AV$3=3,CALC.D!$G$59=$BN$2),\"Consultar Normas de Ligação Agrupada\",0)","v":0},{"$f":"IF(AND(CALC.D!$C$6<>\"\",CALC.D!$G$6<>\"\",CALC.D!$R$2<>\"\",CALC.D!$AB$20=2,CALC.D!$F$10<>\"\",CALC.D!$E$64<>\"\",CALC.D!$F$10=\"4 ou mais\",$AV$3=3,CALC.D!$G$59=$BO$2),\"Consultar Normas de Ligação Agrupada\",0)","v":0},{"$f":"IF(AND(CALC.D!$C$6<>\"\",CALC.D!$G$6<>\"\",CALC.D!$R$2<>\"\",CALC.D!$AB$20=2,CALC.D!$F$10<>\"\",CALC.D!$E$64<>\"\",CALC.D!$F$10=\"4 ou mais\",$AV$3=3,CALC.D!$G$59=$BP$2),\"Consultar Normas de Ligação Agrupada\",0)","v":0},{"$f":"IF(AND(CALC.D!$C$6<>\"\",CALC.D!$G$6<>\"\",CALC.D!$R$2<>\"\",CALC.D!$AB$20=2,CALC.D!$F$10<>\"\",CALC.D!$E$64<>\"\",CALC.D!$F$10=\"4 ou mais\",$AV$3=3,CALC.D!$G$59=$BQ$2),\"Consultar Normas de Ligação Agrupada\",0)","v":0}]
[{"$f":"IF(AND(CALC.D!$B$60<=D11,OR(CALC.D!$B$62<=E11,CALC.D!B62=\"\"),$AO$5<=W6,AP5<=X8,$AQ$5<=Y13,CALC.D!$AB$20=2,G49<=2),1,0)","v":0},0,"C3 TRIFÁSICO",75,38,3,7.5,25,{"$f":"IF(AND(CALC.D!B15<>\"\",OR(CALC.D!AB16=1,CALC.D!AB16=3)),\"35 mm²\",IF(AND(CALC.D!B15<>\"\",CALC.D!AB16=2),\"25 mm²\",\"\"))","v":""},"TIPO: III OU V","DJ 100 A","40 mm² OU 1 1/4''","10 mm²","20 ou 1/2''","100 - MULTI 100","200 - MULTI 100",null,"25 mm² - Quadruplex",null,"15CV",8,16940,"X",{"$f":"CALC.D!AI37","v":16940},{"$f":"CALC.D!AH37","v":16650},"15CV","TOTAL",null,{"$f":"IF(AO5>0,VLOOKUP(AO5,AC4:AE10,2,FALSE),\"\")","v":""},null,null,{"$f":"IF(AP5>0,VLOOKUP(AP5,AF4:AH10,2,FALSE),\"\")","v":""},null,null,{"$f":"IFERROR(IF(AQ5>0,VLOOKUP(AQ5,AI4:AK10,2,FALSE),\"\"),0)","v":""},null,null,null,null,null,null,null,null,{"$f":"COUNTIF(AR3:AR10,\"\")","v":0},{"$f":"COUNTIF(AS3:AS10,\"\")","v":0},0,"POSTE METÁLICO",1,{"$f":"IF(CALC.D!$E$64=TABELAS!A63,VLOOKUP(CALC.D!$F$10,$AV$11:$AX$13,3,FALSE),0)","v":0},9,{"$f":"IF(AND(CALC.D!$C$6<>\"\",CALC.D!$G$6<>\"\",CALC.D!$R$2<>\"\",CALC.D!$AB$20=2,CALC.D!$F$10<>\"\",CALC.D!$E$64<>\"\",CALC.D!$F$10=1,$AV$3=4,CALC.D!$G$59=$AY$2),TABELAS!$H$79,0)","v":0},{"$f":"IF(AND(CALC.D!$C$6<>\"\",CALC.D!$G$6<>\"\",CALC.D!$R$2<>\"\",CALC.D!$AB$20=2,CALC.D!$F$10<>\"\",CALC.D!$E$64<>\"\",CALC.D!$F$10=1,$AV$3=4,CALC.D!$G$59=$AZ$2),TABELAS!$H$80,0)","v":0},{"$f":"IF(AND(CALC.D!$C$6<>\"\",CALC.D!$G$6<>\"\",CALC.D!$R$2<>\"\",CALC.D!$AB$20=2,CALC.D!$F$10<>\"\",CALC.D!$E$64<>\"\",CALC.D!$F$10=1,$AV$3=4,CALC.D!$G$59=$BA$2),TABELAS!$H$83,0)","v":0},{"$f":"IF(AND(CALC.D!$C$6<>\"\",CALC.D!$G$6<>\"\",CALC.D!$R$2<>\"\",CALC.D!$AB$20=2,CALC.D!$F$10<>\"\",CALC.D!$E$64<>\"\",CALC.D!$F$10=1,$AV$3=4,CALC.D!$G$59=$BB$2),TABELAS!$H$84,0)","v":0},{"$f":"IF(AND(CALC.D!$C$6<>\"\",CALC.D!$G$6<>\"\",CALC.D!$R$2<>\"\",CALC.D!$AB$20=2,CALC.D!$F$10<>\"\",CALC.D!$E$64<>\"\",CALC.D!$F$10=1,$AV$3=4,CALC.D!$G$59=$BC$2),TABELAS!$H$86,0)","v":0},{"$f":"IF(AND(CALC.D!$C$6<>\"\",CALC.D!$G$6<>\"\",CALC.D!$R$2<>\"\",CALC.D!$AB$20=2,CALC.D!$F$10<>\"\",CALC.D!$E$64<>\"\",CALC.D!$F$10=1,$AV$3=4,CALC.D!$G$59=$BD$2),TABELAS!$H$87,0)","v":0},{"$f":"IF(AND(CALC.D!$C$6<>\"\",CALC.D!$G$6<>\"\",CALC.D!$R$2<>\"\",CALC.D!$AB$20=2,CALC.D!$F$10<>\"\",CALC.D!$E$64<>\"\",CALC.D!$F$10=1,$AV$3=4,CALC.D!$G$59=$BE$2),TABELAS!$H$88,0)","v":0},{"$f":"IF(AND(CALC.D!$C$6<>\"\",CALC.D!$G$6<>\"\",CALC.D!$R$2<>\"\",CALC.D!$AB$20=2,CALC.D!$F$10<>\"\",CALC.D!$E$64<>\"\",CALC.D!$F$10=1,$AV$3=4,CALC.D!$G$59=$BF$2),TABELAS!$H$89,0)","v":0},{"$f":"IF(AND(CALC.D!$C$6<>\"\",CALC.D!$G$6<>\"\",CALC.D!$R$2<>\"\",CALC.D!$AB$20=2,CALC.D!$F$10<>\"\",CALC.D!$E$64<>\"\",CALC.D!$F$10=1,$AV$3=4,CALC.D!$G$59=$BG$2),TABELAS!$H$90,0)","v":0},{"$f":"IF(AND(CALC.D!$C$6<>\"\",CALC.D!$G$6<>\"\",CALC.D!$R$2<>\"\",CALC.D!$AB$20=2,CALC.D!$F$10<>\"\",CALC.D!$E$64<>\"\",CALC.D!$F$10=1,$AV$3=4,CALC.D!$G$59=$BH$2),TABELAS!$H$91,0)","v":0},9,{"$f":"IF(AND(CALC.D!$C$6<>\"\",CALC.D!$G$6<>\"\",CALC.D!$R$2<>\"\",CALC.D!$AB$20=2,CALC.D!$F$10<>\"\",CALC.D!$E$64<>\"\",CALC.D!$F$10=1,$AV$3=4,CALC.D!$G$59=$BJ$2),TABELAS!$H$81,0)","v":0},{"$f":"IF(AND(CALC.D!$C$6<>\"\",CALC.D!$G$6<>\"\",CALC.D!$R$2<>\"\",CALC.D!$AB$20=2,CALC.D!$F$10<>\"\",CALC.D!$E$64<>\"\",CALC.D!$F$10=1,$AV$3=4,CALC.D!$G$59=$BK$2),TABELAS!$H$82,0)","v":0},{"$f":"IF(AND(CALC.D!$C$6<>\"\",CALC.D!$G$6<>\"\",CALC.D!$R$2<>\"\",CALC.D!$AB$20=2,CALC.D!$F$10<>\"\",CALC.D!$E$64<>\"\",CALC.D!$F$10=1,$AV$3=4,CALC.D!$G$59=$BL$2),TABELAS!$H$85,0)","v":0},{"$f":"IF(AND(CALC.D!$C$6<>\"\",CALC.D!$G$6<>\"\",CALC.D!$R$2<>\"\",CALC.D!$AB$20=2,CALC.D!$F$10<>\"\",CALC.D!$E$64<>\"\",CALC.D!$F$10=1,$AV$3=4,CALC.D!$G$59=$BM$2),TABELAS!$H$92,0)","v":0},{"$f":"IF(AND(CALC.D!$C$6<>\"\",CALC.D!$G$6<>\"\",CALC.D!$R$2<>\"\",CALC.D!$AB$20=2,CALC.D!$F$10<>\"\",CALC.D!$E$64<>\"\",CALC.D!$F$10=1,$AV$3=4,CALC.D!$G$59=$BN$2),TABELAS!$H$93,0)","v":0},{"$f":"IF(AND(CALC.D!$C$6<>\"\",CALC.D!$G$6<>\"\",CALC.D!$R$2<>\"\",CALC.D!$AB$20=2,CALC.D!$F$10<>\"\",CALC.D!$E$64<>\"\",CALC.D!$F$10=1,$AV$3=4,CALC.D!$G$59=$BO$2),\"\",0)","v":0},{"$f":"IF(AND(CALC.D!$C$6<>\"\",CALC.D!$G$6<>\"\",CALC.D!$R$2<>\"\",CALC.D!$AB$20=2,CALC.D!$F$10<>\"\",CALC.D!$E$64<>\"\",CALC.D!$F$10=1,$AV$3=4,CALC.D!$G$59=$BP$2),\"\",0)","v":0},{"$f":"IF(AND(CALC.D!$C$6<>\"\",CALC.D!$G$6<>\"\",CALC.D!$R$2<>\"\",CALC.D!$AB$20=2,CALC.D!$F$10<>\"\",CALC.D!$E$64<>\"\",CALC.D!$F$10=1,$AV$3=4,CALC.D!$G$59=$BQ$2),\"\",0)","v":0}]
[{"$f":"IF(AND(CALC.D!$B$60<=D12,OR(CALC.D!$B$62<=E12,CALC.D!B62=\"\"),$AO$5<=W7,AP5<=X8,$AQ$5<=Y14,CALC.D!$AB$20=2,G49<=1),1,0)","v":0},0,"C4 TRIFÁSICO",75,47,3,7.5,30,{"$f":"IF(AND(CALC.D!B15<>\"\",OR(CALC.D!AB16=1,CALC.D!AB16=3)),\"50 mm²\",IF(AND(CALC.D!B15<>\"\",CALC.D!AB16=2),\"35 mm²\",\"\"))","v":""},"TIPO: H+T OPCIONAL M+T","DJ 125 A","50 mm² OU 1 1/2''","16 mm²","20 ou 1/2''","300 - MULTI 200","600 - MULTI 200",null,"35 mm² - Quadruplex",null,"20CV",9,22100,"X","X",{"$f":"CALC.D!AH38","v":22100},"20CV",null,null,null,null,null,null,null,null,null,null,null,null,null,null,null,null,null,null,null,null,null,2,null,10,{"$f":"IF(AND(CALC.D!$C$6<>\"\",CALC.D!$G$6<>\"\",CALC.D!$R$2<>\"\",CALC.D!$AB$20=2,CALC.D!$F$10<>\"\",CALC.D!$E$64<>\"\",CALC.D!$F$10=2,$AV$3=4,CALC.D!$G$59=$AY$2),TABELAS!$H$79,0)","v":0},{"$f":"IF(AND(CALC.D!$C$6<>\"\",CALC.D!$G$6<>\"\",CALC.D!$R$2<>\"\",CALC.D!$AB$20=2,CALC.D!$F$10<>\"\",CALC.D!$E$64<>\"\",CALC.D!$F$10=2,$AV$3=4,CALC.D!$G$59=$AZ$2),TABELAS!$H$80,0)","v":0},{"$f":"IF(AND(CALC.D!$C$6<>\"\",CALC.D!$G$6<>\"\",CALC.D!$R$2<>\"\",CALC.D!$AB$20=2,CALC.D!$F$10<>\"\",CALC.D!$E$64<>\"\",CALC.D!$F$10=2,$AV$3=4,CALC.D!$G$59=$BA$2),TABELAS!$H$83,0)","v":0},{"$f":"IF(AND(CALC.D!$C$6<>\"\",CALC.D!$G$6<>\"\",CALC.D!$R$2<>\"\",CALC.D!$AB$20=2,CALC.D!$F$10<>\"\",CALC.D!$E$64<>\"\",CALC.D!$F$10=2,$AV$3=4,CALC.D!$G$59=$BB$2),TABELAS!$H$84,0)","v":0},{"$f":"IF(AND(CALC.D!$C$6<>\"\",CALC.D!$G$6<>\"\",CALC.D!$R$2<>\"\",CALC.D!$AB$20=2,CALC.D!$F$10<>\"\",CALC.D!$E$64<>\"\",CALC.D!$F$10=2,$AV$3=4,CALC.D!$G$59=$BC$2),TABELAS!$H$86,0)","v":0},{"$f":"IF(AND(CALC.D!$C$6<>\"\",CALC.D!$G$6<>\"\",CALC.D!$R$2<>\"\",CALC.D!$AB$20=2,CALC.D!$F$10<>\"\",CALC.D!$E$64<>\"\",CALC.D!$F$10=2,$AV$3=4,CALC.D!$G$59=$BD$2),TABELAS!$H$87,0)","v":0},{"$f":"IF(AND(CALC.D!$C$6<>\"\",CALC.D!$G$6<>\"\",CALC.D!$R$2<>\"\",CALC.D!$AB$20=2,CALC.D!$F$10<>\"\",CALC.D!$E$64<>\"\",CALC.D!$F$10=2,$AV$3=4,CALC.D!$G$59=$BE$2),TABELAS!$H$88,0)","v":0},{"$f":"IF(AND(CALC.D!$C$6<>\"\",CALC.D!$G$6<>\"\",CALC.D!$R$2<>\"\",CALC.D!$AB$20=2,CALC.D!$F$10<>\"\",CALC.D!$E$64<>\"\",CALC.D!$F$10=2,$AV$3=4,CALC.D!$G$59=$BF$2),TABELAS!$H$89,0)","v":0},{"$f":"IF(AND(CALC.D!$C$6<>\"\",CALC.D!$G$6<>\"\",CALC.D!$R$2<>\"\",CALC.D!$AB$20=2,CALC.D!$F$10<>\"\",CALC.D!$E$64<>\"\",CALC.D!$F$10=2,$AV$3=4,CALC.D!$G$59=$BG$2),TABELAS!$H$90,0)","v":0},{"$f":"IF(AND(CALC.D!$C$6<>\"\",CALC.D!$G$6<>\"\",CALC.D!$R$2<>\"\",CALC.D!$AB$20=2,CALC.D!$F$10<>\"\",CALC.D!$E$64<>\"\",CALC.D!$F$10=2,$AV$3=4,CALC.D!$G$59=$BH$2),TABELAS!$H$91,0)","v":0},10,{"$f":"IF(AND(CALC.D!$C$6<>\"\",CALC.D!$G$6<>\"\",CALC.D!$R$2<>\"\",CALC.D!$AB$20=2,CALC.D!$F$10<>\"\",CALC.D!$E$64<>\"\",CALC.D!$F$10=2,$AV$3=4,CALC.D!$G$59=$BJ$2),TABELAS!$H$81,0)","v":0},{"$f":"IF(AND(CALC.D!$C$6<>\"\",CALC.D!$G$6<>\"\",CALC.D!$R$2<>\"\",CALC.D!$AB$20=2,CALC.D!$F$10<>\"\",CALC.D!$E$64<>\"\",CALC.D!$F$10=2,$AV$3=4,CALC.D!$G$59=$BK$2),TABELAS!$H$82,0)","v":0},{"$f":"IF(AND(CALC.D!$C$6<>\"\",CALC.D!$G$6<>\"\",CALC.D!$R$2<>\"\",CALC.D!$AB$20=2,CALC.D!$F$10<>\"\",CALC.D!$E$64<>\"\",CALC.D!$F$10=2,$AV$3=4,CALC.D!$G$59=$BL$2),TABELAS!$H$85,0)","v":0},{"$f":"IF(AND(CALC.D!$C$6<>\"\",CALC.D!$G$6<>\"\",CALC.D!$R$2<>\"\",CALC.D!$AB$20=2,CALC.D!$F$10<>\"\",CALC.D!$E$64<>\"\",CALC.D!$F$10=2,$AV$3=4,CALC.D!$G$59=$BM$2),TABELAS!$H$92,0)","v":0},{"$f":"IF(AND(CALC.D!$C$6<>\"\",CALC.D!$G$6<>\"\",CALC.D!$R$2<>\"\",CALC.D!$AB$20=2,CALC.D!$F$10<>\"\",CALC.D!$E$64<>\"\",CALC.D!$F$10=2,$AV$3=4,CALC.D!$G$59=$BN$2),TABELAS!$H$93,0)","v":0},{"$f":"IF(AND(CALC.D!$C$6<>\"\",CALC.D!$G$6<>\"\",CALC.D!$R$2<>\"\",CALC.D!$AB$20=2,CALC.D!$F$10<>\"\",CALC.D!$E$64<>\"\",CALC.D!$F$10=2,$AV$3=4,CALC.D!$G$59=$BO$2),\"\",0)","v":0},{"$f":"IF(AND(CALC.D!$C$6<>\"\",CALC.D!$G$6<>\"\",CALC.D!$R$2<>\"\",CALC.D!$AB$20=2,CALC.D!$F$10<>\"\",CALC.D!$E$64<>\"\",CALC.D!$F$10=2,$AV$3=4,CALC.D!$G$59=$BP$2),\"\",0)","v":0},{"$f":"IF(AND(CALC.D!$C$6<>\"\",CALC.D!$G$6<>\"\",CALC.D!$R$2<>\"\",CALC.D!$AB$20=2,CALC.D!$F$10<>\"\",CALC.D!$E$64<>\"\",CALC.D!$F$10=2,$AV$3=4,CALC.D!$G$59=$BQ$2),\"\",0)","v":0}]
[{"$f":"IF(AND(CALC.D!$B$60<=D13,OR(CALC.D!$B$62<=E13,CALC.D!B62=\"\"),$AO$5<=W8,AP5<=X9,$AQ$5<=Y15,CALC.D!$AB$20=2,G49<=1),1,0)","v":0},0,"C5 TRIFÁSICO",75,57,7.5,10,40,{"$f":"IF(AND(CALC.D!B15<>\"\",OR(CALC.D!AB16=1,CALC.D!AB16=3)),\"70 mm²\",IF(AND(CALC.D!B15<>\"\",CALC.D!AB16=2),\"50 mm²\",\"\"))","v":""},"TIPO: H+T OPCIONAL M+T","DJ 150 A","60 mm² OU 2''","25 mm²","20 ou 1/2''","300 - MULTI 200","600 - MULTI 200",null,"50 mm² - Quadruplex",null,25,10,25830,"X","X",{"$f":"CALC.D!AH39","v":25830},"25CV",null,null,null,null,null,null,null,null,null,null,null,null,null,null,null,null,null,null,null,null,null,"4 ou mais",null,12,{"$f":"IF(AND(CALC.D!$C$6<>\"\",CALC.D!$G$6<>\"\",CALC.D!$R$2<>\"\",CALC.D!$AB$20=2,CALC.D!$F$10<>\"\",CALC.D!$E$64<>\"\",CALC.D!$F$10=\"4 ou mais\",$AV$3=4,CALC.D!$G$59=$AY$2),\"Consultar Normas de Ligação Agrupada\",0)","v":0},{"$f":"IF(AND(CALC.D!$C$6<>\"\",CALC.D!$G$6<>\"\",CALC.D!$R$2<>\"\",CALC.D!$AB$20=2,CALC.D!$F$10<>\"\",CALC.D!$E$64<>\"\",CALC.D!$F$10=\"4 ou mais\",$AV$3=4,CALC.D!$G$59=$AZ$2),\"Consultar Normas de Ligação Agrupada\",0)","v":0},{"$f":"IF(AND(CALC.D!$C$6<>\"\",CALC.D!$G$6<>\"\",CALC.D!$R$2<>\"\",CALC.D!$AB$20=2,CALC.D!$F$10<>\"\",CALC.D!$E$64<>\"\",CALC.D!$F$10=\"4 ou mais\",$AV$3=4,CALC.D!$G$59=$BA$2),\"Consultar Normas de Ligação Agrupada\",0)","v":0},{"$f":"IF(AND(CALC.D!$C$6<>\"\",CALC.D!$G$6<>\"\",CALC.D!$R$2<>\"\",CALC.D!$AB$20=2,CALC.D!$F$10<>\"\",CALC.D!$E$64<>\"\",CALC.D!$F$10=\"4 ou mais\",$AV$3=4,CALC.D!$G$59=$BB$2),\"Consultar Normas de Ligação Agrupada\",0)","v":0},{"$f":"IF(AND(CALC.D!$C$6<>\"\",CALC.D!$G$6<>\"\",CALC.D!$R$2<>\"\",CALC.D!$AB$20=2,CALC.D!$F$10<>\"\",CALC.D!$E$64<>\"\",CALC.D!$F$10=\"4 ou mais\",$AV$3=4,CALC.D!$G$59=$BC$2),\"Consultar Normas de Ligação Agrupada\",0)","v":0},{"$f":"IF(AND(CALC.D!$C$6<>\"\",CALC.D!$G$6<>\"\",CALC.D!$R$2<>\"\",CALC.D!$AB$20=2,CALC.D!$F$10<>\"\",CALC.D!$E$64<>\"\",CALC.D!$F$10=\"4 ou mais\",$AV$3=4,CALC.D!$G$59=$BD$2),\"Consultar Normas de Ligação Agrupada\",0)","v":0},{"$f":"IF(AND(CALC.D!$C$6<>\"\",CALC.D!$G$6<>\"\",CALC.D!$R$2<>\"\",CALC.D!$AB$20=2,CALC.D!$F$10<>\"\",CALC.D!$E$64<>\"\",CALC.D!$F$10=\"4 ou mais\",$AV$3=4,CALC.D!$G$59=$BE$2),\"Consultar Normas de Ligação Agrupada\",0)","v":0},{"$f":"IF(AND(CALC.D!$C$6<>\"\",CALC.D!$G$6<>\"\",CALC.D!$R$2<>\"\",CALC.D!$AB$20=2,CALC.D!$F$10<>\"\",CALC.D!$E$64<>\"\",CALC.D!$F$10=\"4 ou mais\",$AV$3=4,CALC.D!$G$59=$BF$2),\"Consultar Normas de Ligação Agrupada\",0)","v":0},{"$f":"IF(AND(CALC.D!$C$6<>\"\",CALC.D!$G$6<>\"\",CALC.D!$R$2<>\"\",CALC.D!$AB$20=2,CALC.D!$F$10<>\"\",CALC.D!$E$64<>\"\",CALC.D!$F$10=\"4 ou mais\",$AV$3=4,CALC.D!$G$59=$BG$2),\"Consultar Normas de Ligação Agrupada\",0)","v":0},{"$f":"IF(AND(CALC.D!$C$6<>\"\",CALC.D!$G$6<>\"\",CALC.D!$R$2<>\"\",CALC.D!$AB$20=2,CALC.D!$F$10<>\"\",CALC.D!$E$64<>\"\",CALC.D!$F$10=\"4 ou mais\",$AV$3=4,CALC.D!$G$59=$BH$2),\"Consultar Normas de Ligação Agrupada\",0)","v":0},12,{"$f":"IF(AND(CALC.D!$C$6<>\"\",CALC.D!$G$6<>\"\",CALC.D!$R$2<>\"\",CALC.D!$AB$20=2,CALC.D!$F$10<>\"\",CALC.D!$E$64<>\"\",CALC.D!$F$10=\"4 ou mais\",$AV$3=4,CALC.D!$G$59=$BJ$2),\"Consultar Normas de Ligação Agrupada\",0)","v":0},{"$f":"IF(AND(CALC.D!$C$6<>\"\",CALC.D!$G$6<>\"\",CALC.D!$R$2<>\"\",CALC.D!$AB$20=2,CALC.D!$F$10<>\"\",CALC.D!$E$64<>\"\",CALC.D!$F$10=\"4 ou mais\",$AV$3=4,CALC.D!$G$59=$BK$2),\"Consultar Normas de Ligação Agrupada\",0)","v":0},{"$f":"IF(AND(CALC.D!$C$6<>\"\",CALC.D!$G$6<>\"\",CALC.D!$R$2<>\"\",CALC.D!$AB$20=2,CALC.D!$F$10<>\"\",CALC.D!$E$64<>\"\",CALC.D!$F$10=\"4 ou mais\",$AV$3=4,CALC.D!$G$59=$BL$2),\"Consultar Normas de Ligação Agrupada\",0)","v":0},{"$f":"IF(AND(CALC.D!$C$6<>\"\",CALC.D!$G$6<>\"\",CALC.D!$R$2<>\"\",CALC.D!$AB$20=2,CALC.D!$F$10<>\"\",CALC.D!$E$64<>\"\",CALC.D!$F$10=\"4 ou mais\",$AV$3=4,CALC.D!$G$59=$BM$2),\"Consultar Normas de Ligação Agrupada\",0)","v":0},{"$f":"IF(AND(CALC.D!$C$6<>\"\",CALC.D!$G$6<>\"\",CALC.D!$R$2<>\"\",CALC.D!$AB$20=2,CALC.D!$F$10<>\"\",CALC.D!$E$64<>\"\",CALC.D!$F$10=\"4 ou mais\",$AV$3=4,CALC.D!$G$59=$BN$2),\"Consultar Normas de Ligação Agrupada\",0)","v":0},{"$f":"IF(AND(CALC.D!$C$6<>\"\",CALC.D!$G$6<>\"\",CALC.D!$R$2<>\"\",CALC.D!$AB$20=2,CALC.D!$F$10<>\"\",CALC.D!$E$64<>\"\",CALC.D!$F$10=\"4 ou mais\",$AV$3=4,CALC.D!$G$59=$BO$2),\"\",0)","v":0},{"$f":"IF(AND(CALC.D!$C$6<>\"\",CALC.D!$G$6<>\"\",CALC.D!$R$2<>\"\",CALC.D!$AB$20=2,CALC.D!$F$10<>\"\",CALC.D!$E$64<>\"\",CALC.D!$F$10=\"4 ou mais\",$AV$3=4,CALC.D!$G$59=$BP$2),\"\",0)","v":0},{"$f":"IF(AND(CALC.D!$C$6<>\"\",CALC.D!$G$6<>\"\",CALC.D!$R$2<>\"\",CALC.D!$AB$20=2,CALC.D!$F$10<>\"\",CALC.D!$E$64<>\"\",CALC.D!$F$10=\"4 ou mais\",$AV$3=4,CALC.D!$G$59=$BQ$2),\"\",0)","v":0}]
[{"$f":"IF(AND(CALC.D!$B$60<=D14,OR(CALC.D!$B$62<=E14,CALC.D!B62=\"\"),$AO$5<=W8,AP5<=X11,$AQ$5<=Y16,CALC.D!$AB$20=2,G49<=1),1,0)","v":0},0,"C6 TRIFÁSICO",75,76,7.5,15,50,{"$f":"IF(AND(CALC.D!B15<>\"\",OR(CALC.D!AB16=1,CALC.D!AB16=3)),\"95 mm²\",IF(AND(CALC.D!B15<>\"\",CALC.D!AB16=2),\"70 mm²\",\"\"))","v":""},"TIPO: H+T OPCIONAL M+T","DJ 200 A","60 mm² OU 2''","35 mm²","20 ou 1/2''","300 - MULTI 200","600 - MULTI 200",null,"70 mm² - Quadruplex",null,"30CV",11,30520,"X","X",{"$f":"CALC.D!AH40","v":30520},"30CV",null,null,null,null,null,null,null,null,null,null,null,null,null,null,null,null,null,null,null,null,"POSTE FIBRA DE VIDRO",1,{"$f":"IF(CALC.D!$E$64=TABELAS!A64,VLOOKUP(CALC.D!$F$10,$AV$14:$AX$15,3,FALSE),0)","v":0},13,{"$f":"IF(AND(CALC.D!$C$6<>\"\",CALC.D!$G$6<>\"\",CALC.D!$R$2<>\"\",CALC.D!$AB$20=2,CALC.D!$F$10<>\"\",CALC.D!$E$64<>\"\",CALC.D!$F$10=1,$AV$3=5,CALC.D!$G$59=$AY$2),TABELAS!$L$79,0)","v":0},{"$f":"IF(AND(CALC.D!$C$6<>\"\",CALC.D!$G$6<>\"\",CALC.D!$R$2<>\"\",CALC.D!$AB$20=2,CALC.D!$F$10<>\"\",CALC.D!$E$64<>\"\",CALC.D!$F$10=1,$AV$3=5,CALC.D!$G$59=$AZ$2),TABELAS!$L$80,0)","v":0},{"$f":"IF(AND(CALC.D!$C$6<>\"\",CALC.D!$G$6<>\"\",CALC.D!$R$2<>\"\",CALC.D!$AB$20=2,CALC.D!$F$10<>\"\",CALC.D!$E$64<>\"\",CALC.D!$F$10=1,$AV$3=5,CALC.D!$G$59=$BA$2),TABELAS!$L$83,0)","v":0},{"$f":"IF(AND(CALC.D!$C$6<>\"\",CALC.D!$G$6<>\"\",CALC.D!$R$2<>\"\",CALC.D!$AB$20=2,CALC.D!$F$10<>\"\",CALC.D!$E$64<>\"\",CALC.D!$F$10=1,$AV$3=5,CALC.D!$G$59=$BB$2),TABELAS!$L$84,0)","v":0},{"$f":"IF(AND(CALC.D!$C$6<>\"\",CALC.D!$G$6<>\"\",CALC.D!$R$2<>\"\",CALC.D!$AB$20=2,CALC.D!$F$10<>\"\",CALC.D!$E$64<>\"\",CALC.D!$F$10=1,$AV$3=5,CALC.D!$G$59=$BC$2),TABELAS!$L$86,0)","v":0},{"$f":"IF(AND(CALC.D!$C$6<>\"\",CALC.D!$G$6<>\"\",CALC.D!$R$2<>\"\",CALC.D!$AB$20=2,CALC.D!$F$10<>\"\",CALC.D!$E$64<>\"\",CALC.D!$F$10=1,$AV$3=5,CALC.D!$G$59=$BD$2),TABELAS!$L$87,0)","v":0},{"$f":"IF(AND(CALC.D!$C$6<>\"\",CALC.D!$G$6<>\"\",CALC.D!$R$2<>\"\",CALC.D!$AB$20=2,CALC.D!$F$10<>\"\",CALC.D!$E$64<>\"\",CALC.D!$F$10=1,$AV$3=5,CALC.D!$G$59=$BE$2),TABELAS!$L$88,0)","v":0},{"$f":"IF(AND(CALC.D!$C$6<>\"\",CALC.D!$G$6<>\"\",CALC.D!$R$2<>\"\",CALC.D!$AB$20=2,CALC.D!$F$10<>\"\",CALC.D!$E$64<>\"\",CALC.D!$F$10=1,$AV$3=5,CALC.D!$G$59=$BF$2),TABELAS!$L$89,0)","v":0},{"$f":"IF(AND(CALC.D!$C$6<>\"\",CALC.D!$G$6<>\"\",CALC.D!$R$2<>\"\",CALC.D!$AB$20=2,CALC.D!$F$10<>\"\",CALC.D!$E$64<>\"\",CALC.D!$F$10=1,$AV$3=5,CALC.D!$G$59=$BG$2),TABELAS!$L$90,0)","v":0},{"$f":"IF(AND(CALC.D!$C$6<>\"\",CALC.D!$G$6<>\"\",CALC.D!$R$2<>\"\",CALC.D!$AB$20=2,CALC.D!$F$10<>\"\",CALC.D!$E$64<>\"\",CALC.D!$F$10=1,$AV$3=5,CALC.D!$G$59=$BH$2),TABELAS!$L$91,0)","v":0},13,{"$f":"IF(AND(CALC.D!$C$6<>\"\",CALC.D!$G$6<>\"\",CALC.D!$R$2<>\"\",CALC.D!$AB$20=2,CALC.D!$F$10<>\"\",CALC.D!$E$64<>\"\",CALC.D!$F$10=1,$AV$3=5,CALC.D!$G$59=$BJ$2),TABELAS!$L$81,0)","v":0},{"$f":"IF(AND(CALC.D!$C$6<>\"\",CALC.D!$G$6<>\"\",CALC.D!$R$2<>\"\",CALC.D!$AB$20=2,CALC.D!$F$10<>\"\",CALC.D!$E$64<>\"\",CALC.D!$F$10=1,$AV$3=5,CALC.D!$G$59=$BK$2),TABELAS!$L$82,0)","v":0},{"$f":"IF(AND(CALC.D!$C$6<>\"\",CALC.D!$G$6<>\"\",CALC.D!$R$2<>\"\",CALC.D!$AB$20=2,CALC.D!$F$10<>\"\",CALC.D!$E$64<>\"\",CALC.D!$F$10=1,$AV$3=5,CALC.D!$G$59=$BL$2),TABELAS!$L$85,0)","v":0},{"$f":"IF(AND(CALC.D!$C$6<>\"\",CALC.D!$G$6<>\"\",CALC.D!$R$2<>\"\",CALC.D!$AB$20=2,CALC.D!$F$10<>\"\",CALC.D!$E$64<>\"\",CALC.D!$F$10=1,$AV$3=5,CALC.D!$G$59=$BM$2),TABELAS!$L$92,0)","v":0},{"$f":"IF(AND(CALC.D!$C$6<>\"\",CALC.D!$G$6<>\"\",CALC.D!$R$2<>\"\",CALC.D!$AB$20=2,CALC.D!$F$10<>\"\",CALC.D!$E$64<>\"\",CALC.D!$F$10=1,$AV$3=5,CALC.D!$G$59=$BN$2),TABELAS!$L$93,0)","v":0},{"$f":"IF(AND(CALC.D!$C$6<>\"\",CALC.D!$G$6<>\"\",CALC.D!$R$2<>\"\",CALC.D!$AB$20=2,CALC.D!$F$10<>\"\",CALC.D!$E$64<>\"\",CALC.D!$F$10=1,$AV$3=5,CALC.D!$G$59=$BO$2),TABELAS!$L$94,0)","v":0},{"$f":"IF(AND(CALC.D!$C$6<>\"\",CALC.D!$G$6<>\"\",CALC.D!$R$2<>\"\",CALC.D!$AB$20=2,CALC.D!$F$10<>\"\",CALC.D!$E$64<>\"\",CALC.D!$F$10=1,$AV$3=5,CALC.D!$G$59=$BP$2),TABELAS!$L$95,0)","v":0},{"$f":"IF(AND(CALC.D!$C$6<>\"\",CALC.D!$G$6<>\"\",CALC.D!$R$2<>\"\",CALC.D!$AB$20=2,CALC.D!$F$10<>\"\",CALC.D!$E$64<>\"\",CALC.D!$F$10=1,$AV$3=5,CALC.D!$G$59=$BQ$2),TABELAS!$L$96,0)","v":0}]
[null,null,null,null,null,null,null,null,null,null,null,null,null,null,null,null,null,null,null,"40CV",12,39740,"X","X",{"$f":"CALC.D!AH41","v":39740},"40CV",null,null,null,null,null,null,null,null,null,null,null,null,null,null,null,null,null,null,null,null,null,"4 ou mais",null,16,{"$f":"IF(AND(CALC.D!$C$6<>\"\",CALC.D!$G$6<>\"\",CALC.D!$R$2<>\"\",CALC.D!$AB$20=2,CALC.D!$F$10<>\"\",CALC.D!$E$64<>\"\",CALC.D!$F$10=\"4 ou mais\",$AV$3=5,CALC.D!$G$59=$AY$2),\"Consultar Normas de Ligação Agrupada\",0)","v":0},{"$f":"IF(AND(CALC.D!$C$6<>\"\",CALC.D!$G$6<>\"\",CALC.D!$R$2<>\"\",CALC.D!$AB$20=2,CALC.D!$F$10<>\"\",CALC.D!$E$64<>\"\",CALC.D!$F$10=\"4 ou mais\",$AV$3=5,CALC.D!$G$59=$AZ$2),\"Consultar Normas de Ligação Agrupada\",0)","v":0},{"$f":"IF(AND(CALC.D!$C$6<>\"\",CALC.D!$G$6<>\"\",CALC.D!$R$2<>\"\",CALC.D!$AB$20=2,CALC.D!$F$10<>\"\",CALC.D!$E$64<>\"\",CALC.D!$F$10=\"4 ou mais\",$AV$3=5,CALC.D!$G$59=$BA$2),\"Consultar Normas de Ligação Agrupada\",0)","v":0},{"$f":"IF(AND(CALC.D!$C$6<>\"\",CALC.D!$G$6<>\"\",CALC.D!$R$2<>\"\",CALC.D!$AB$20=2,CALC.D!$F$10<>\"\",CALC.D!$E$64<>\"\",CALC.D!$F$10=\"4 ou mais\",$AV$3=5,CALC.D!$G$59=$BB$2),\"Consultar Normas de Ligação Agrupada\",0)","v":0},{"$f":"IF(AND(CALC.D!$C$6<>\"\",CALC.D!$G$6<>\"\",CALC.D!$R$2<>\"\",CALC.D!$AB$20=2,CALC.D!$F$10<>\"\",CALC.D!$E$64<>\"\",CALC.D!$F$10=\"4 ou mais\",$AV$3=5,CALC.D!$G$59=$BC$2),\"Consultar Normas de Ligação Agrupada\",0)","v":0},{"$f":"IF(AND(CALC.D!$C$6<>\"\",CALC.D!$G$6<>\"\",CALC.D!$R$2<>\"\",CALC.D!$AB$20=2,CALC.D!$F$10<>\"\",CALC.D!$E$64<>\"\",CALC.D!$F$10=\"4 ou mais\",$AV$3=5,CALC.D!$G$59=$BD$2),\"Consultar Normas de Ligação Agrupada\",0)","v":0},{"$f":"IF(AND(CALC.D!$C$6<>\"\",CALC.D!$G$6<>\"\",CALC.D!$R$2<>\"\",CALC.D!$AB$20=2,CALC.D!$F$10<>\"\",CALC.D!$E$64<>\"\",CALC.D!$F$10=\"4 ou mais\",$AV$3=5,CALC.D!$G$59=$BE$2),\"Consultar Normas de Ligação Agrupada\",0)","v":0},{"$f":"IF(AND(CALC.D!$C$6<>\"\",CALC.D!$G$6<>\"\",CALC.D!$R$2<>\"\",CALC.D!$AB$20=2,CALC.D!$F$10<>\"\",CALC.D!$E$64<>\"\",CALC.D!$F$10=\"4 ou mais\",$AV$3=5,CALC.D!$G$59=$BF$2),\"Consultar Normas de Ligação Agrupada\",0)","v":0},{"$f":"IF(AND(CALC.D!$C$6<>\"\",CALC.D!$G$6<>\"\",CALC.D!$R$2<>\"\",CALC.D!$AB$20=2,CALC.D!$F$10<>\"\",CALC.D!$E$64<>\"\",CALC.D!$F$10=\"4 ou mais\",$AV$3=5,CALC.D!$G$59=$BG$2),\"Consultar Normas de Ligação Agrupada\",0)","v":0},{"$f":"IF(AND(CALC.D!$C$6<>\"\",CALC.D!$G$6<>\"\",CALC.D!$R$2<>\"\",CALC.D!$AB$20=2,CALC.D!$F$10<>\"\",CALC.D!$E$64<>\"\",CALC.D!$F$10=\"4 ou mais\",$AV$3=5,CALC.D!$G$59=$BH$2),\"Consultar Normas de Ligação Agrupada\",0)","v":0},16,{"$f":"IF(AND(CALC.D!$C$6<>\"\",CALC.D!$G$6<>\"\",CALC.D!$R$2<>\"\",CALC.D!$AB$20=2,CALC.D!$F$10<>\"\",CALC.D!$E$64<>\"\",CALC.D!$F$10=\"4 ou mais\",$AV$3=5,CALC.D!$G$59=$BJ$2),\"Consultar Normas de Ligação Agrupada\",0)","v":0},{"$f":"IF(AND(CALC.D!$C$6<>\"\",CALC.D!$G$6<>\"\",CALC.D!$R$2<>\"\",CALC.D!$AB$20=2,CALC.D!$F$10<>\"\",CALC.D!$E$64<>\"\",CALC.D!$F$10=\"4 ou mais\",$AV$3=5,CALC.D!$G$59=$BK$2),\"Consultar Normas de Ligação Agrupada\",0)","v":0},{"$f":"IF(AND(CALC.D!$C$6<>\"\",CALC.D!$G$6<>\"\",CALC.D!$R$2<>\"\",CALC.D!$AB$20=2,CALC.D!$F$10<>\"\",CALC.D!$E$64<>\"\",CALC.D!$F$10=\"4 ou mais\",$AV$3=5,CALC.D!$G$59=$BL$2),\"Consultar Normas de Ligação Agrupada\",0)","v":0},{"$f":"IF(AND(CALC.D!$C$6<>\"\",CALC.D!$G$6<>\"\",CALC.D!$R$2<>\"\",CALC.D!$AB$20=2,CALC.D!$F$10<>\"\",CALC.D!$E$64<>\"\",CALC.D!$F$10=\"4 ou mais\",$AV$3=5,CALC.D!$G$59=$BM$2),\"Consultar Normas de Ligação Agrupada\",0)","v":0},{"$f":"IF(AND(CALC.D!$C$6<>\"\",CALC.D!$G$6<>\"\",CALC.D!$R$2<>\"\",CALC.D!$AB$20=2,CALC.D!$F$10<>\"\",CALC.D!$E$64<>\"\",CALC.D!$F$10=\"4 ou mais\",$AV$3=5,CALC.D!$G$59=$BN$2),\"Consultar Normas de Ligação Agrupada\",0)","v":0},{"$f":"IF(AND(CALC.D!$C$6<>\"\",CALC.D!$G$6<>\"\",CALC.D!$R$2<>\"\",CALC.D!$AB$20=2,CALC.D!$F$10<>\"\",CALC.D!$E$64<>\"\",CALC.D!$F$10=\"4 ou mais\",$AV$3=5,CALC.D!$G$59=$BO$2),\"Consultar Normas de Ligação Agrupada\",0)","v":0},{"$f":"IF(AND(CALC.D!$C$6<>\"\",CALC.D!$G$6<>\"\",CALC.D!$R$2<>\"\",CALC.D!$AB$20=2,CALC.D!$F$10<>\"\",CALC.D!$E$64<>\"\",CALC.D!$F$10=\"4 ou mais\",$AV$3=5,CALC.D!$G$59=$BP$2),\"Consultar Normas de Ligação Agrupada\",0)","v":0},{"$f":"IF(AND(CALC.D!$C$6<>\"\",CALC.D!$G$6<>\"\",CALC.D!$R$2<>\"\",CALC.D!$AB$20=2,CALC.D!$F$10<>\"\",CALC.D!$E$64<>\"\",CALC.D!$F$10=\"4 ou mais\",$AV$3=5,CALC.D!$G$59=$BQ$2),\"Consultar Normas de Ligação Agrupada\",0)","v":0}]
[null,null,null,null,null,null,null,null,null,null,null,null,null,null,null,null,null,null,null,"50CV",13,48730,"X","X",{"$f":"CALC.D!AH42","v":48730},"50CV",null,null,null,null,null,null,null,null,null,null,null,null,null,null,null,null,null,null,null,null,"PONTALETE",1,{"$f":"IF(CALC.D!$E$64=TABELAS!A65,VLOOKUP(CALC.D!$F$10,$AV$16:$AX$17,3,FALSE),0)","v":0},17,{"$f":"IF(AND(CALC.D!$C$6<>\"\",CALC.D!$G$6<>\"\",CALC.D!$R$2<>\"\",CALC.D!$AB$20=2,CALC.D!$F$10<>\"\",CALC.D!$E$64<>\"\",CALC.D!$F$10=1,$AV$3=6,CALC.D!$G$59=$AY$2),TABELAS!$J$79,0)","v":0},{"$f":"IF(AND(CALC.D!$C$6<>\"\",CALC.D!$G$6<>\"\",CALC.D!$R$2<>\"\",CALC.D!$AB$20=2,CALC.D!$F$10<>\"\",CALC.D!$E$64<>\"\",CALC.D!$F$10=1,$AV$3=6,CALC.D!$G$59=$AZ$2),TABELAS!$J$80,0)","v":0},{"$f":"IF(AND(CALC.D!$C$6<>\"\",CALC.D!$G$6<>\"\",CALC.D!$R$2<>\"\",CALC.D!$AB$20=2,CALC.D!$F$10<>\"\",CALC.D!$E$64<>\"\",CALC.D!$F$10=1,$AV$3=6,CALC.D!$G$59=$BA$2),TABELAS!$J$83,0)","v":0},{"$f":"IF(AND(CALC.D!$C$6<>\"\",CALC.D!$G$6<>\"\",CALC.D!$R$2<>\"\",CALC.D!$AB$20=2,CALC.D!$F$10<>\"\",CALC.D!$E$64<>\"\",CALC.D!$F$10=1,$AV$3=6,CALC.D!$G$59=$BB$2),TABELAS!$J$84,0)","v":0},{"$f":"IF(AND(CALC.D!$C$6<>\"\",CALC.D!$G$6<>\"\",CALC.D!$R$2<>\"\",CALC.D!$AB$20=2,CALC.D!$F$10<>\"\",CALC.D!$E$64<>\"\",CALC.D!$F$10=1,$AV$3=6,CALC.D!$G$59=$BC$2),TABELAS!$J$86,0)","v":0},{"$f":"IF(AND(CALC.D!$C$6<>\"\",CALC.D!$G$6<>\"\",CALC.D!$R$2<>\"\",CALC.D!$AB$20=2,CALC.D!$F$10<>\"\",CALC.D!$E$64<>\"\",CALC.D!$F$10=1,$AV$3=6,CALC.D!$G$59=$BD$2),TABELAS!$J$87,0)","v":0},{"$f":"IF(AND(CALC.D!$C$6<>\"\",CALC.D!$G$6<>\"\",CALC.D!$R$2<>\"\",CALC.D!$AB$20=2,CALC.D!$F$10<>\"\",CALC.D!$E$64<>\"\",CALC.D!$F$10=1,$AV$3=6,CALC.D!$G$59=$BE$2),TABELAS!$J$88,0)","v":0},{"$f":"IF(AND(CALC.D!$C$6<>\"\",CALC.D!$G$6<>\"\",CALC.D!$R$2<>\"\",CALC.D!$AB$20=2,CALC.D!$F$10<>\"\",CALC.D!$E$64<>\"\",CALC.D!$F$10=1,$AV$3=6,CALC.D!$G$59=$BF$2),TABELAS!$J$89,0)","v":0},{"$f":"IF(AND(CALC.D!$C$6<>\"\",CALC.D!$G$6<>\"\",CALC.D!$R$2<>\"\",CALC.D!$AB$20=2,CALC.D!$F$10<>\"\",CALC.D!$E$64<>\"\",CALC.D!$F$10=1,$AV$3=6,CALC.D!$G$59=$BG$2),TABELAS!$J$90,0)","v":0},{"$f":"IF(AND(CALC.D!$C$6<>\"\",CALC.D!$G$6<>\"\",CALC.D!$R$2<>\"\",CALC.D!$AB$20=2,CALC.D!$F$10<>\"\",CALC.D!$E$64<>\"\",CALC.D!$F$10=1,$AV$3=6,CALC.D!$G$59=$BH$2),TABELAS!$J$91,0)","v":0},17,{"$f":"IF(AND(CALC.D!$C$6<>\"\",CALC.D!$G$6<>\"\",CALC.D!$R$2<>\"\",CALC.D!$AB$20=2,CALC.D!$F$10<>\"\",CALC.D!$E$64<>\"\",CALC.D!$F$10=1,$AV$3=6,CALC.D!$G$59=$BJ$2),TABELAS!$J$81,0)","v":0},{"$f":"IF(AND(CALC.D!$C$6<>\"\",CALC.D!$G$6<>\"\",CALC.D!$R$2<>\"\",CALC.D!$AB$20=2,CALC.D!$F$10<>\"\",CALC.D!$E$64<>\"\",CALC.D!$F$10=1,$AV$3=6,CALC.D!$G$59=$BK$2),TABELAS!$J$82,0)","v":0},{"$f":"IF(AND(CALC.D!$C$6<>\"\",CALC.D!$G$6<>\"\",CALC.D!$R$2<>\"\",CALC.D!$AB$20=2,CALC.D!$F$10<>\"\",CALC.D!$E$64<>\"\",CALC.D!$F$10=1,$AV$3=5,CALC.D!$G$59=$BL$2),TABELAS!$J$85,0)","v":0},{"$f":"IF(AND(CALC.D!$C$6<>\"\",CALC.D!$G$6<>\"\",CALC.D!$R$2<>\"\",CALC.D!$AB$20=2,CALC.D!$F$10<>\"\",CALC.D!$E$64<>\"\",CALC.D!$F$10=1,$AV$3=5,CALC.D!$G$59=$BM$2),TABELAS!$J$92,0)","v":0},{"$f":"IF(AND(CALC.D!$C$6<>\"\",CALC.D!$G$6<>\"\",CALC.D!$R$2<>\"\",CALC.D!$AB$20=2,CALC.D!$F$10<>\"\",CALC.D!$E$64<>\"\",CALC.D!$F$10=1,$AV$3=5,CALC.D!$G$59=$BN$2),TABELAS!$J$93,0)","v":0},{"$f":"IF(AND(CALC.D!$C$6<>\"\",CALC.D!$G$6<>\"\",CALC.D!$R$2<>\"\",CALC.D!$AB$20=2,CALC.D!$F$10<>\"\",CALC.D!$E$64<>\"\",CALC.D!$F$10=1,$AV$3=6,CALC.D!$G$59=$BO$2),TABELAS!$J$94,0)","v":0},{"$f":"IF(AND(CALC.D!$C$6<>\"\",CALC.D!$G$6<>\"\",CALC.D!$R$2<>\"\",CALC.D!$AB$20=2,CALC.D!$F$10<>\"\",CALC.D!$E$64<>\"\",CALC.D!$F$10=1,$AV$3=6,CALC.D!$G$59=$BP$2),TABELAS!$J$95,0)","v":0},{"$f":"IF(AND(CALC.D!$C$6<>\"\",CALC.D!$G$6<>\"\",CALC.D!$R$2<>\"\",CALC.D!$AB$20=2,CALC.D!$F$10<>\"\",CALC.D!$E$64<>\"\",CALC.D!$F$10=1,$AV$3=6,CALC.D!$G$59=$BQ$2),TABELAS!$J$96,0)","v":0}]
[null,null,null,null,null,null,null,null,null,null,null,null,null,null,null,null,null,null,null,null,null,null,null,null,null,null,null,null,null,null,null,null,null,null,null,null,null,null,null,null,null,null,null,null,null,null,null,"4 ou mais",null,20,{"$f":"IF(AND(CALC.D!$C$6<>\"\",CALC.D!$G$6<>\"\",CALC.D!$R$2<>\"\",CALC.D!$AB$20=2,CALC.D!$F$10<>\"\",CALC.D!$E$64<>\"\",CALC.D!$F$10=\"4 ou mais\",$AV$3=6,CALC.D!$G$59=$AY$2),\"Consultar Normas de Ligação Agrupada\",0)","v":0},{"$f":"IF(AND(CALC.D!$C$6<>\"\",CALC.D!$G$6<>\"\",CALC.D!$R$2<>\"\",CALC.D!$AB$20=2,CALC.D!$F$10<>\"\",CALC.D!$E$64<>\"\",CALC.D!$F$10=\"4 ou mais\",$AV$3=6,CALC.D!$G$59=$AZ$2),\"Consultar Normas de Ligação Agrupada\",0)","v":0},{"$f":"IF(AND(CALC.D!$C$6<>\"\",CALC.D!$G$6<>\"\",CALC.D!$R$2<>\"\",CALC.D!$AB$20=2,CALC.D!$F$10<>\"\",CALC.D!$E$64<>\"\",CALC.D!$F$10=\"4 ou mais\",$AV$3=6,CALC.D!$G$59=$BA$2),\"Consultar Normas de Ligação Agrupada\",0)","v":0},{"$f":"IF(AND(CALC.D!$C$6<>\"\",CALC.D!$G$6<>\"\",CALC.D!$R$2<>\"\",CALC.D!$AB$20=2,CALC.D!$F$10<>\"\",CALC.D!$E$64<>\"\",CALC.D!$F$10=\"4 ou mais\",$AV$3=6,CALC.D!$G$59=$BB$2),\"Consultar Normas de Ligação Agrupada\",0)","v":0},{"$f":"IF(AND(CALC.D!$C$6<>\"\",CALC.D!$G$6<>\"\",CALC.D!$R$2<>\"\",CALC.D!$AB$20=2,CALC.D!$F$10<>\"\",CALC.D!$E$64<>\"\",CALC.D!$F$10=\"4 ou mais\",$AV$3=6,CALC.D!$G$59=$BC$2),\"Consultar Normas de Ligação Agrupada\",0)","v":0},{"$f":"IF(AND(CALC.D!$C$6<>\"\",CALC.D!$G$6<>\"\",CALC.D!$R$2<>\"\",CALC.D!$AB$20=2,CALC.D!$F$10<>\"\",CALC.D!$E$64<>\"\",CALC.D!$F$10=\"4 ou mais\",$AV$3=6,CALC.D!$G$59=$BD$2),\"Consultar Normas de Ligação Agrupada\",0)","v":0},{"$f":"IF(AND(CALC.D!$C$6<>\"\",CALC.D!$G$6<>\"\",CALC.D!$R$2<>\"\",CALC.D!$AB$20=2,CALC.D!$F$10<>\"\",CALC.D!$E$64<>\"\",CALC.D!$F$10=\"4 ou mais\",$AV$3=6,CALC.D!$G$59=$BE$2),\"Consultar Normas de Ligação Agrupada\",0)","v":0},{"$f":"IF(AND(CALC.D!$C$6<>\"\",CALC.D!$G$6<>\"\",CALC.D!$R$2<>\"\",CALC.D!$AB$20=2,CALC.D!$F$10<>\"\",CALC.D!$E$64<>\"\",CALC.D!$F$10=\"4 ou mais\",$AV$3=6,CALC.D!$G$59=$BF$2),\"Consultar Normas de Ligação Agrupada\",0)","v":0},{"$f":"IF(AND(CALC.D!$C$6<>\"\",CALC.D!$G$6<>\"\",CALC.D!$R$2<>\"\",CALC.D!$AB$20=2,CALC.D!$F$10<>\"\",CALC.D!$E$64<>\"\",CALC.D!$F$10=\"4 ou mais\",$AV$3=6,CALC.D!$G$59=$BG$2),\"Consultar Normas de Ligação Agrupada\",0)","v":0},{"$f":"IF(AND(CALC.D!$C$6<>\"\",CALC.D!$G$6<>\"\",CALC.D!$R$2<>\"\",CALC.D!$AB$20=2,CALC.D!$F$10<>\"\",CALC.D!$E$64<>\"\",CALC.D!$F$10=\"4 ou mais\",$AV$3=6,CALC.D!$G$59=$BH$2),\"Consultar Normas de Ligação Agrupada\",0)","v":0},20,{"$f":"IF(AND(CALC.D!$C$6<>\"\",CALC.D!$G$6<>\"\",CALC.D!$R$2<>\"\",CALC.D!$AB$20=2,CALC.D!$F$10<>\"\",CALC.D!$E$64<>\"\",CALC.D!$F$10=\"4 ou mais\",$AV$3=6,CALC.D!$G$59=$BJ$2),\"Consultar Normas de Ligação Agrupada\",0)","v":0},{"$f":"IF(AND(CALC.D!$C$6<>\"\",CALC.D!$G$6<>\"\",CALC.D!$R$2<>\"\",CALC.D!$AB$20=2,CALC.D!$F$10<>\"\",CALC.D!$E$64<>\"\",CALC.D!$F$10=\"4 ou mais\",$AV$3=6,CALC.D!$G$59=$BK$2),\"Consultar Normas de Ligação Agrupada\",0)","v":0},{"$f":"IF(AND(CALC.D!$C$6<>\"\",CALC.D!$G$6<>\"\",CALC.D!$R$2<>\"\",CALC.D!$AB$20=2,CALC.D!$F$10<>\"\",CALC.D!$E$64<>\"\",CALC.D!$F$10=\"4 ou mais\",$AV$3=6,CALC.D!$G$59=$BL$2),\"Consultar Normas de Ligação Agrupada\",0)","v":0},{"$f":"IF(AND(CALC.D!$C$6<>\"\",CALC.D!$G$6<>\"\",CALC.D!$R$2<>\"\",CALC.D!$AB$20=2,CALC.D!$F$10<>\"\",CALC.D!$E$64<>\"\",CALC.D!$F$10=\"4 ou mais\",$AV$3=6,CALC.D!$G$59=$BM$2),\"Consultar Normas de Ligação Agrupada\",0)","v":0},{"$f":"IF(AND(CALC.D!$C$6<>\"\",CALC.D!$G$6<>\"\",CALC.D!$R$2<>\"\",CALC.D!$AB$20=2,CALC.D!$F$10<>\"\",CALC.D!$E$64<>\"\",CALC.D!$F$10=\"4 ou mais\",$AV$3=6,CALC.D!$G$59=$BN$2),\"Consultar Normas de Ligação Agrupada\",0)","v":0},{"$f":"IF(AND(CALC.D!$C$6<>\"\",CALC.D!$G$6<>\"\",CALC.D!$R$2<>\"\",CALC.D!$AB$20=2,CALC.D!$F$10<>\"\",CALC.D!$E$64<>\"\",CALC.D!$F$10=\"4 ou mais\",$AV$3=6,CALC.D!$G$59=$BO$2),\"Consultar Normas de Ligação Agrupada\",0)","v":0},{"$f":"IF(AND(CALC.D!$C$6<>\"\",CALC.D!$G$6<>\"\",CALC.D!$R$2<>\"\",CALC.D!$AB$20=2,CALC.D!$F$10<>\"\",CALC.D!$E$64<>\"\",CALC.D!$F$10=\"4 ou mais\",$AV$3=6,CALC.D!$G$59=$BP$2),\"Consultar Normas de Ligação Agrupada\",0)","v":0},{"$f":"IF(AND(CALC.D!$C$6<>\"\",CALC.D!$G$6<>\"\",CALC.D!$R$2<>\"\",CALC.D!$AB$20=2,CALC.D!$F$10<>\"\",CALC.D!$E$64<>\"\",CALC.D!$F$10=\"4 ou mais\",$AV$3=6,CALC.D!$G$59=$BQ$2),\"Consultar Normas de Ligação Agrupada\",0)","v":0}]
["TABELA 1B",null,null,null,null,null,null,null,null,null,null,null,null,null,null,null,null,null,null,null,null,null,null,null,null,null,null,null,null,null,null,null,null,null,null,null,null,null,null,null,null,null,null,null,null,null,"COLUNA CONSTRUIDA",1,{"$f":"IF(CALC.D!$E$64=TABELAS!A66,VLOOKUP(CALC.D!$F$10,$AV$18:$AX$21,3,FALSE),0)","v":0},21,{"$f":"IF(AND(CALC.D!$C$6<>\"\",CALC.D!$G$6<>\"\",CALC.D!$R$2<>\"\",CALC.D!$AB$20=2,CALC.D!$F$10<>\"\",CALC.D!$E$64<>\"\",CALC.D!$F$10=1,$AV$3=7,CALC.D!$G$59=$AY$2),\"CONFORME TABELA DA NORMA \",0)","v":0},{"$f":"IF(AND(CALC.D!$C$6<>\"\",CALC.D!$G$6<>\"\",CALC.D!$R$2<>\"\",CALC.D!$AB$20=2,CALC.D!$F$10<>\"\",CALC.D!$E$64<>\"\",CALC.D!$F$10=1,$AV$3=7,CALC.D!$G$59=$AZ$2),\"CONFORME TABELA DA NORMA \",0)","v":0},{"$f":"IF(AND(CALC.D!$C$6<>\"\",CALC.D!$G$6<>\"\",CALC.D!$R$2<>\"\",CALC.D!$AB$20=2,CALC.D!$F$10<>\"\",CALC.D!$E$64<>\"\",CALC.D!$F$10=1,$AV$3=7,CALC.D!$G$59=$BA$2),\"CONFORME TABELA DA NORMA \",0)","v":0},{"$f":"IF(AND(CALC.D!$C$6<>\"\",CALC.D!$G$6<>\"\",CALC.D!$R$2<>\"\",CALC.D!$AB$20=2,CALC.D!$F$10<>\"\",CALC.D!$E$64<>\"\",CALC.D!$F$10=1,$AV$3=7,CALC.D!$G$59=$BB$2),\"CONFORME TABELA DA NORMA \",0)","v":0},{"$f":"IF(AND(CALC.D!$C$6<>\"\",CALC.D!$G$6<>\"\",CALC.D!$R$2<>\"\",CALC.D!$AB$20=2,CALC.D!$F$10<>\"\",CALC.D!$E$64<>\"\",CALC.D!$F$10=1,$AV$3=7,CALC.D!$G$59=$BC$2),\"CONFORME TABELA DA NORMA \",0)","v":0},{"$f":"IF(AND(CALC.D!$C$6<>\"\",CALC.D!$G$6<>\"\",CALC.D!$R$2<>\"\",CALC.D!$AB$20=2,CALC.D!$F$10<>\"\",CALC.D!$E$64<>\"\",CALC.D!$F$10=1,$AV$3=7,CALC.D!$G$59=$BD$2),\"CONFORME TABELA DA NORMA \",0)","v":0},{"$f":"IF(AND(CALC.D!$C$6<>\"\",CALC.D!$G$6<>\"\",CALC.D!$R$2<>\"\",CALC.D!$AB$20=2,CALC.D!$F$10<>\"\",CALC.D!$E$64<>\"\",CALC.D!$F$10=1,$AV$3=7,CALC.D!$G$59=$BE$2),\"CONFORME TABELA DA NORMA \",0)","v":0},{"$f":"IF(AND(CALC.D!$C$6<>\"\",CALC.D!$G$6<>\"\",CALC.D!$R$2<>\"\",CALC.D!$AB$20=2,CALC.D!$F$10<>\"\",CALC.D!$E$64<>\"\",CALC.D!$F$10=1,$AV$3=7,CALC.D!$G$59=$BF$2),\"CONFORME TABELA DA NORMA \",0)","v":0},{"$f":"IF(AND(CALC.D!$C$6<>\"\",CALC.D!$G$6<>\"\",CALC.D!$R$2<>\"\",CALC.D!$AB$20=2,CALC.D!$F$10<>\"\",CALC.D!$E$64<>\"\",CALC.D!$F$10=1,$AV$3=7,CALC.D!$G$59=$BG$2),\"CONFORME TABELA DA NORMA \",0)","v":0},{"$f":"IF(AND(CALC.D!$C$6<>\"\",CALC.D!$G$6<>\"\",CALC.D!$R$2<>\"\",CALC.D!$AB$20=2,CALC.D!$F$10<>\"\",CALC.D!$E$64<>\"\",CALC.D!$F$10=1,$AV$3=7,CALC.D!$G$59=$BH$2),\"CONFORME TABELA DA NORMA \",0)","v":0},21,{"$f":"IF(AND(CALC.D!$C$6<>\"\",CALC.D!$G$6<>\"\",CALC.D!$R$2<>\"\",CALC.D!$AB$20=2,CALC.D!$F$10<>\"\",CALC.D!$E$64<>\"\",CALC.D!$F$10=1,$AV$3=7,CALC.D!$G$59=$BJ$2),\"CONFORME TABELA DA NORMA \",0)","v":0},{"$f":"IF(AND(CALC.D!$C$6<>\"\",CALC.D!$G$6<>\"\",CALC.D!$R$2<>\"\",CALC.D!$AB$20=2,CALC.D!$F$10<>\"\",CALC.D!$E$64<>\"\",CALC.D!$F$10=1,$AV$3=7,CALC.D!$G$59=$BK$2),\"CONFORME TABELA DA NORMA \",0)","v":0},{"$f":"IF(AND(CALC.D!$C$6<>\"\",CALC.D!$G$6<>\"\",CALC.D!$R$2<>\"\",CALC.D!$AB$20=2,CALC.D!$F$10<>\"\",CALC.D!$E$64<>\"\",CALC.D!$F$10=1,$AV$3=7,CALC.D!$G$59=$BL$2),\"CONFORME TABELA DA NORMA \",0)","v":0},{"$f":"IF(AND(CALC.D!$C$6<>\"\",CALC.D!$G$6<>\"\",CALC.D!$R$2<>\"\",CALC.D!$AB$20=2,CALC.D!$F$10<>\"\",CALC.D!$E$64<>\"\",CALC.D!$F$10=1,$AV$3=7,CALC.D!$G$59=$BM$2),\"CONFORME TABELA DA NORMA \",0)","v":0},{"$f":"IF(AND(CALC.D!$C$6<>\"\",CALC.D!$G$6<>\"\",CALC.D!$R$2<>\"\",CALC.D!$AB$20=2,CALC.D!$F$10<>\"\",CALC.D!$E$64<>\"\",CALC.D!$F$10=1,$AV$3=7,CALC.D!$G$59=$BN$2),\"CONFORME TABELA DA NORMA \",0)","v":0},{"$f":"IF(AND(CALC.D!$C$6<>\"\",CALC.D!$G$6<>\"\",CALC.D!$R$2<>\"\",CALC.D!$AB$20=2,CALC.D!$F$10<>\"\",CALC.D!$E$64<>\"\",CALC.D!$F$10=1,$AV$3=7,CALC.D!$G$59=$BO$2),\"CONFORME TABELA DA NORMA \",0)","v":0},{"$f":"IF(AND(CALC.D!$C$6<>\"\",CALC.D!$G$6<>\"\",CALC.D!$R$2<>\"\",CALC.D!$AB$20=2,CALC.D!$F$10<>\"\",CALC.D!$E$64<>\"\",CALC.D!$F$10=1,$AV$3=7,CALC.D!$G$59=$BP$2),\"CONFORME TABELA DA NORMA \",0)","v":0},{"$f":"IF(AND(CALC.D!$C$6<>\"\",CALC.D!$G$6<>\"\",CALC.D!$R$2<>\"\",CALC.D!$AB$20=2,CALC.D!$F$10<>\"\",CALC.D!$E$64<>\"\",CALC.D!$F$10=1,$AV$3=7,CALC.D!$G$59=$BQ$2),\"CONFORME TABELA DA NORMA \",0)","v":0}]
[null,null,null,null,null,null,null,null,null,null,null,null,null,null,null,null,null,null,null,null,null,null,null,null,null,null,null,null,null,null,null,null,null,null,null,null,null,null,null,null,null,null,null,null,null,null,null,2,null,22,{"$f":"IF(AND(CALC.D!$C$6<>\"\",CALC.D!$G$6<>\"\",CALC.D!$R$2<>\"\",CALC.D!$AB$20=2,CALC.D!$F$10<>\"\",CALC.D!$E$64<>\"\",CALC.D!$F$10=2,$AV$3=7,CALC.D!$G$59=$AY$2),\"CONFORME TABELA DA NORMA \",0)","v":0},{"$f":"IF(AND(CALC.D!$C$6<>\"\",CALC.D!$G$6<>\"\",CALC.D!$R$2<>\"\",CALC.D!$AB$20=2,CALC.D!$F$10<>\"\",CALC.D!$E$64<>\"\",CALC.D!$F$10=2,$AV$3=7,CALC.D!$G$59=$AZ$2),\"CONFORME TABELA DA NORMA \",0)","v":0},{"$f":"IF(AND(CALC.D!$C$6<>\"\",CALC.D!$G$6<>\"\",CALC.D!$R$2<>\"\",CALC.D!$AB$20=2,CALC.D!$F$10<>\"\",CALC.D!$E$64<>\"\",CALC.D!$F$10=2,$AV$3=7,CALC.D!$G$59=$BA$2),\"CONFORME TABELA DA NORMA \",0)","v":0},{"$f":"IF(AND(CALC.D!$C$6<>\"\",CALC.D!$G$6<>\"\",CALC.D!$R$2<>\"\",CALC.D!$AB$20=2,CALC.D!$F$10<>\"\",CALC.D!$E$64<>\"\",CALC.D!$F$10=2,$AV$3=7,CALC.D!$G$59=$BB$2),\"CONFORME TABELA DA NORMA \",0)","v":0},{"$f":"IF(AND(CALC.D!$C$6<>\"\",CALC.D!$G$6<>\"\",CALC.D!$R$2<>\"\",CALC.D!$AB$20=2,CALC.D!$F$10<>\"\",CALC.D!$E$64<>\"\",CALC.D!$F$10=2,$AV$3=7,CALC.D!$G$59=$BC$2),\"CONFORME TABELA DA NORMA \",0)","v":0},{"$f":"IF(AND(CALC.D!$C$6<>\"\",CALC.D!$G$6<>\"\",CALC.D!$R$2<>\"\",CALC.D!$AB$20=2,CALC.D!$F$10<>\"\",CALC.D!$E$64<>\"\",CALC.D!$F$10=2,$AV$3=7,CALC.D!$G$59=$BD$2),\"CONFORME TABELA DA NORMA \",0)","v":0},{"$f":"IF(AND(CALC.D!$C$6<>\"\",CALC.D!$G$6<>\"\",CALC.D!$R$2<>\"\",CALC.D!$AB$20=2,CALC.D!$F$10<>\"\",CALC.D!$E$64<>\"\",CALC.D!$F$10=2,$AV$3=7,CALC.D!$G$59=$BE$2),\"CONFORME TABELA DA NORMA \",0)","v":0},{"$f":"IF(AND(CALC.D!$C$6<>\"\",CALC.D!$G$6<>\"\",CALC.D!$R$2<>\"\",CALC.D!$AB$20=2,CALC.D!$F$10<>\"\",CALC.D!$E$64<>\"\",CALC.D!$F$10=2,$AV$3=7,CALC.D!$G$59=$BF$2),\"CONFORME TABELA DA NORMA \",0)","v":0},{"$f":"IF(AND(CALC.D!$C$6<>\"\",CALC.D!$G$6<>\"\",CALC.D!$R$2<>\"\",CALC.D!$AB$20=2,CALC.D!$F$10<>\"\",CALC.D!$E$64<>\"\",CALC.D!$F$10=2,$AV$3=7,CALC.D!$G$59=$BG$2),\"CONFORME TABELA DA NORMA \",0)","v":0},{"$f":"IF(AND(CALC.D!$C$6<>\"\",CALC.D!$G$6<>\"\",CALC.D!$R$2<>\"\",CALC.D!$AB$20=2,CALC.D!$F$10<>\"\",CALC.D!$E$64<>\"\",CALC.D!$F$10=2,$AV$3=7,CALC.D!$G$59=$BH$2),\"CONFORME TABELA DA NORMA \",0)","v":0},22,{"$f":"IF(AND(CALC.D!$C$6<>\"\",CALC.D!$G$6<>\"\",CALC.D!$R$2<>\"\",CALC.D!$AB$20=2,CALC.D!$F$10<>\"\",CALC.D!$E$64<>\"\",CALC.D!$F$10=2,$AV$3=7,CALC.D!$G$59=$BJ$2),\"CONFORME TABELA DA NORMA \",0)","v":0},{"$f":"IF(AND(CALC.D!$C$6<>\"\",CALC.D!$G$6<>\"\",CALC.D!$R$2<>\"\",CALC.D!$AB$20=2,CALC.D!$F$10<>\"\",CALC.D!$E$64<>\"\",CALC.D!$F$10=2,$AV$3=7,CALC.D!$G$59=$BK$2),\"CONFORME TABELA DA NORMA \",0)","v":0},{"$f":"IF(AND(CALC.D!$C$6<>\"\",CALC.D!$G$6<>\"\",CALC.D!$R$2<>\"\",CALC.D!$AB$20=2,CALC.D!$F$10<>\"\",CALC.D!$E$64<>\"\",CALC.D!$F$10=2,$AV$3=7,CALC.D!$G$59=$BL$2),\"CONFORME TABELA DA NORMA \",0)","v":0},{"$f":"IF(AND(CALC.D!$C$6<>\"\",CALC.D!$G$6<>\"\",CALC.D!$R$2<>\"\",CALC.D!$AB$20=2,CALC.D!$F$10<>\"\",CALC.D!$E$64<>\"\",CALC.D!$F$10=2,$AV$3=7,CALC.D!$G$59=$BM$2),\"CONFORME TABELA DA NORMA \",0)","v":0},{"$f":"IF(AND(CALC.D!$C$6<>\"\",CALC.D!$G$6<>\"\",CALC.D!$R$2<>\"\",CALC.D!$AB$20=2,CALC.D!$F$10<>\"\",CALC.D!$E$64<>\"\",CALC.D!$F$10=2,$AV$3=7,CALC.D!$G$59=$BN$2),\"CONFORME TABELA DA NORMA \",0)","v":0},{"$f":"IF(AND(CALC.D!$C$6<>\"\",CALC.D!$G$6<>\"\",CALC.D!$R$2<>\"\",CALC.D!$AB$20=2,CALC.D!$F$10<>\"\",CALC.D!$E$64<>\"\",CALC.D!$F$10=2,$AV$3=7,CALC.D!$G$59=$BO$2),\"CONFORME TABELA DA NORMA \",0)","v":0},{"$f":"IF(AND(CALC.D!$C$6<>\"\",CALC.D!$G$6<>\"\",CALC.D!$R$2<>\"\",CALC.D!$AB$20=2,CALC.D!$F$10<>\"\",CALC.D!$E$64<>\"\",CALC.D!$F$10=2,$AV$3=7,CALC.D!$G$59=$BP$2),\"CONFORME TABELA DA NORMA \",0)","v":0},{"$f":"IF(AND(CALC.D!$C$6<>\"\",CALC.D!$G$6<>\"\",CALC.D!$R$2<>\"\",CALC.D!$AB$20=2,CALC.D!$F$10<>\"\",CALC.D!$E$64<>\"\",CALC.D!$F$10=2,$AV$3=7,CALC.D!$G$59=$BQ$2),\"LIGAÇÃO AGRUPADA/COLETIVA\",0)","v":0}]
["NORMA CPFL PIRATININGA - TABELA 1B CPFL",null,null,null,null,null,null,null,null,null,null,null,null,null,null,null,null,null,null,null,null,null,null,null,null,null,null,null,null,null,null,null,null,null,null,null,null,null,null,null,null,null,null,null,null,null,null,3,null,23,{"$f":"IF(AND(CALC.D!$C$6<>\"\",CALC.D!$G$6<>\"\",CALC.D!$R$2<>\"\",CALC.D!$AB$20=2,CALC.D!$F$10<>\"\",CALC.D!$E$64<>\"\",CALC.D!$F$10=3,$AV$3=7,CALC.D!$G$59=$AY$2),\"CONFORME TABELA DA NORMA \",0)","v":0},{"$f":"IF(AND(CALC.D!$C$6<>\"\",CALC.D!$G$6<>\"\",CALC.D!$R$2<>\"\",CALC.D!$AB$20=2,CALC.D!$F$10<>\"\",CALC.D!$E$64<>\"\",CALC.D!$F$10=3,$AV$3=7,CALC.D!$G$59=$AZ$2),\"CONFORME TABELA DA NORMA \",0)","v":0},{"$f":"IF(AND(CALC.D!$C$6<>\"\",CALC.D!$G$6<>\"\",CALC.D!$R$2<>\"\",CALC.D!$AB$20=2,CALC.D!$F$10<>\"\",CALC.D!$E$64<>\"\",CALC.D!$F$10=3,$AV$3=7,CALC.D!$G$59=$BA$2),\"LIGAÇÃO AGRUPADA/COLETIVA\",0)","v":0},{"$f":"IF(AND(CALC.D!$C$6<>\"\",CALC.D!$G$6<>\"\",CALC.D!$R$2<>\"\",CALC.D!$AB$20=2,CALC.D!$F$10<>\"\",CALC.D!$E$64<>\"\",CALC.D!$F$10=3,$AV$3=7,CALC.D!$G$59=$BB$2),\"LIGAÇÃO AGRUPADA/COLETIVA\",0)","v":0},{"$f":"IF(AND(CALC.D!$C$6<>\"\",CALC.D!$G$6<>\"\",CALC.D!$R$2<>\"\",CALC.D!$AB$20=2,CALC.D!$F$10<>\"\",CALC.D!$E$64<>\"\",CALC.D!$F$10=3,$AV$3=7,CALC.D!$G$59=$BC$2),\"LIGAÇÃO AGRUPADA/COLETIVA\",0)","v":0},{"$f":"IF(AND(CALC.D!$C$6<>\"\",CALC.D!$G$6<>\"\",CALC.D!$R$2<>\"\",CALC.D!$AB$20=2,CALC.D!$F$10<>\"\",CALC.D!$E$64<>\"\",CALC.D!$F$10=3,$AV$3=7,CALC.D!$G$59=$BD$2),\"LIGAÇÃO AGRUPADA/COLETIVA\",0)","v":0},{"$f":"IF(AND(CALC.D!$C$6<>\"\",CALC.D!$G$6<>\"\",CALC.D!$R$2<>\"\",CALC.D!$AB$20=2,CALC.D!$F$10<>\"\",CALC.D!$E$64<>\"\",CALC.D!$F$10=3,$AV$3=7,CALC.D!$G$59=$BE$2),\"LIGAÇÃO AGRUPADA/COLETIVA\",0)","v":0},{"$f":"IF(AND(CALC.D!$C$6<>\"\",CALC.D!$G$6<>\"\",CALC.D!$R$2<>\"\",CALC.D!$AB$20=2,CALC.D!$F$10<>\"\",CALC.D!$E$64<>\"\",CALC.D!$F$10=3,$AV$3=7,CALC.D!$G$59=$BF$2),\"LIGAÇÃO AGRUPADA/COLETIVA\",0)","v":0},{"$f":"IF(AND(CALC.D!$C$6<>\"\",CALC.D!$G$6<>\"\",CALC.D!$R$2<>\"\",CALC.D!$AB$20=2,CALC.D!$F$10<>\"\",CALC.D!$E$64<>\"\",CALC.D!$F$10=3,$AV$3=7,CALC.D!$G$59=$BG$2),\"LIGAÇÃO AGRUPADA/COLETIVA\",0)","v":0},{"$f":"IF(AND(CALC.D!$C$6<>\"\",CALC.D!$G$6<>\"\",CALC.D!$R$2<>\"\",CALC.D!$AB$20=2,CALC.D!$F$10<>\"\",CALC.D!$E$64<>\"\",CALC.D!$F$10=3,$AV$3=7,CALC.D!$G$59=$BH$2),\"LIGAÇÃO AGRUPADA/COLETIVA\",0)","v":0},23,{"$f":"IF(AND(CALC.D!$C$6<>\"\",CALC.D!$G$6<>\"\",CALC.D!$R$2<>\"\",CALC.D!$AB$20=2,CALC.D!$F$10<>\"\",CALC.D!$E$64<>\"\",CALC.D!$F$10=3,$AV$3=7,CALC.D!$G$59=$BJ$2),\"CONFORME TABELA DA NORMA \",0)","v":0},{"$f":"IF(AND(CALC.D!$C$6<>\"\",CALC.D!$G$6<>\"\",CALC.D!$R$2<>\"\",CALC.D!$AB$20=2,CALC.D!$F$10<>\"\",CALC.D!$E$64<>\"\",CALC.D!$F$10=3,$AV$3=7,CALC.D!$G$59=$BK$2),\"LIGAÇÃO AGRUPADA/COLETIVA\",0)","v":0},{"$f":"IF(AND(CALC.D!$C$6<>\"\",CALC.D!$G$6<>\"\",CALC.D!$R$2<>\"\",CALC.D!$AB$20=2,CALC.D!$F$10<>\"\",CALC.D!$E$64<>\"\",CALC.D!$F$10=3,$AV$3=7,CALC.D!$G$59=$BL$2),\"LIGAÇÃO AGRUPADA/COLETIVA\",0)","v":0},{"$f":"IF(AND(CALC.D!$C$6<>\"\",CALC.D!$G$6<>\"\",CALC.D!$R$2<>\"\",CALC.D!$AB$20=2,CALC.D!$F$10<>\"\",CALC.D!$E$64<>\"\",CALC.D!$F$10=3,$AV$3=7,CALC.D!$G$59=$BM$2),\"LIGAÇÃO AGRUPADA/COLETIVA\",0)","v":0},{"$f":"IF(AND(CALC.D!$C$6<>\"\",CALC.D!$G$6<>\"\",CALC.D!$R$2<>\"\",CALC.D!$AB$20=2,CALC.D!$F$10<>\"\",CALC.D!$E$64<>\"\",CALC.D!$F$10=3,$AV$3=7,CALC.D!$G$59=$BN$2),\"LIGAÇÃO AGRUPADA/COLETIVA\",0)","v":0},{"$f":"IF(AND(CALC.D!$C$6<>\"\",CALC.D!$G$6<>\"\",CALC.D!$R$2<>\"\",CALC.D!$AB$20=2,CALC.D!$F$10<>\"\",CALC.D!$E$64<>\"\",CALC.D!$F$10=3,$AV$3=7,CALC.D!$G$59=$BO$2),\"LIGAÇÃO AGRUPADA/COLETIVA\",0)","v":0},{"$f":"IF(AND(CALC.D!$C$6<>\"\",CALC.D!$G$6<>\"\",CALC.D!$R$2<>\"\",CALC.D!$AB$20=2,CALC.D!$F$10<>\"\",CALC.D!$E$64<>\"\",CALC.D!$F$10=3,$AV$3=7,CALC.D!$G$59=$BP$2),\"LIGAÇÃO AGRUPADA/COLETIVA\",0)","v":0},{"$f":"IF(AND(CALC.D!$C$6<>\"\",CALC.D!$G$6<>\"\",CALC.D!$R$2<>\"\",CALC.D!$AB$20=2,CALC.D!$F$10<>\"\",CALC.D!$E$64<>\"\",CALC.D!$F$10=3,$AV$3=7,CALC.D!$G$59=$BQ$2),\"LIGAÇÃO AGRUPADA/COLETIVA\",0)","v":0}]
[null,null,"CATEGORIA","CARGA INSTALADA","DEMANDA","LIMITAÇÃO DOS MOTORES",null,null,"CABOS","CAIXA","DISJUNTOR","ELETRODUTO","ATERRAMENTO",null,"POSTE                            (daN)",null,"PONTALETE","RAMAL DE LIGAÇÃO",null,null,null,null,null,null,null,null,null,null,null,null,null,null,null,null,null,null,null,null,null,null,null,null,null,null,null,null,null,"4 ou mais",null,24,{"$f":"IF(AND(CALC.D!$C$6<>\"\",CALC.D!$G$6<>\"\",CALC.D!$R$2<>\"\",CALC.D!$AB$20=2,CALC.D!$F$10<>\"\",CALC.D!$E$64<>\"\",CALC.D!$F$10=\"4 ou mais\",$AV$3=7,CALC.D!$G$59=$AY$2),\"LIGAÇÃO AGRUPADA/COLETIVA\",0)","v":0},{"$f":"IF(AND(CALC.D!$C$6<>\"\",CALC.D!$G$6<>\"\",CALC.D!$R$2<>\"\",CALC.D!$AB$20=2,CALC.D!$F$10<>\"\",CALC.D!$E$64<>\"\",CALC.D!$F$10=\"4 ou mais\",$AV$3=7,CALC.D!$G$59=$AZ$2),\"LIGAÇÃO AGRUPADA/COLETIVA\",0)","v":0},{"$f":"IF(AND(CALC.D!$C$6<>\"\",CALC.D!$G$6<>\"\",CALC.D!$R$2<>\"\",CALC.D!$AB$20=2,CALC.D!$F$10<>\"\",CALC.D!$E$64<>\"\",CALC.D!$F$10=\"4 ou mais\",$AV$3=7,CALC.D!$G$59=$BA$2),\"LIGAÇÃO AGRUPADA/COLETIVA\",0)","v":0},{"$f":"IF(AND(CALC.D!$C$6<>\"\",CALC.D!$G$6<>\"\",CALC.D!$R$2<>\"\",CALC.D!$AB$20=2,CALC.D!$F$10<>\"\",CALC.D!$E$64<>\"\",CALC.D!$F$10=\"4 ou mais\",$AV$3=7,CALC.D!$G$59=$BB$2),\"LIGAÇÃO AGRUPADA/COLETIVA\",0)","v":0},{"$f":"IF(AND(CALC.D!$C$6<>\"\",CALC.D!$G$6<>\"\",CALC.D!$R$2<>\"\",CALC.D!$AB$20=2,CALC.D!$F$10<>\"\",CALC.D!$E$64<>\"\",CALC.D!$F$10=\"4 ou mais\",$AV$3=7,CALC.D!$G$59=$BC$2),\"LIGAÇÃO AGRUPADA/COLETIVA\",0)","v":0},{"$f":"IF(AND(CALC.D!$C$6<>\"\",CALC.D!$G$6<>\"\",CALC.D!$R$2<>\"\",CALC.D!$AB$20=2,CALC.D!$F$10<>\"\",CALC.D!$E$64<>\"\",CALC.D!$F$10=\"4 ou mais\",$AV$3=7,CALC.D!$G$59=$BD$2),\"LIGAÇÃO AGRUPADA/COLETIVA\",0)","v":0},{"$f":"IF(AND(CALC.D!$C$6<>\"\",CALC.D!$G$6<>\"\",CALC.D!$R$2<>\"\",CALC.D!$AB$20=2,CALC.D!$F$10<>\"\",CALC.D!$E$64<>\"\",CALC.D!$F$10=\"4 ou mais\",$AV$3=7,CALC.D!$G$59=$BE$2),\"LIGAÇÃO AGRUPADA/COLETIVA\",0)","v":0},{"$f":"IF(AND(CALC.D!$C$6<>\"\",CALC.D!$G$6<>\"\",CALC.D!$R$2<>\"\",CALC.D!$AB$20=2,CALC.D!$F$10<>\"\",CALC.D!$E$64<>\"\",CALC.D!$F$10=\"4 ou mais\",$AV$3=7,CALC.D!$G$59=$BF$2),\"LIGAÇÃO AGRUPADA/COLETIVA\",0)","v":0},{"$f":"IF(AND(CALC.D!$C$6<>\"\",CALC.D!$G$6<>\"\",CALC.D!$R$2<>\"\",CALC.D!$AB$20=2,CALC.D!$F$10<>\"\",CALC.D!$E$64<>\"\",CALC.D!$F$10=\"4 ou mais\",$AV$3=7,CALC.D!$G$59=$BG$2),\"LIGAÇÃO AGRUPADA/COLETIVA\",0)","v":0},{"$f":"IF(AND(CALC.D!$C$6<>\"\",CALC.D!$G$6<>\"\",CALC.D!$R$2<>\"\",CALC.D!$AB$20=2,CALC.D!$F$10<>\"\",CALC.D!$E$64<>\"\",CALC.D!$F$10=\"4 ou mais\",$AV$3=7,CALC.D!$G$59=$BH$2),\"LIGAÇÃO AGRUPADA/COLETIVA\",0)","v":0},24,{"$f":"IF(AND(CALC.D!$C$6<>\"\",CALC.D!$G$6<>\"\",CALC.D!$R$2<>\"\",CALC.D!$AB$20=2,CALC.D!$F$10<>\"\",CALC.D!$E$64<>\"\",CALC.D!$F$10=\"4 ou mais\",$AV$3=7,CALC.D!$G$59=$BJ$2),\"LIGAÇÃO AGRUPADA/COLETIVA\",0)","v":0},{"$f":"IF(AND(CALC.D!$C$6<>\"\",CALC.D!$G$6<>\"\",CALC.D!$R$2<>\"\",CALC.D!$AB$20=2,CALC.D!$F$10<>\"\",CALC.D!$E$64<>\"\",CALC.D!$F$10=\"4 ou mais\",$AV$3=7,CALC.D!$G$59=$BK$2),\"LIGAÇÃO AGRUPADA/COLETIVA\",0)","v":0},{"$f":"IF(AND(CALC.D!$C$6<>\"\",CALC.D!$G$6<>\"\",CALC.D!$R$2<>\"\",CALC.D!$AB$20=2,CALC.D!$F$10<>\"\",CALC.D!$E$64<>\"\",CALC.D!$F$10=\"4 ou mais\",$AV$3=7,CALC.D!$G$59=$BL$2),\"LIGAÇÃO AGRUPADA/COLETIVA\",0)","v":0},{"$f":"IF(AND(CALC.D!$C$6<>\"\",CALC.D!$G$6<>\"\",CALC.D!$R$2<>\"\",CALC.D!$AB$20=2,CALC.D!$F$10<>\"\",CALC.D!$E$64<>\"\",CALC.D!$F$10=\"4 ou mais\",$AV$3=7,CALC.D!$G$59=$BM$2),\"LIGAÇÃO AGRUPADA/COLETIVA\",0)","v":0},{"$f":"IF(AND(CALC.D!$C$6<>\"\",CALC.D!$G$6<>\"\",CALC.D!$R$2<>\"\",CALC.D!$AB$20=2,CALC.D!$F$10<>\"\",CALC.D!$E$64<>\"\",CALC.D!$F$10=\"4 ou mais\",$AV$3=7,CALC.D!$G$59=$BN$2),\"LIGAÇÃO AGRUPADA/COLETIVA\",0)","v":0},{"$f":"IF(AND(CALC.D!$C$6<>\"\",CALC.D!$G$6<>\"\",CALC.D!$R$2<>\"\",CALC.D!$AB$20=2,CALC.D!$F$10<>\"\",CALC.D!$E$64<>\"\",CALC.D!$F$10=\"4 ou mais\",$AV$3=7,CALC.D!$G$59=$BO$2),\"LIGAÇÃO AGRUPADA/COLETIVA\",0)","v":0},{"$f":"IF(AND(CALC.D!$C$6<>\"\",CALC.D!$G$6<>\"\",CALC.D!$R$2<>\"\",CALC.D!$AB$20=2,CALC.D!$F$10<>\"\",CALC.D!$E$64<>\"\",CALC.D!$F$10=\"4 ou mais\",$AV$3=7,CALC.D!$G$59=$BP$2),\"LIGAÇÃO AGRUPADA/COLETIVA\",0)","v":0},{"$f":"IF(AND(CALC.D!$C$6<>\"\",CALC.D!$G$6<>\"\",CALC.D!$R$2<>\"\",CALC.D!$AB$20=2,CALC.D!$F$10<>\"\",CALC.D!$E$64<>\"\",CALC.D!$F$10=\"4 ou mais\",$AV$3=7,CALC.D!$G$59=$BQ$2),\"LIGAÇÃO AGRUPADA/COLETIVA\",0)","v":0}]
[null,null,null,null,null,"FN","FF","FFFN",null,null,null,null,"CONDUTOR","ELETRODUTO",null,null,null,null,null,null,null,null,null,null,null,null,null,null,null,null,null,null,null,null,null,null,null,null,null,null,null,null,null,null,null,null,"ALVENARIA/FACHADA",1,{"$f":"IF(CALC.D!$E$64=TABELAS!A67,VLOOKUP(CALC.D!$F$10,$AV$22:$AX$25,3,FALSE),0)","v":0},25,{"$f":"IF(AND(CALC.D!$C$6<>\"\",CALC.D!$G$6<>\"\",CALC.D!$R$2<>\"\",CALC.D!$AB$20=2,CALC.D!$F$10<>\"\",CALC.D!$E$64<>\"\",CALC.D!$F$10=1,$AV$3=8,CALC.D!$G$59=$AY$2),\"CONFORME TABELA DA NORMA \",0)","v":0},{"$f":"IF(AND(CALC.D!$C$6<>\"\",CALC.D!$G$6<>\"\",CALC.D!$R$2<>\"\",CALC.D!$AB$20=2,CALC.D!$F$10<>\"\",CALC.D!$E$64<>\"\",CALC.D!$F$10=1,$AV$3=8,CALC.D!$G$59=$AZ$2),\"CONFORME TABELA DA NORMA \",0)","v":0},{"$f":"IF(AND(CALC.D!$C$6<>\"\",CALC.D!$G$6<>\"\",CALC.D!$R$2<>\"\",CALC.D!$AB$20=2,CALC.D!$F$10<>\"\",CALC.D!$E$64<>\"\",CALC.D!$F$10=1,$AV$3=8,CALC.D!$G$59=$BA$2),\"CONFORME TABELA DA NORMA \",0)","v":0},{"$f":"IF(AND(CALC.D!$C$6<>\"\",CALC.D!$G$6<>\"\",CALC.D!$R$2<>\"\",CALC.D!$AB$20=2,CALC.D!$F$10<>\"\",CALC.D!$E$64<>\"\",CALC.D!$F$10=1,$AV$3=8,CALC.D!$G$59=$BB$2),\"CONFORME TABELA DA NORMA \",0)","v":0},{"$f":"IF(AND(CALC.D!$C$6<>\"\",CALC.D!$G$6<>\"\",CALC.D!$R$2<>\"\",CALC.D!$AB$20=2,CALC.D!$F$10<>\"\",CALC.D!$E$64<>\"\",CALC.D!$F$10=1,$AV$3=8,CALC.D!$G$59=$BC$2),\"CONFORME TABELA DA NORMA \",0)","v":0},{"$f":"IF(AND(CALC.D!$C$6<>\"\",CALC.D!$G$6<>\"\",CALC.D!$R$2<>\"\",CALC.D!$AB$20=2,CALC.D!$F$10<>\"\",CALC.D!$E$64<>\"\",CALC.D!$F$10=1,$AV$3=8,CALC.D!$G$59=$BD$2),\"CONFORME TABELA DA NORMA \",0)","v":0},{"$f":"IF(AND(CALC.D!$C$6<>\"\",CALC.D!$G$6<>\"\",CALC.D!$R$2<>\"\",CALC.D!$AB$20=2,CALC.D!$F$10<>\"\",CALC.D!$E$64<>\"\",CALC.D!$F$10=1,$AV$3=8,CALC.D!$G$59=$BE$2),\"CONFORME TABELA DA NORMA \",0)","v":0},{"$f":"IF(AND(CALC.D!$C$6<>\"\",CALC.D!$G$6<>\"\",CALC.D!$R$2<>\"\",CALC.D!$AB$20=2,CALC.D!$F$10<>\"\",CALC.D!$E$64<>\"\",CALC.D!$F$10=1,$AV$3=8,CALC.D!$G$59=$BF$2),\"CONFORME TABELA DA NORMA \",0)","v":0},{"$f":"IF(AND(CALC.D!$C$6<>\"\",CALC.D!$G$6<>\"\",CALC.D!$R$2<>\"\",CALC.D!$AB$20=2,CALC.D!$F$10<>\"\",CALC.D!$E$64<>\"\",CALC.D!$F$10=1,$AV$3=8,CALC.D!$G$59=$BG$2),\"CONFORME TABELA DA NORMA \",0)","v":0},{"$f":"IF(AND(CALC.D!$C$6<>\"\",CALC.D!$G$6<>\"\",CALC.D!$R$2<>\"\",CALC.D!$AB$20=2,CALC.D!$F$10<>\"\",CALC.D!$E$64<>\"\",CALC.D!$F$10=1,$AV$3=8,CALC.D!$G$59=$BH$2),\"CONFORME TABELA DA NORMA \",0)","v":0},25,{"$f":"IF(AND(CALC.D!$C$6<>\"\",CALC.D!$G$6<>\"\",CALC.D!$R$2<>\"\",CALC.D!$AB$20=2,CALC.D!$F$10<>\"\",CALC.D!$E$64<>\"\",CALC.D!$F$10=1,$AV$3=8,CALC.D!$G$59=$BJ$2),\"CONFORME TABELA DA NORMA \",0)","v":0},{"$f":"IF(AND(CALC.D!$C$6<>\"\",CALC.D!$G$6<>\"\",CALC.D!$R$2<>\"\",CALC.D!$AB$20=2,CALC.D!$F$10<>\"\",CALC.D!$E$64<>\"\",CALC.D!$F$10=1,$AV$3=8,CALC.D!$G$59=$BK$2),\"CONFORME TABELA DA NORMA \",0)","v":0},{"$f":"IF(AND(CALC.D!$C$6<>\"\",CALC.D!$G$6<>\"\",CALC.D!$R$2<>\"\",CALC.D!$AB$20=2,CALC.D!$F$10<>\"\",CALC.D!$E$64<>\"\",CALC.D!$F$10=1,$AV$3=8,CALC.D!$G$59=$BL$2),\"CONFORME TABELA DA NORMA \",0)","v":0},{"$f":"IF(AND(CALC.D!$C$6<>\"\",CALC.D!$G$6<>\"\",CALC.D!$R$2<>\"\",CALC.D!$AB$20=2,CALC.D!$F$10<>\"\",CALC.D!$E$64<>\"\",CALC.D!$F$10=1,$AV$3=8,CALC.D!$G$59=$BM$2),\"CONFORME TABELA DA NORMA \",0)","v":0},{"$f":"IF(AND(CALC.D!$C$6<>\"\",CALC.D!$G$6<>\"\",CALC.D!$R$2<>\"\",CALC.D!$AB$20=2,CALC.D!$F$10<>\"\",CALC.D!$E$64<>\"\",CALC.D!$F$10=1,$AV$3=8,CALC.D!$G$59=$BN$2),\"CONFORME TABELA DA NORMA \",0)","v":0},{"$f":"IF(AND(CALC.D!$C$6<>\"\",CALC.D!$G$6<>\"\",CALC.D!$R$2<>\"\",CALC.D!$AB$20=2,CALC.D!$F$10<>\"\",CALC.D!$E$64<>\"\",CALC.D!$F$10=1,$AV$3=8,CALC.D!$G$59=$BO$2),\"CONFORME TABELA DA NORMA \",0)","v":0},{"$f":"IF(AND(CALC.D!$C$6<>\"\",CALC.D!$G$6<>\"\",CALC.D!$R$2<>\"\",CALC.D!$AB$20=2,CALC.D!$F$10<>\"\",CALC.D!$E$64<>\"\",CALC.D!$F$10=1,$AV$3=8,CALC.D!$G$59=$BP$2),\"CONFORME TABELA DA NORMA \",0)","v":0},{"$f":"IF(AND(CALC.D!$C$6<>\"\",CALC.D!$G$6<>\"\",CALC.D!$R$2<>\"\",CALC.D!$AB$20=2,CALC.D!$F$10<>\"\",CALC.D!$E$64<>\"\",CALC.D!$F$10=1,$AV$3=8,CALC.D!$G$59=$BQ$2),\"CONFORME TABELA DA NORMA \",0)","v":0}]
[{"$f":"IF(AND(CALC.D!$B$60<=D23,$AO$5<=$W$6,$AL$9=0,$AM$7=0,CALC.D!$AB$20=2,G49<=3),1,0)","v":0},{"$f":"A23","v":0},"A3 MONOFÁSICO",10,"-",3,null,null,"6 mm²","TIPO: II OU IV","DJ 32 A","32 mm² OU 1''","6 mm²","20 ou 1/2''",90,null,"60.33x3.35 (DIAMETRO EXT. X ESPESSURA)","10 mm² - Duplex",null,null,null,null,null,null,null,null,null,null,null,null,null,null,null,null,null,null,null,null,null,null,null,null,null,null,null,null,null,2,null,26,{"$f":"IF(AND(CALC.D!$C$6<>\"\",CALC.D!$G$6<>\"\",CALC.D!$R$2<>\"\",CALC.D!$AB$20=2,CALC.D!$F$10<>\"\",CALC.D!$E$64<>\"\",CALC.D!$F$10=2,$AV$3=8,CALC.D!$G$59=$AY$2),\"CONFORME TABELA DA NORMA \",0)","v":0},{"$f":"IF(AND(CALC.D!$C$6<>\"\",CALC.D!$G$6<>\"\",CALC.D!$R$2<>\"\",CALC.D!$AB$20=2,CALC.D!$F$10<>\"\",CALC.D!$E$64<>\"\",CALC.D!$F$10=2,$AV$3=8,CALC.D!$G$59=$AZ$2),\"CONFORME TABELA DA NORMA \",0)","v":0},{"$f":"IF(AND(CALC.D!$C$6<>\"\",CALC.D!$G$6<>\"\",CALC.D!$R$2<>\"\",CALC.D!$AB$20=2,CALC.D!$F$10<>\"\",CALC.D!$E$64<>\"\",CALC.D!$F$10=2,$AV$3=8,CALC.D!$G$59=$BA$2),\"ACEITO COM APRESENTAÇÃO DE DOCUMENTO DE\",0)","v":0},{"$f":"IF(AND(CALC.D!$C$6<>\"\",CALC.D!$G$6<>\"\",CALC.D!$R$2<>\"\",CALC.D!$AB$20=2,CALC.D!$F$10<>\"\",CALC.D!$E$64<>\"\",CALC.D!$F$10=2,$AV$3=8,CALC.D!$G$59=$BB$2),\"CONFORME TABELA DA NORMA \",0)","v":0},{"$f":"IF(AND(CALC.D!$C$6<>\"\",CALC.D!$G$6<>\"\",CALC.D!$R$2<>\"\",CALC.D!$AB$20=2,CALC.D!$F$10<>\"\",CALC.D!$E$64<>\"\",CALC.D!$F$10=2,$AV$3=8,CALC.D!$G$59=$BC$2),\"CONFORME TABELA DA NORMA \",0)","v":0},{"$f":"IF(AND(CALC.D!$C$6<>\"\",CALC.D!$G$6<>\"\",CALC.D!$R$2<>\"\",CALC.D!$AB$20=2,CALC.D!$F$10<>\"\",CALC.D!$E$64<>\"\",CALC.D!$F$10=2,$AV$3=8,CALC.D!$G$59=$BD$2),\"CONFORME TABELA DA NORMA \",0)","v":0},{"$f":"IF(AND(CALC.D!$C$6<>\"\",CALC.D!$G$6<>\"\",CALC.D!$R$2<>\"\",CALC.D!$AB$20=2,CALC.D!$F$10<>\"\",CALC.D!$E$64<>\"\",CALC.D!$F$10=2,$AV$3=8,CALC.D!$G$59=$BE$2),\"CONFORME TABELA DA NORMA \",0)","v":0},{"$f":"IF(AND(CALC.D!$C$6<>\"\",CALC.D!$G$6<>\"\",CALC.D!$R$2<>\"\",CALC.D!$AB$20=2,CALC.D!$F$10<>\"\",CALC.D!$E$64<>\"\",CALC.D!$F$10=2,$AV$3=8,CALC.D!$G$59=$BF$2),\"CONFORME TABELA DA NORMA \",0)","v":0},{"$f":"IF(AND(CALC.D!$C$6<>\"\",CALC.D!$G$6<>\"\",CALC.D!$R$2<>\"\",CALC.D!$AB$20=2,CALC.D!$F$10<>\"\",CALC.D!$E$64<>\"\",CALC.D!$F$10=2,$AV$3=8,CALC.D!$G$59=$BG$2),\"CONFORME TABELA DA NORMA \",0)","v":0},{"$f":"IF(AND(CALC.D!$C$6<>\"\",CALC.D!$G$6<>\"\",CALC.D!$R$2<>\"\",CALC.D!$AB$20=2,CALC.D!$F$10<>\"\",CALC.D!$E$64<>\"\",CALC.D!$F$10=2,$AV$3=8,CALC.D!$G$59=$BH$2),\"CONFORME TABELA DA NORMA \",0)","v":0},26,{"$f":"IF(AND(CALC.D!$C$6<>\"\",CALC.D!$G$6<>\"\",CALC.D!$R$2<>\"\",CALC.D!$AB$20=2,CALC.D!$F$10<>\"\",CALC.D!$E$64<>\"\",CALC.D!$F$10=2,$AV$3=8,CALC.D!$G$59=$BJ$2),\"CONFORME TABELA DA NORMA \",0)","v":0},{"$f":"IF(AND(CALC.D!$C$6<>\"\",CALC.D!$G$6<>\"\",CALC.D!$R$2<>\"\",CALC.D!$AB$20=2,CALC.D!$F$10<>\"\",CALC.D!$E$64<>\"\",CALC.D!$F$10=2,$AV$3=8,CALC.D!$G$59=$BK$2),\"CONFORME TABELA DA NORMA \",0)","v":0},{"$f":"IF(AND(CALC.D!$C$6<>\"\",CALC.D!$G$6<>\"\",CALC.D!$R$2<>\"\",CALC.D!$AB$20=2,CALC.D!$F$10<>\"\",CALC.D!$E$64<>\"\",CALC.D!$F$10=2,$AV$3=8,CALC.D!$G$59=$BL$2),\"CONFORME TABELA DA NORMA \",0)","v":0},{"$f":"IF(AND(CALC.D!$C$6<>\"\",CALC.D!$G$6<>\"\",CALC.D!$R$2<>\"\",CALC.D!$AB$20=2,CALC.D!$F$10<>\"\",CALC.D!$E$64<>\"\",CALC.D!$F$10=2,$AV$3=7,CALC.D!$G$59=$BM$2),\"CONFORME TABELA DA NORMA \",0)","v":0},{"$f":"IF(AND(CALC.D!$C$6<>\"\",CALC.D!$G$6<>\"\",CALC.D!$R$2<>\"\",CALC.D!$AB$20=2,CALC.D!$F$10<>\"\",CALC.D!$E$64<>\"\",CALC.D!$F$10=2,$AV$3=8,CALC.D!$G$59=$BN$2),\"CONFORME TABELA DA NORMA \",0)","v":0},{"$f":"IF(AND(CALC.D!$C$6<>\"\",CALC.D!$G$6<>\"\",CALC.D!$R$2<>\"\",CALC.D!$AB$20=2,CALC.D!$F$10<>\"\",CALC.D!$E$64<>\"\",CALC.D!$F$10=2,$AV$3=8,CALC.D!$G$59=$BO$2),\"CONFORME TABELA DA NORMA \",0)","v":0},{"$f":"IF(AND(CALC.D!$C$6<>\"\",CALC.D!$G$6<>\"\",CALC.D!$R$2<>\"\",CALC.D!$AB$20=2,CALC.D!$F$10<>\"\",CALC.D!$E$64<>\"\",CALC.D!$F$10=2,$AV$3=8,CALC.D!$G$59=$BP$2),\"CONFORME TABELA DA NORMA \",0)","v":0},{"$f":"IF(AND(CALC.D!$C$6<>\"\",CALC.D!$G$6<>\"\",CALC.D!$R$2<>\"\",CALC.D!$AB$20=2,CALC.D!$F$10<>\"\",CALC.D!$E$64<>\"\",CALC.D!$F$10=2,$AV$3=8,CALC.D!$G$59=$BQ$2),\"CONFORME TABELA DA NORMA \",0)","v":0}]
[{"$f":"IF(AND(CALC.D!$B$60<=D24,$AO$5<=$W$7,$AL$9=0,$AM$7=0,CALC.D!$AB$20=2,G49<=2),1,0)","v":0},{"$f":"A24-A23","v":0},"A4 MONOFÁSICO",15,"-",5,null,null,"16 mm²","TIPO: II OU IV","DJ 63 A","32 mm² OU 1''","10 mm²","20 ou 1/2''",null,null,"60.33x3.35 (DIAMETRO EXT. X ESPESSURA)","16 mm² - Duplex",null,null,null,null,null,null,null,null,null,null,null,null,null,null,null,null,null,null,null,null,null,null,null,null,null,null,null,null,null,3,null,27,{"$f":"IF(AND(CALC.D!$C$6<>\"\",CALC.D!$G$6<>\"\",CALC.D!$R$2<>\"\",CALC.D!$AB$20=2,CALC.D!$F$10<>\"\",CALC.D!$E$64<>\"\",CALC.D!$F$10=3,$AV$3=8,CALC.D!$G$59=$AY$2),\"CONFORME TABELA DA NORMA \",0)","v":0},{"$f":"IF(AND(CALC.D!$C$6<>\"\",CALC.D!$G$6<>\"\",CALC.D!$R$2<>\"\",CALC.D!$AB$20=2,CALC.D!$F$10<>\"\",CALC.D!$E$64<>\"\",CALC.D!$F$10=3,$AV$3=8,CALC.D!$G$59=$AZ$2),\"CONFORME TABELA DA NORMA \",0)","v":0},{"$f":"IF(AND(CALC.D!$C$6<>\"\",CALC.D!$G$6<>\"\",CALC.D!$R$2<>\"\",CALC.D!$AB$20=2,CALC.D!$F$10<>\"\",CALC.D!$E$64<>\"\",CALC.D!$F$10=3,$AV$3=8,CALC.D!$G$59=$BA$2),\"LIGAÇÃO AGRUPADA/COLETIVA\",0)","v":0},{"$f":"IF(AND(CALC.D!$C$6<>\"\",CALC.D!$G$6<>\"\",CALC.D!$R$2<>\"\",CALC.D!$AB$20=2,CALC.D!$F$10<>\"\",CALC.D!$E$64<>\"\",CALC.D!$F$10=3,$AV$3=8,CALC.D!$G$59=$BB$2),\"LIGAÇÃO AGRUPADA/COLETIVA\",0)","v":0},{"$f":"IF(AND(CALC.D!$C$6<>\"\",CALC.D!$G$6<>\"\",CALC.D!$R$2<>\"\",CALC.D!$AB$20=2,CALC.D!$F$10<>\"\",CALC.D!$E$64<>\"\",CALC.D!$F$10=3,$AV$3=8,CALC.D!$G$59=$BC$2),\"LIGAÇÃO AGRUPADA/COLETIVA\",0)","v":0},{"$f":"IF(AND(CALC.D!$C$6<>\"\",CALC.D!$G$6<>\"\",CALC.D!$R$2<>\"\",CALC.D!$AB$20=2,CALC.D!$F$10<>\"\",CALC.D!$E$64<>\"\",CALC.D!$F$10=3,$AV$3=8,CALC.D!$G$59=$BD$2),\"LIGAÇÃO AGRUPADA/COLETIVA\",0)","v":0},{"$f":"IF(AND(CALC.D!$C$6<>\"\",CALC.D!$G$6<>\"\",CALC.D!$R$2<>\"\",CALC.D!$AB$20=2,CALC.D!$F$10<>\"\",CALC.D!$E$64<>\"\",CALC.D!$F$10=3,$AV$3=8,CALC.D!$G$59=$BE$2),\"LIGAÇÃO AGRUPADA/COLETIVA\",0)","v":0},{"$f":"IF(AND(CALC.D!$C$6<>\"\",CALC.D!$G$6<>\"\",CALC.D!$R$2<>\"\",CALC.D!$AB$20=2,CALC.D!$F$10<>\"\",CALC.D!$E$64<>\"\",CALC.D!$F$10=3,$AV$3=8,CALC.D!$G$59=$BF$2),\"LIGAÇÃO AGRUPADA/COLETIVA\",0)","v":0},{"$f":"IF(AND(CALC.D!$C$6<>\"\",CALC.D!$G$6<>\"\",CALC.D!$R$2<>\"\",CALC.D!$AB$20=2,CALC.D!$F$10<>\"\",CALC.D!$E$64<>\"\",CALC.D!$F$10=3,$AV$3=8,CALC.D!$G$59=$BG$2),\"LIGAÇÃO AGRUPADA/COLETIVA\",0)","v":0},{"$f":"IF(AND(CALC.D!$C$6<>\"\",CALC.D!$G$6<>\"\",CALC.D!$R$2<>\"\",CALC.D!$AB$20=2,CALC.D!$F$10<>\"\",CALC.D!$E$64<>\"\",CALC.D!$F$10=3,$AV$3=8,CALC.D!$G$59=$BH$2),\"LIGAÇÃO AGRUPADA/COLETIVA\",0)","v":0},27,{"$f":"IF(AND(CALC.D!$C$6<>\"\",CALC.D!$G$6<>\"\",CALC.D!$R$2<>\"\",CALC.D!$AB$20=2,CALC.D!$F$10<>\"\",CALC.D!$E$64<>\"\",CALC.D!$F$10=3,$AV$3=8,CALC.D!$G$59=$BJ$2),\"CONFORME TABELA DA NORMA \",0)","v":0},{"$f":"IF(AND(CALC.D!$C$6<>\"\",CALC.D!$G$6<>\"\",CALC.D!$R$2<>\"\",CALC.D!$AB$20=2,CALC.D!$F$10<>\"\",CALC.D!$E$64<>\"\",CALC.D!$F$10=3,$AV$3=8,CALC.D!$G$59=$BK$2),\"LIGAÇÃO AGRUPADA/COLETIVA\",0)","v":0},{"$f":"IF(AND(CALC.D!$C$6<>\"\",CALC.D!$G$6<>\"\",CALC.D!$R$2<>\"\",CALC.D!$AB$20=2,CALC.D!$F$10<>\"\",CALC.D!$E$64<>\"\",CALC.D!$F$10=3,$AV$3=8,CALC.D!$G$59=$BL$2),\"LIGAÇÃO AGRUPADA/COLETIVA\",0)","v":0},{"$f":"IF(AND(CALC.D!$C$6<>\"\",CALC.D!$G$6<>\"\",CALC.D!$R$2<>\"\",CALC.D!$AB$20=2,CALC.D!$F$10<>\"\",CALC.D!$E$64<>\"\",CALC.D!$F$10=3,$AV$3=8,CALC.D!$G$59=$BM$2),\"LIGAÇÃO AGRUPADA/COLETIVA\",0)","v":0},{"$f":"IF(AND(CALC.D!$C$6<>\"\",CALC.D!$G$6<>\"\",CALC.D!$R$2<>\"\",CALC.D!$AB$20=2,CALC.D!$F$10<>\"\",CALC.D!$E$64<>\"\",CALC.D!$F$10=3,$AV$3=8,CALC.D!$G$59=$BN$2),\"LIGAÇÃO AGRUPADA/COLETIVA\",0)","v":0},{"$f":"IF(AND(CALC.D!$C$6<>\"\",CALC.D!$G$6<>\"\",CALC.D!$R$2<>\"\",CALC.D!$AB$20=2,CALC.D!$F$10<>\"\",CALC.D!$E$64<>\"\",CALC.D!$F$10=3,$AV$3=8,CALC.D!$G$59=$BO$2),\"LIGAÇÃO AGRUPADA/COLETIVA\",0)","v":0},{"$f":"IF(AND(CALC.D!$C$6<>\"\",CALC.D!$G$6<>\"\",CALC.D!$R$2<>\"\",CALC.D!$AB$20=2,CALC.D!$F$10<>\"\",CALC.D!$E$64<>\"\",CALC.D!$F$10=3,$AV$3=8,CALC.D!$G$59=$BP$2),\"LIGAÇÃO AGRUPADA/COLETIVA\",0)","v":0},{"$f":"IF(AND(CALC.D!$C$6<>\"\",CALC.D!$G$6<>\"\",CALC.D!$R$2<>\"\",CALC.D!$AB$20=2,CALC.D!$F$10<>\"\",CALC.D!$E$64<>\"\",CALC.D!$F$10=3,$AV$3=8,CALC.D!$G$59=$BQ$2),\"LIGAÇÃO AGRUPADA/COLETIVA\",0)","v":0}]
[{"$f":"IF(AND(CALC.D!$B$60<=D25,$AO$5<=$W$7,$AP$5<=$X$9,$AL$9=0,CALC.D!$AB$20=2,G49<=2),1,0)","v":0},0,"B3 BIFÁSICO",25,"-",5,10,null,"16 mm²","TIPO: II OU IV","DJ 63 A","40 mm² OU 1 1/4''","10 mm²","20 ou 1/2''",null,null,"60.33x3.35 (DIAMETRO EXT. X ESPESSURA)","16 mm² Triplex",null,null,null,null,null,null,null,null,null,null,null,null,null,null,null,null,null,null,null,null,null,null,null,null,null,null,null,null,null,"4 ou mais",null,28,{"$f":"IF(AND(CALC.D!$C$6<>\"\",CALC.D!$G$6<>\"\",CALC.D!$R$2<>\"\",CALC.D!$AB$20=2,CALC.D!$F$10<>\"\",CALC.D!$E$64<>\"\",CALC.D!$F$10=\"4 ou mais\",$AV$3=8,CALC.D!$G$59=$AY$2),\"LIGAÇÃO AGRUPADA/COLETIVA\",0)","v":0},{"$f":"IF(AND(CALC.D!$C$6<>\"\",CALC.D!$G$6<>\"\",CALC.D!$R$2<>\"\",CALC.D!$AB$20=2,CALC.D!$F$10<>\"\",CALC.D!$E$64<>\"\",CALC.D!$F$10=\"4 ou mais\",$AV$3=8,CALC.D!$G$59=$AZ$2),\"LIGAÇÃO AGRUPADA/COLETIVA\",0)","v":0},{"$f":"IF(AND(CALC.D!$C$6<>\"\",CALC.D!$G$6<>\"\",CALC.D!$R$2<>\"\",CALC.D!$AB$20=2,CALC.D!$F$10<>\"\",CALC.D!$E$64<>\"\",CALC.D!$F$10=\"4 ou mais\",$AV$3=8,CALC.D!$G$59=$BA$2),\"LIGAÇÃO AGRUPADA/COLETIVA\",0)","v":0},{"$f":"IF(AND(CALC.D!$C$6<>\"\",CALC.D!$G$6<>\"\",CALC.D!$R$2<>\"\",CALC.D!$AB$20=2,CALC.D!$F$10<>\"\",CALC.D!$E$64<>\"\",CALC.D!$F$10=\"4 ou mais\",$AV$3=8,CALC.D!$G$59=$BB$2),\"LIGAÇÃO AGRUPADA/COLETIVA\",0)","v":0},{"$f":"IF(AND(CALC.D!$C$6<>\"\",CALC.D!$G$6<>\"\",CALC.D!$R$2<>\"\",CALC.D!$AB$20=2,CALC.D!$F$10<>\"\",CALC.D!$E$64<>\"\",CALC.D!$F$10=\"4 ou mais\",$AV$3=8,CALC.D!$G$59=$BC$2),\"LIGAÇÃO AGRUPADA/COLETIVA\",0)","v":0},{"$f":"IF(AND(CALC.D!$C$6<>\"\",CALC.D!$G$6<>\"\",CALC.D!$R$2<>\"\",CALC.D!$AB$20=2,CALC.D!$F$10<>\"\",CALC.D!$E$64<>\"\",CALC.D!$F$10=\"4 ou mais\",$AV$3=8,CALC.D!$G$59=$BD$2),\"LIGAÇÃO AGRUPADA/COLETIVA\",0)","v":0},{"$f":"IF(AND(CALC.D!$C$6<>\"\",CALC.D!$G$6<>\"\",CALC.D!$R$2<>\"\",CALC.D!$AB$20=2,CALC.D!$F$10<>\"\",CALC.D!$E$64<>\"\",CALC.D!$F$10=\"4 ou mais\",$AV$3=8,CALC.D!$G$59=$BE$2),\"LIGAÇÃO AGRUPADA/COLETIVA\",0)","v":0},{"$f":"IF(AND(CALC.D!$C$6<>\"\",CALC.D!$G$6<>\"\",CALC.D!$R$2<>\"\",CALC.D!$AB$20=2,CALC.D!$F$10<>\"\",CALC.D!$E$64<>\"\",CALC.D!$F$10=\"4 ou mais\",$AV$3=8,CALC.D!$G$59=$BF$2),\"LIGAÇÃO AGRUPADA/COLETIVA\",0)","v":0},{"$f":"IF(AND(CALC.D!$C$6<>\"\",CALC.D!$G$6<>\"\",CALC.D!$R$2<>\"\",CALC.D!$AB$20=2,CALC.D!$F$10<>\"\",CALC.D!$E$64<>\"\",CALC.D!$F$10=\"4 ou mais\",$AV$3=8,CALC.D!$G$59=$BG$2),\"LIGAÇÃO AGRUPADA/COLETIVA\",0)","v":0},{"$f":"IF(AND(CALC.D!$C$6<>\"\",CALC.D!$G$6<>\"\",CALC.D!$R$2<>\"\",CALC.D!$AB$20=2,CALC.D!$F$10<>\"\",CALC.D!$E$64<>\"\",CALC.D!$F$10=\"4 ou mais\",$AV$3=8,CALC.D!$G$59=$BH$2),\"LIGAÇÃO AGRUPADA/COLETIVA\",0)","v":0},28,{"$f":"IF(AND(CALC.D!$C$6<>\"\",CALC.D!$G$6<>\"\",CALC.D!$R$2<>\"\",CALC.D!$AB$20=2,CALC.D!$F$10<>\"\",CALC.D!$E$64<>\"\",CALC.D!$F$10=\"4 ou mais\",$AV$3=8,CALC.D!$G$59=$BJ$2),\"LIGAÇÃO AGRUPADA/COLETIVA\",0)","v":0},{"$f":"IF(AND(CALC.D!$C$6<>\"\",CALC.D!$G$6<>\"\",CALC.D!$R$2<>\"\",CALC.D!$AB$20=2,CALC.D!$F$10<>\"\",CALC.D!$E$64<>\"\",CALC.D!$F$10=\"4 ou mais\",$AV$3=8,CALC.D!$G$59=$BK$2),\"LIGAÇÃO AGRUPADA/COLETIVA\",0)","v":0},{"$f":"IF(AND(CALC.D!$C$6<>\"\",CALC.D!$G$6<>\"\",CALC.D!$R$2<>\"\",CALC.D!$AB$20=2,CALC.D!$F$10<>\"\",CALC.D!$E$64<>\"\",CALC.D!$F$10=\"4 ou mais\",$AV$3=8,CALC.D!$G$59=$BL$2),\"LIGAÇÃO AGRUPADA/COLETIVA\",0)","v":0},{"$f":"IF(AND(CALC.D!$C$6<>\"\",CALC.D!$G$6<>\"\",CALC.D!$R$2<>\"\",CALC.D!$AB$20=2,CALC.D!$F$10<>\"\",CALC.D!$E$64<>\"\",CALC.D!$F$10=\"4 ou mais\",$AV$3=8,CALC.D!$G$59=$BM$2),\"LIGAÇÃO AGRUPADA/COLETIVA\",0)","v":0},{"$f":"IF(AND(CALC.D!$C$6<>\"\",CALC.D!$G$6<>\"\",CALC.D!$R$2<>\"\",CALC.D!$AB$20=2,CALC.D!$F$10<>\"\",CALC.D!$E$64<>\"\",CALC.D!$F$10=\"4 ou mais\",$AV$3=8,CALC.D!$G$59=$BN$2),\"LIGAÇÃO AGRUPADA/COLETIVA\",0)","v":0},{"$f":"IF(AND(CALC.D!$C$6<>\"\",CALC.D!$G$6<>\"\",CALC.D!$R$2<>\"\",CALC.D!$AB$20=2,CALC.D!$F$10<>\"\",CALC.D!$E$64<>\"\",CALC.D!$F$10=\"4 ou mais\",$AV$3=8,CALC.D!$G$59=$BO$2),\"LIGAÇÃO AGRUPADA/COLETIVA\",0)","v":0},{"$f":"IF(AND(CALC.D!$C$6<>\"\",CALC.D!$G$6<>\"\",CALC.D!$R$2<>\"\",CALC.D!$AB$20=2,CALC.D!$F$10<>\"\",CALC.D!$E$64<>\"\",CALC.D!$F$10=\"4 ou mais\",$AV$3=8,CALC.D!$G$59=$BP$2),\"LIGAÇÃO AGRUPADA/COLETIVA\",0)","v":0},{"$f":"IF(AND(CALC.D!$C$6<>\"\",CALC.D!$G$6<>\"\",CALC.D!$R$2<>\"\",CALC.D!$AB$20=2,CALC.D!$F$10<>\"\",CALC.D!$E$64<>\"\",CALC.D!$F$10=\"4 ou mais\",$AV$3=8,CALC.D!$G$59=$BQ$2),\"LIGAÇÃO AGRUPADA/COLETIVA\",0)","v":0}]
[{"$f":"IF(AND(CALC.D!$B$60<=D26,OR(CALC.D!$B$62<=$E$26,CALC.D!$B$62=\"\"),$AO$5<=$W$6,$AP$5<=$X$7,$AQ$5<=$Y$12,$AL$9=0,CALC.D!$AB$20=2,G49<=2),1,0)","v":0},0,"C7 TRIFÁSICO",75,26,3,5,20,"10 mm²","TIPO: III OU V","DJ 40 A","40 mm² OU 1 1/4''","10 mm²","20 ou 1/2''",null,null,"60.33x3.35 (DIAMETRO EXT. X ESPESSURA)","10 mm² - Quadruplex",null,null,null,null,null,null,null,null,null,null,null,null,null,null,null,null,null,null,null,null,null,null,null,null,null,null,null,null,"FACE B",{"$f":"IF(AND(CALC.D!AB15=0,CALC.D!E64=TABELAS!A61,CALC.D!G59<>\"\"),VLOOKUP(AW28,AX28:BH31,AX27,FALSE),IF(AND(CALC.D!AB15=0,CALC.D!E64=TABELAS!A62,CALC.D!G59<>\"\"),VLOOKUP(AW32,AX32:BH34,AX27,FALSE),IF(AND(CALC.D!AB15=0,CALC.D!E64=TABELAS!A63,CALC.D!G59<>\"\"),VLOOKUP(AW35,AX35:BH37,AX27,FALSE),IF(AND(CALC.D!AB15=0,CALC.D!E64=TABELAS!A64,CALC.D!G59<>\"\"),VLOOKUP(AW38,AX38:BH39,AX27,FALSE),IF(AND(CALC.D!AB15=0,CALC.D!E64=TABELAS!A65,CALC.D!G59<>\"\"),VLOOKUP(AW40,AX40:BH41,AX27,FALSE),IF(AND(CALC.D!AB15=0,CALC.D!E64=TABELAS!A66,CALC.D!G59<>\"\"),VLOOKUP(AW42,AX42:BH45,AX27,FALSE),IF(AND(CALC.D!AB15=0,CALC.D!E64=TABELAS!A67,CALC.D!G59<>\"\"),VLOOKUP(AW46,AX46:BH49,AX27,FALSE),IF(AND(CALC.D!AB15=1,CALC.D!E64=TABELAS!A61,CALC.D!G59<>\"\"),VLOOKUP(AW28,BI28:BQ31,AX27,FALSE),IF(AND(CALC.D!AB15=1,CALC.D!E64=TABELAS!A62,CALC.D!G59<>\"\"),VLOOKUP(AW32,BI32:BQ34,AX27,FALSE),IF(AND(CALC.D!AB15=1,CALC.D!E64=TABELAS!A63,CALC.D!G59<>\"\"),VLOOKUP(AW35,BI35:BQ37,AX27,FALSE),IF(AND(CALC.D!AB15=1,CALC.D!E64=TABELAS!A64,CALC.D!G59<>\"\"),VLOOKUP(AW38,BI38:BQ39,AX27,FALSE),IF(AND(CALC.D!AB15=1,CALC.D!E64=TABELAS!A66,CALC.D!G59<>\"\"),VLOOKUP(AW42,BI42:BQ45,AX27,FALSE),IF(AND(CALC.D!AB15=1,CALC.D!E64=TABELAS!A67,CALC.D!G59<>\"\"),VLOOKUP(AW46,BI46:BQ49,AX27,FALSE),\"\")))))))))))))","v":""},null,null,"A1 MONOFÁSICO","A2 MONOFÁSICO","B1 BIFÁSICO","B2 BIFÁSICO","C1 TRIFÁSICO","C2 TRIFÁSICO","C3 TRIFÁSICO","C4 TRIFÁSICO","C5 TRIFÁSICO","C6 TRIFÁSICO",null,"A3 MONOFÁSICO","A4 MONOFÁSICO","B3 BIFÁSICO","C7 TRIFÁSICO","C8 TRIFÁSICO","C9 TRIFÁSICO","C10 TRIFÁSICO","C11 TRIFÁSICO"]
[{"$f":"IF(AND(CALC.D!$B$60<=D27,OR(CALC.D!$B$62<=E27,CALC.D!$B$62=\"\"),$AO$5<=$W$6,$AP$5<=$X$8,$AQ$5<=$Y$14,CALC.D!$AB$20=2,G49<=2),1,0)","v":0},0,"C8 TRIFÁSICO",75,40,3,5,30,"16 mm²","TIPO: III OU V","DJ 63 A","40 mm² OU 1 1/4''","10 mm²","20 ou 1/2''",null,null,"60.33x3.35 (DIAMETRO EXT. X ESPESSURA)","16 mm² - Quadruplex",null,null,null,null,null,null,null,null,null,null,null,null,null,null,null,null,null,null,null,null,null,null,null,null,null,null,null,null,"LIGAÇÕES",{"$f":"IF(AND(CALC.D!E64<>\"\",CALC.D!$AB$20=2),VLOOKUP(CALC.D!$E$64,TABELAS!$A$60:$C$67,3,FALSE),\"\")","v":2},"FACE B",{"$f":"IF(CALC.D!G59<>\"\",HLOOKUP(CALC.D!$G$59,DIMENSIONAMENTO!AY26:BQ27,2,FALSE),\"\")","v":""},2,3,4,5,6,7,8,9,10,11,null,2,3,4,5,6,7,8,9]
[{"$f":"IF(AND(CALC.D!$B$60<=D28,OR(CALC.D!$B$62<=E28,CALC.D!B62=\"\"),$AO$5<=$W$7,$AP$5<=$X$9,$AQ$5<=$Y$14,CALC.D!$AB$20=2,G49<=2),1,0)","v":0},0,"C9 TRIFÁSICO",75,46,5,10,30,"25 mm²","TIPO: III OU V"," DJ 80 A","40 mm² OU 1 1/4''","10 mm²","20 ou 1/2''",null,null,null,"25 mm² - Quadruplex",null,null,null,null,null,null,null,null,null,null,null,null,null,null,null,null,null,null,null,null,null,null,null,null,null,null,null,null,"POSTE PADRÃO",1,{"$f":"IF(CALC.D!$E$64=TABELAS!A61,VLOOKUP(CALC.D!$F$10,$AV$28:$AX$31,3,FALSE),0)","v":{"$error":"#N/A"}},1,{"$f":"IF(AND(CALC.D!$C$6<>\"\",CALC.D!$G$6<>\"\",CALC.D!$R$2<>\"\",CALC.D!$AB$20=2,CALC.D!$F$10<>\"\",CALC.D!$E$64<>\"\"),IF(AND($AV$27=2,CALC.D!$G$59=$AY$26,CALC.D!$F$10=1),TABELAS!$E$79,0))","v":false},{"$f":"IF(AND(CALC.D!$C$6<>\"\",CALC.D!$G$6<>\"\",CALC.D!$R$2<>\"\",CALC.D!$AB$20=2,CALC.D!$F$10<>\"\",CALC.D!$E$64<>\"\"),IF(AND($AV$27=2,CALC.D!$G$59=$AZ$26,CALC.D!$F$10=1),TABELAS!$E$80,0))","v":false},{"$f":"IF(AND(CALC.D!$C$6<>\"\",CALC.D!$G$6<>\"\",CALC.D!$R$2<>\"\",CALC.D!$AB$20=2,CALC.D!$F$10<>\"\",CALC.D!$E$64<>\"\"),IF(AND($AV$27=2,CALC.D!$G$59=$BA$26,CALC.D!$F$10=1),TABELAS!$E$83,0))","v":false},{"$f":"IF(AND(CALC.D!$C$6<>\"\",CALC.D!$G$6<>\"\",CALC.D!$R$2<>\"\",CALC.D!$AB$20=2,CALC.D!$F$10<>\"\",CALC.D!$E$64<>\"\"),IF(AND($AV$27=2,CALC.D!$G$59=$BB$26,CALC.D!$F$10=1),TABELAS!$E$84,0))","v":false},{"$f":"IF(AND(CALC.D!$C$6<>\"\",CALC.D!$G$6<>\"\",CALC.D!$R$2<>\"\",CALC.D!$AB$20=2,CALC.D!$F$10<>\"\",CALC.D!$E$64<>\"\"),IF(AND($AV$27=2,CALC.D!$G$59=$BC$26,CALC.D!$F$10=1),TABELAS!$E$86,0))","v":false},{"$f":"IF(AND(CALC.D!$C$6<>\"\",CALC.D!$G$6<>\"\",CALC.D!$R$2<>\"\",CALC.D!$AB$20=2,CALC.D!$F$10<>\"\",CALC.D!$E$64<>\"\"),IF(AND($AV$27=2,CALC.D!$G$59=$BD$26,CALC.D!$F$10=1),TABELAS!$E$87,0))","v":false},{"$f":"IF(AND(CALC.D!$C$6<>\"\",CALC.D!$G$6<>\"\",CALC.D!$R$2<>\"\",CALC.D!$AB$20=2,CALC.D!$F$10<>\"\",CALC.D!$E$64<>\"\"),IF(AND($AV$27=2,CALC.D!$G$59=$BE$26,CALC.D!$F$10=1),TABELAS!$E$88,0))","v":false},{"$f":"IF(AND(CALC.D!$C$6<>\"\",CALC.D!$G$6<>\"\",CALC.D!$R$2<>\"\",CALC.D!$AB$20=2,CALC.D!$F$10<>\"\",CALC.D!$E$64<>\"\"),IF(AND($AV$27=2,CALC.D!$G$59=$BF$26,CALC.D!$F$10=1),TABELAS!$E$89,0))","v":false},{"$f":"IF(AND(CALC.D!$C$6<>\"\",CALC.D!$G$6<>\"\",CALC.D!$R$2<>\"\",CALC.D!$AB$20=2,CALC.D!$F$10<>\"\",CALC.D!$E$64<>\"\"),IF(AND($AV$27=2,CALC.D!$G$59=$BG$26,CALC.D!$F$10=1),TABELAS!$E$90,0))","v":false},{"$f":"IF(AND(CALC.D!$C$6<>\"\",CALC.D!$G$6<>\"\",CALC.D!$R$2<>\"\",CALC.D!$AB$20=2,CALC.D!$F$10<>\"\",CALC.D!$E$64<>\"\"),IF(AND($AV$27=2,CALC.D!$G$59=$BH$26,CALC.D!$F$10=1),TABELAS!$E$91,0))","v":false},1,{"$f":"IF(AND(CALC.D!$C$6<>\"\",CALC.D!$G$6<>\"\",CALC.D!$R$2<>\"\",CALC.D!$AB$20=2,CALC.D!$F$10<>\"\",CALC.D!$E$64<>\"\"),IF(AND($AV$27=2,CALC.D!$G$59=$BJ$26,CALC.D!$F$10=1),TABELAS!$E$81,0))","v":false},{"$f":"IF(AND(CALC.D!$C$6<>\"\",CALC.D!$G$6<>\"\",CALC.D!$R$2<>\"\",CALC.D!$AB$20=2,CALC.D!$F$10<>\"\",CALC.D!$E$64<>\"\"),IF(AND($AV$27=2,CALC.D!$G$59=$BK$26,CALC.D!$F$10=1),TABELAS!$E$82,0))","v":false},{"$f":"IF(AND(CALC.D!$C$6<>\"\",CALC.D!$G$6<>\"\",CALC.D!$R$2<>\"\",CALC.D!$AB$20=2,CALC.D!$F$10<>\"\",CALC.D!$E$64<>\"\"),IF(AND($AV$27=2,CALC.D!$G$59=$BL$26,CALC.D!$F$10=1),TABELAS!$E$85,0))","v":false},{"$f":"IF(AND(CALC.D!$C$6<>\"\",CALC.D!$G$6<>\"\",CALC.D!$R$2<>\"\",CALC.D!$AB$20=2,CALC.D!$F$10<>\"\",CALC.D!$E$64<>\"\"),IF(AND($AV$27=2,CALC.D!$G$59=$BM$26,CALC.D!$F$10=1),TABELAS!$E$92,0))","v":false},{"$f":"IF(AND(CALC.D!$C$6<>\"\",CALC.D!$G$6<>\"\",CALC.D!$R$2<>\"\",CALC.D!$AB$20=2,CALC.D!$F$10<>\"\",CALC.D!$E$64<>\"\"),IF(AND($AV$27=2,CALC.D!$G$59=$BN$26,CALC.D!$F$10=1),TABELAS!$E$93,0))","v":false},{"$f":"IF(AND(CALC.D!$C$6<>\"\",CALC.D!$G$6<>\"\",CALC.D!$R$2<>\"\",CALC.D!$AB$20=2,CALC.D!$F$10<>\"\",CALC.D!$E$64<>\"\"),IF(AND($AV$27=2,CALC.D!$G$59=$BO$26,CALC.D!$F$10=1),TABELAS!$E$94,0))","v":false},{"$f":"IF(AND(CALC.D!$C$6<>\"\",CALC.D!$G$6<>\"\",CALC.D!$R$2<>\"\",CALC.D!$AB$20=2,CALC.D!$F$10<>\"\",CALC.D!$E$64<>\"\"),IF(AND($AV$27=2,CALC.D!$G$59=$BP$26,CALC.D!$F$10=1),TABELAS!$E$95,0))","v":false},{"$f":"IF(AND(CALC.D!$C$6<>\"\",CALC.D!$G$6<>\"\",CALC.D!$R$2<>\"\",CALC.D!$AB$20=2,CALC.D!$F$10<>\"\",CALC.D!$E$64<>\"\"),IF(AND($AV$27=2,CALC.D!$G$59=$BQ$26,CALC.D!$F$10=1),TABELAS!$E$96,0))","v":false}]
[{"$f":"IF(AND(CALC.D!$B$60<=D29,OR(CALC.D!$B$62<=E29,CALC.D!$B$62=\"\"),$AO$5<=$W$8,$AP$5<=$X$10,$AQ$5<=$Y$15,CALC.D!$AB$20=2,G49<=2),1,0)","v":0},0,"C10 TRIFÁSICO",75,66,7.5,12,40,"35 mm²","TIPO: III OU V","DJ 100 A","40 mm² OU 1 1/4''","10 mm²","20 ou 1/2''",200,null,null,"35 mm² - Quadruplex",null,null,null,null,null,null,null,null,null,null,null,null,null,null,null,null,null,null,null,null,null,null,null,null,null,null,null,null,null,2,null,2,{"$f":"IF(AND(CALC.D!$C$6<>\"\",CALC.D!$G$6<>\"\",CALC.D!$R$2<>\"\",CALC.D!$AB$20=2,CALC.D!$F$10<>\"\",CALC.D!$E$64<>\"\"),IF(AND($AV$27=2,CALC.D!$G$59=$AY$26,CALC.D!$F$10=2),TABELAS!$E$79,0))","v":false},{"$f":"IF(AND(CALC.D!$C$6<>\"\",CALC.D!$G$6<>\"\",CALC.D!$R$2<>\"\",CALC.D!$AB$20=2,CALC.D!$F$10<>\"\",CALC.D!$E$64<>\"\"),IF(AND($AV$27=2,CALC.D!$G$59=$AZ$26,CALC.D!$F$10=2),TABELAS!$E$80,0))","v":false},{"$f":"IF(AND(CALC.D!$C$6<>\"\",CALC.D!$G$6<>\"\",CALC.D!$R$2<>\"\",CALC.D!$AB$20=2,CALC.D!$F$10<>\"\",CALC.D!$E$64<>\"\"),IF(AND($AV$27=2,CALC.D!$G$59=$BA$26,CALC.D!$F$10=2),TABELAS!$E$83,0))","v":false},{"$f":"IF(AND(CALC.D!$C$6<>\"\",CALC.D!$G$6<>\"\",CALC.D!$R$2<>\"\",CALC.D!$AB$20=2,CALC.D!$F$10<>\"\",CALC.D!$E$64<>\"\"),IF(AND($AV$27=2,CALC.D!$G$59=$BB$26,CALC.D!$F$10=2),TABELAS!$E$84,0))","v":false},{"$f":"IF(AND(CALC.D!$C$6<>\"\",CALC.D!$G$6<>\"\",CALC.D!$R$2<>\"\",CALC.D!$AB$20=2,CALC.D!$F$10<>\"\",CALC.D!$E$64<>\"\"),IF(AND($AV$27=2,CALC.D!$G$59=$BC$26,CALC.D!$F$10=2),TABELAS!$E$86,0))","v":false},{"$f":"IF(AND(CALC.D!$C$6<>\"\",CALC.D!$G$6<>\"\",CALC.D!$R$2<>\"\",CALC.D!$AB$20=2,CALC.D!$F$10<>\"\",CALC.D!$E$64<>\"\"),IF(AND($AV$27=2,CALC.D!$G$59=$BD$26,CALC.D!$F$10=2),TABELAS!$E$87,0))","v":false},{"$f":"IF(AND(CALC.D!$C$6<>\"\",CALC.D!$G$6<>\"\",CALC.D!$R$2<>\"\",CALC.D!$AB$20=2,CALC.D!$F$10<>\"\",CALC.D!$E$64<>\"\"),IF(AND($AV$27=2,CALC.D!$G$59=$BE$26,CALC.D!$F$10=2),TABELAS!$E$88,0))","v":false},{"$f":"IF(AND(CALC.D!$C$6<>\"\",CALC.D!$G$6<>\"\",CALC.D!$R$2<>\"\",CALC.D!$AB$20=2,CALC.D!$F$10<>\"\",CALC.D!$E$64<>\"\"),IF(AND($AV$27=2,CALC.D!$G$59=$BF$26,CALC.D!$F$10=2),TABELAS!$E$89,0))","v":false},{"$f":"IF(AND(CALC.D!$C$6<>\"\",CALC.D!$G$6<>\"\",CALC.D!$R$2<>\"\",CALC.D!$AB$20=2,CALC.D!$F$10<>\"\",CALC.D!$E$64<>\"\"),IF(AND($AV$27=2,CALC.D!$G$59=$BG$26,CALC.D!$F$10=2),TABELAS!$E$90,0))","v":false},{"$f":"IF(AND(CALC.D!$C$6<>\"\",CALC.D!$G$6<>\"\",CALC.D!$R$2<>\"\",CALC.D!$AB$20=2,CALC.D!$F$10<>\"\",CALC.D!$E$64<>\"\"),IF(AND($AV$27=2,CALC.D!$G$59=$BH$26,CALC.D!$F$10=2,OR(CALC.D!AB19=1,CALC.D!AB19=2)),TABELAS!$E$91,IF(AND($AV$27=2,CALC.D!$G$59=$BH$26,CALC.D!$F$10=2,CALC.D!AB19=3),\"AGRUPADA OU COLETIVA\",0)))","v":false},2,{"$f":"IF(AND(CALC.D!$C$6<>\"\",CALC.D!$G$6<>\"\",CALC.D!$R$2<>\"\",CALC.D!$AB$20=2,CALC.D!$F$10<>\"\",CALC.D!$E$64<>\"\"),IF(AND($AV$27=2,CALC.D!$G$59=$BJ$26,CALC.D!$F$10=2),TABELAS!$E$81,0))","v":false},{"$f":"IF(AND(CALC.D!$C$6<>\"\",CALC.D!$G$6<>\"\",CALC.D!$R$2<>\"\",CALC.D!$AB$20=2,CALC.D!$F$10<>\"\",CALC.D!$E$64<>\"\"),IF(AND($AV$27=2,CALC.D!$G$59=$BK$26,CALC.D!$F$10=2),TABELAS!$E$82,0))","v":false},{"$f":"IF(AND(CALC.D!$C$6<>\"\",CALC.D!$G$6<>\"\",CALC.D!$R$2<>\"\",CALC.D!$AB$20=2,CALC.D!$F$10<>\"\",CALC.D!$E$64<>\"\"),IF(AND($AV$27=2,CALC.D!$G$59=$BL$26,CALC.D!$F$10=2),TABELAS!$E$85,0))","v":false},{"$f":"IF(AND(CALC.D!$C$6<>\"\",CALC.D!$G$6<>\"\",CALC.D!$R$2<>\"\",CALC.D!$AB$20=2,CALC.D!$F$10<>\"\",CALC.D!$E$64<>\"\"),IF(AND($AV$27=2,CALC.D!$G$59=$BM$26,CALC.D!$F$10=2),TABELAS!$E$92,0))","v":false},{"$f":"IF(AND(CALC.D!$C$6<>\"\",CALC.D!$G$6<>\"\",CALC.D!$R$2<>\"\",CALC.D!$AB$20=2,CALC.D!$F$10<>\"\",CALC.D!$E$64<>\"\"),IF(AND($AV$27=2,CALC.D!$G$59=$BN$26,CALC.D!$F$10=2),TABELAS!$E$93,0))","v":false},{"$f":"IF(AND(CALC.D!$C$6<>\"\",CALC.D!$G$6<>\"\",CALC.D!$R$2<>\"\",CALC.D!$AB$20=2,CALC.D!$F$10<>\"\",CALC.D!$E$64<>\"\"),IF(AND($AV$27=2,CALC.D!$G$59=$BO$26,CALC.D!$F$10=2),TABELAS!$E$94,0))","v":false},{"$f":"IF(AND(CALC.D!$C$6<>\"\",CALC.D!$G$6<>\"\",CALC.D!$R$2<>\"\",CALC.D!$AB$20=2,CALC.D!$F$10<>\"\",CALC.D!$E$64<>\"\"),IF(AND($AV$27=2,CALC.D!$G$59=$BP$26,CALC.D!$F$10=2),TABELAS!$E$95,0))","v":false},{"$f":"IF(AND(CALC.D!$C$6<>\"\",CALC.D!$G$6<>\"\",CALC.D!$R$2<>\"\",CALC.D!$AB$20=2,CALC.D!$F$10<>\"\",CALC.D!$E$64<>\"\"),IF(AND($AV$27=2,CALC.D!$G$59=$BQ$26,CALC.D!$F$10=2),TABELAS!$E$96,0))","v":false}]
[{"$f":"IF(AND(CALC.D!$B$60<=D30,OR(CALC.D!$B$62<=E30,CALC.D!$B$62=\"\"),$AO$5<=$W$8,$AP$5<=$X$10,$AQ$5<=$Y$16,CALC.D!$AB$20=2,G49<=1),1,0)","v":0},0,"C11 TRIFÁSICO",75,82,7.5,12,50,"50 mm²","TIPO: L + T","DJ 125 A","50 mm² OU 1 1/2''","16 mm²","20 ou 1/2''",null,null,null,"35 mm² - Quadruplex",null,null,null,null,null,null,null,null,null,null,null,null,null,null,null,null,null,null,null,null,null,null,null,null,null,null,null,null,null,3,null,3,{"$f":"IF(AND(CALC.D!$C$6<>\"\",CALC.D!$G$6<>\"\",CALC.D!$R$2<>\"\",CALC.D!$AB$20=2,CALC.D!$F$10<>\"\",CALC.D!$E$64<>\"\"),IF(AND($AV$27=2,CALC.D!$G$59=$AY$26,CALC.D!$F$10=3),TABELAS!$E$79,0))","v":false},{"$f":"IF(AND(CALC.D!$C$6<>\"\",CALC.D!$G$6<>\"\",CALC.D!$R$2<>\"\",CALC.D!$AB$20=2,CALC.D!$F$10<>\"\",CALC.D!$E$64<>\"\"),IF(AND($AV$27=2,CALC.D!$G$59=$AZ$26,CALC.D!$F$10=3),TABELAS!$E$80,0))","v":false},{"$f":"IF(AND(CALC.D!$C$6<>\"\",CALC.D!$G$6<>\"\",CALC.D!$R$2<>\"\",CALC.D!$AB$20=2,CALC.D!$F$10<>\"\",CALC.D!$E$64<>\"\"),IF(AND($AV$27=2,CALC.D!$G$59=$BA$26,CALC.D!$F$10=3),TABELAS!$E$83,0))","v":false},{"$f":"IF(AND(CALC.D!$C$6<>\"\",CALC.D!$G$6<>\"\",CALC.D!$R$2<>\"\",CALC.D!$AB$20=2,CALC.D!$F$10<>\"\",CALC.D!$E$64<>\"\"),IF(AND($AV$27=2,CALC.D!$G$59=$BB$26,CALC.D!$F$10=3),TABELAS!$E$84,0))","v":false},{"$f":"IF(AND(CALC.D!$C$6<>\"\",CALC.D!$G$6<>\"\",CALC.D!$R$2<>\"\",CALC.D!$AB$20=2,CALC.D!$F$10<>\"\",CALC.D!$E$64<>\"\"),IF(AND($AV$27=2,CALC.D!$G$59=$BC$26,CALC.D!$F$10=3),TABELAS!$E$86,0))","v":false},{"$f":"IF(AND(CALC.D!$C$6<>\"\",CALC.D!$G$6<>\"\",CALC.D!$R$2<>\"\",CALC.D!$AB$20=2,CALC.D!$F$10<>\"\",CALC.D!$E$64<>\"\"),IF(AND($AV$27=2,CALC.D!$G$59=$BD$26,CALC.D!$F$10=3),TABELAS!$E$87,0))","v":false},{"$f":"IF(AND(CALC.D!$C$6<>\"\",CALC.D!$G$6<>\"\",CALC.D!$R$2<>\"\",CALC.D!$AB$20=2,CALC.D!$F$10<>\"\",CALC.D!$E$64<>\"\"),IF(AND($AV$27=2,CALC.D!$G$59=$BE$26,CALC.D!$F$10=3),TABELAS!$E$88,0))","v":false},{"$f":"IF(AND(CALC.D!$C$6<>\"\",CALC.D!$G$6<>\"\",CALC.D!$R$2<>\"\",CALC.D!$AB$20=2,CALC.D!$F$10<>\"\",CALC.D!$E$64<>\"\"),IF(AND($AV$27=2,CALC.D!$G$59=$BF$26,CALC.D!$F$10=3),TABELAS!$E$89,0))","v":false},{"$f":"IF(AND(CALC.D!$C$6<>\"\",CALC.D!$G$6<>\"\",CALC.D!$R$2<>\"\",CALC.D!$AB$20=2,CALC.D!$F$10<>\"\",CALC.D!$E$64<>\"\"),IF(AND($AV$27=2,CALC.D!$G$59=$BG$26,CALC.D!$F$10=3),TABELAS!$E$90,0))","v":false},{"$f":"IF(AND(CALC.D!$C$6<>\"\",CALC.D!$G$6<>\"\",CALC.D!$R$2<>\"\",CALC.D!$AB$20=2,CALC.D!$F$10<>\"\",CALC.D!$E$64<>\"\"),IF(AND($AV$27=2,CALC.D!$G$59=$BH$26,CALC.D!$F$10=3),TABELAS!$E$91,0))","v":false},3,{"$f":"IF(AND(CALC.D!$C$6<>\"\",CALC.D!$G$6<>\"\",CALC.D!$R$2<>\"\",CALC.D!$AB$20=2,CALC.D!$F$10<>\"\",CALC.D!$E$64<>\"\"),IF(AND($AV$27=2,CALC.D!$G$59=$BJ$26,CALC.D!$F$10=3),TABELAS!$E$81,0))","v":false},{"$f":"IF(AND(CALC.D!$C$6<>\"\",CALC.D!$G$6<>\"\",CALC.D!$R$2<>\"\",CALC.D!$AB$20=2,CALC.D!$F$10<>\"\",CALC.D!$E$64<>\"\"),IF(AND($AV$27=2,CALC.D!$G$59=$BK$26,CALC.D!$F$10=3),TABELAS!$E$82,0))","v":false},{"$f":"IF(AND(CALC.D!$C$6<>\"\",CALC.D!$G$6<>\"\",CALC.D!$R$2<>\"\",CALC.D!$AB$20=2,CALC.D!$F$10<>\"\",CALC.D!$E$64<>\"\"),IF(AND($AV$27=2,CALC.D!$G$59=$BL$26,CALC.D!$F$10=3),TABELAS!$E$85,0))","v":false},{"$f":"IF(AND(CALC.D!$C$6<>\"\",CALC.D!$G$6<>\"\",CALC.D!$R$2<>\"\",CALC.D!$AB$20=2,CALC.D!$F$10<>\"\",CALC.D!$E$64<>\"\"),IF(AND($AV$27=2,CALC.D!$G$59=$BM$26,CALC.D!$F$10=3),TABELAS!$E$92,0))","v":false},{"$f":"IF(AND(CALC.D!$C$6<>\"\",CALC.D!$G$6<>\"\",CALC.D!$R$2<>\"\",CALC.D!$AB$20=2,CALC.D!$F$10<>\"\",CALC.D!$E$64<>\"\"),IF(AND($AV$27=2,CALC.D!$G$59=$BN$26,CALC.D!$F$10=3),TABELAS!$E$93,0))","v":false},{"$f":"IF(AND(CALC.D!$C$6<>\"\",CALC.D!$G$6<>\"\",CALC.D!$R$2<>\"\",CALC.D!$AB$20=2,CALC.D!$F$10<>\"\",CALC.D!$E$64<>\"\"),IF(AND($AV$27=2,CALC.D!$G$59=$BO$26,CALC.D!$F$10=3),TABELAS!$E$94,0))","v":false},{"$f":"IF(AND(CALC.D!$C$6<>\"\",CALC.D!$G$6<>\"\",CALC.D!$R$2<>\"\",CALC.D!$AB$20=2,CALC.D!$F$10<>\"\",CALC.D!$E$64<>\"\"),IF(AND($AV$27=2,CALC.D!$G$59=$BP$26,CALC.D!$F$10=3),TABELAS!$E$95,0))","v":false},{"$f":"IF(AND(CALC.D!$C$6<>\"\",CALC.D!$G$6<>\"\",CALC.D!$R$2<>\"\",CALC.D!$AB$20=2,CALC.D!$F$10<>\"\",CALC.D!$E$64<>\"\"),IF(AND($AV$27=2,CALC.D!$G$59=$BQ$26,CALC.D!$F$10=3),TABELAS!$E$96,0))","v":false}]
[null,null,null,null,null,null,null,null,null,null,null,null,null,null,null,null,null,null,null,null,null,null,null,null,null,null,null,null,null,null,null,null,null,null,null,null,null,null,null,null,null,null,null,null,null,null,null,"4 ou mais",null,4,{"$f":"IF(AND(CALC.D!$C$6<>\"\",CALC.D!$G$6<>\"\",CALC.D!$R$2<>\"\",CALC.D!$AB$20=2,CALC.D!$F$10<>\"\",CALC.D!$E$64<>\"\"),IF(AND($AV$27=2,CALC.D!$G$59=$AY$26,CALC.D!$F$10=\"4 ou mais\"),\"ou Ligação Coletiva\",0))","v":false},{"$f":"IF(AND(CALC.D!$C$6<>\"\",CALC.D!$G$6<>\"\",CALC.D!$R$2<>\"\",CALC.D!$AB$20=2,CALC.D!$F$10<>\"\",CALC.D!$E$64<>\"\"),IF(AND($AV$27=2,CALC.D!$G$59=$AZ$26,CALC.D!$F$10=\"4 ou mais\"),\"ou Ligação Coletiva\",0))","v":false},{"$f":"IF(AND(CALC.D!$C$6<>\"\",CALC.D!$G$6<>\"\",CALC.D!$R$2<>\"\",CALC.D!$AB$20=2,CALC.D!$F$10<>\"\",CALC.D!$E$64<>\"\"),IF(AND($AV$27=2,CALC.D!$G$59=$BA$26,CALC.D!$F$10=\"4 ou mais\"),\"ou Ligação Coletiva\",0))","v":false},{"$f":"IF(AND(CALC.D!$C$6<>\"\",CALC.D!$G$6<>\"\",CALC.D!$R$2<>\"\",CALC.D!$AB$20=2,CALC.D!$F$10<>\"\",CALC.D!$E$64<>\"\"),IF(AND($AV$27=2,CALC.D!$G$59=$BB$26,CALC.D!$F$10=\"4 ou mais\"),\"ou Ligação Coletiva\",0))","v":false},{"$f":"IF(AND(CALC.D!$C$6<>\"\",CALC.D!$G$6<>\"\",CALC.D!$R$2<>\"\",CALC.D!$AB$20=2,CALC.D!$F$10<>\"\",CALC.D!$E$64<>\"\"),IF(AND($AV$27=2,CALC.D!$G$59=$BC$26,CALC.D!$F$10=\"4 ou mais\"),\"ou Ligação Coletiva\",0))","v":false},{"$f":"IF(AND(CALC.D!$C$6<>\"\",CALC.D!$G$6<>\"\",CALC.D!$R$2<>\"\",CALC.D!$AB$20=2,CALC.D!$F$10<>\"\",CALC.D!$E$64<>\"\"),IF(AND($AV$27=2,CALC.D!$G$59=$BD$26,CALC.D!$F$10=\"4 ou mais\"),\"ou Ligação Coletiva\",0))","v":false},{"$f":"IF(AND(CALC.D!$C$6<>\"\",CALC.D!$G$6<>\"\",CALC.D!$R$2<>\"\",CALC.D!$AB$20=2,CALC.D!$F$10<>\"\",CALC.D!$E$64<>\"\"),IF(AND($AV$27=2,CALC.D!$G$59=$BE$26,CALC.D!$F$10=\"4 ou mais\"),\"ou Ligação Coletiva\",0))","v":false},{"$f":"IF(AND(CALC.D!$C$6<>\"\",CALC.D!$G$6<>\"\",CALC.D!$R$2<>\"\",CALC.D!$AB$20=2,CALC.D!$F$10<>\"\",CALC.D!$E$64<>\"\"),IF(AND($AV$27=2,CALC.D!$G$59=$BF$26,CALC.D!$F$10=\"4 ou mais\"),\"ou Ligação Coletiva\",0))","v":false},{"$f":"IF(AND(CALC.D!$C$6<>\"\",CALC.D!$G$6<>\"\",CALC.D!$R$2<>\"\",CALC.D!$AB$20=2,CALC.D!$F$10<>\"\",CALC.D!$E$64<>\"\"),IF(AND($AV$27=2,CALC.D!$G$59=$BG$26,CALC.D!$F$10=\"4 ou mais\"),\"ou Ligação Coletiva\",0))","v":false},{"$f":"IF(AND(CALC.D!$C$6<>\"\",CALC.D!$G$6<>\"\",CALC.D!$R$2<>\"\",CALC.D!$AB$20=2,CALC.D!$F$10<>\"\",CALC.D!$E$64<>\"\"),IF(AND($AV$27=2,CALC.D!$G$59=$BH$26,CALC.D!$F$10=\"4 ou mais\"),\"ou Ligação Coletiva\",0))","v":false},4,{"$f":"IF(AND(CALC.D!$C$6<>\"\",CALC.D!$G$6<>\"\",CALC.D!$R$2<>\"\",CALC.D!$AB$20=2,CALC.D!$F$10<>\"\",CALC.D!$E$64<>\"\"),IF(AND($AV$27=2,CALC.D!$G$59=$AY$26,CALC.D!$F$10=\"4 ou mais\"),\"ou Ligação Coletiva\",0))","v":false},{"$f":"IF(AND(CALC.D!$C$6<>\"\",CALC.D!$G$6<>\"\",CALC.D!$R$2<>\"\",CALC.D!$AB$20=2,CALC.D!$F$10<>\"\",CALC.D!$E$64<>\"\"),IF(AND($AV$27=2,CALC.D!$G$59=$AZ$26,CALC.D!$F$10=\"4 ou mais\"),\"ou Ligação Coletiva\",0))","v":false},{"$f":"IF(AND(CALC.D!$C$6<>\"\",CALC.D!$G$6<>\"\",CALC.D!$R$2<>\"\",CALC.D!$AB$20=2,CALC.D!$F$10<>\"\",CALC.D!$E$64<>\"\"),IF(AND($AV$27=2,CALC.D!$G$59=$BL$26,CALC.D!$F$10=\"4 ou mais\"),\"ou Ligação Coletiva\",0))","v":false},{"$f":"IF(AND(CALC.D!$C$6<>\"\",CALC.D!$G$6<>\"\",CALC.D!$R$2<>\"\",CALC.D!$AB$20=2,CALC.D!$F$10<>\"\",CALC.D!$E$64<>\"\"),IF(AND($AV$27=2,CALC.D!$G$59=$BM$26,CALC.D!$F$10=\"4 ou mais\"),\"ou Ligação Coletiva\",0))","v":false},{"$f":"IF(AND(CALC.D!$C$6<>\"\",CALC.D!$G$6<>\"\",CALC.D!$R$2<>\"\",CALC.D!$AB$20=2,CALC.D!$F$10<>\"\",CALC.D!$E$64<>\"\"),IF(AND($AV$27=2,CALC.D!$G$59=$BN$26,CALC.D!$F$10=\"4 ou mais\"),\"ou Ligação Coletiva\",0))","v":false},{"$f":"IF(AND(CALC.D!$C$6<>\"\",CALC.D!$G$6<>\"\",CALC.D!$R$2<>\"\",CALC.D!$AB$20=2,CALC.D!$F$10<>\"\",CALC.D!$E$64<>\"\"),IF(AND($AV$27=2,CALC.D!$G$59=$BO$26,CALC.D!$F$10=\"4 ou mais\"),\"ou Ligação Coletiva\",0))","v":false},{"$f":"IF(AND(CALC.D!$C$6<>\"\",CALC.D!$G$6<>\"\",CALC.D!$R$2<>\"\",CALC.D!$AB$20=2,CALC.D!$F$10<>\"\",CALC.D!$E$64<>\"\"),IF(AND($AV$27=2,CALC.D!$G$59=$BP$26,CALC.D!$F$10=\"4 ou mais\"),\"ou Ligação Coletiva\",0))","v":false},{"$f":"IF(AND(CALC.D!$C$6<>\"\",CALC.D!$G$6<>\"\",CALC.D!$R$2<>\"\",CALC.D!$AB$20=2,CALC.D!$F$10<>\"\",CALC.D!$E$64<>\"\"),IF(AND($AV$27=2,CALC.D!$G$59=$BQ$26,CALC.D!$F$10=\"4 ou mais\"),\"ou Ligação Coletiva\",0))","v":false}]
["TIPO DO CONDUTOR",null,null,null,null,null,null,null,null,null,null,null,null,null,null,null,null,null,null,null,null,null,null,null,null,null,null,null,null,null,null,null,null,null,null,null,null,null,null,null,null,null,null,null,null,null,"POSTE CONCRETO",1,{"$f":"IF(CALC.D!$E$64=TABELAS!A62,VLOOKUP(CALC.D!$F$10,$AV$32:$AX$34,3,FALSE),0)","v":0},5,{"$f":"IF(AND(CALC.D!$C$6<>\"\",CALC.D!$G$6<>\"\",CALC.D!$R$2<>\"\",CALC.D!$AB$20=2,CALC.D!$F$10<>\"\",CALC.D!$E$64<>\"\",CALC.D!$F$10=1,$AV$27=3,CALC.D!$G$59=$AY$26),\"com Caixa TIPO II\",0)","v":0},{"$f":"IF(AND(CALC.D!$C$6<>\"\",CALC.D!$G$6<>\"\",CALC.D!$R$2<>\"\",CALC.D!$AB$20=2,CALC.D!$F$10<>\"\",CALC.D!$E$64<>\"\",CALC.D!$F$10=1,$AV$27=3,CALC.D!$G$59=$AZ$26),\"com Caixa TIPO II\",0)","v":0},{"$f":"IF(AND(CALC.D!$C$6<>\"\",CALC.D!$G$6<>\"\",CALC.D!$R$2<>\"\",CALC.D!$AB$20=2,CALC.D!$F$10<>\"\",CALC.D!$E$64<>\"\",CALC.D!$F$10=1,$AV$27=3,CALC.D!$G$59=$BA$26),\"com Caixa TIPO II\",0)","v":0},{"$f":"IF(AND(CALC.D!$C$6<>\"\",CALC.D!$G$6<>\"\",CALC.D!$R$2<>\"\",CALC.D!$AB$20=2,CALC.D!$F$10<>\"\",CALC.D!$E$64<>\"\",CALC.D!$F$10=1,$AV$27=3,CALC.D!$G$59=$BB$26),\"com Caixa TIPO II\",0)","v":0},{"$f":"IF(AND(CALC.D!$C$6<>\"\",CALC.D!$G$6<>\"\",CALC.D!$R$2<>\"\",CALC.D!$AB$20=2,CALC.D!$F$10<>\"\",CALC.D!$E$64<>\"\",CALC.D!$F$10=1,$AV$27=3,CALC.D!$G$59=$BC$26),\"com Caixa TIPO III\",0)","v":0},{"$f":"IF(AND(CALC.D!$C$6<>\"\",CALC.D!$G$6<>\"\",CALC.D!$R$2<>\"\",CALC.D!$AB$20=2,CALC.D!$F$10<>\"\",CALC.D!$E$64<>\"\",CALC.D!$F$10=1,$AV$27=3,CALC.D!$G$59=$BD$26),\"com Caixa TIPO III\",0)","v":0},{"$f":"IF(AND(CALC.D!$C$6<>\"\",CALC.D!$G$6<>\"\",CALC.D!$R$2<>\"\",CALC.D!$AB$20=2,CALC.D!$F$10<>\"\",CALC.D!$E$64<>\"\",CALC.D!$F$10=1,$AV$27=3,CALC.D!$G$59=$BE$26),\"com Caixa TIPO III\",0)","v":0},{"$f":"IF(AND(CALC.D!$C$6<>\"\",CALC.D!$G$6<>\"\",CALC.D!$R$2<>\"\",CALC.D!$AB$20=2,CALC.D!$F$10<>\"\",CALC.D!$E$64<>\"\",CALC.D!$F$10=1,$AV$27=3,CALC.D!$G$59=$BF$26),\"com Caixa TIPO H\",0)","v":0},{"$f":"IF(AND(CALC.D!$C$6<>\"\",CALC.D!$G$6<>\"\",CALC.D!$R$2<>\"\",CALC.D!$AB$20=2,CALC.D!$F$10<>\"\",CALC.D!$E$64<>\"\",CALC.D!$F$10=1,$AV$27=3,CALC.D!$G$59=$BG$26),\"com Caixa TIPO H\",0)","v":0},{"$f":"IF(AND(CALC.D!$C$6<>\"\",CALC.D!$G$6<>\"\",CALC.D!$R$2<>\"\",CALC.D!$AB$20=2,CALC.D!$F$10<>\"\",CALC.D!$E$64<>\"\",CALC.D!$F$10=1,$AV$27=3,CALC.D!$G$59=$BH$26),\"com Caixa TIPO H\",0)","v":0},5,{"$f":"IF(AND(CALC.D!$C$6<>\"\",CALC.D!$G$6<>\"\",CALC.D!$R$2<>\"\",CALC.D!$AB$20=2,CALC.D!$F$10<>\"\",CALC.D!$E$64<>\"\",CALC.D!$F$10=1,$AV$27=3,CALC.D!$G$59=$AY$26),\"com Caixa TIPO II\",0)","v":0},{"$f":"IF(AND(CALC.D!$C$6<>\"\",CALC.D!$G$6<>\"\",CALC.D!$R$2<>\"\",CALC.D!$AB$20=2,CALC.D!$F$10<>\"\",CALC.D!$E$64<>\"\",CALC.D!$F$10=1,$AV$27=3,CALC.D!$G$59=$AZ$26),\"com Caixa TIPO II\",0)","v":0},{"$f":"IF(AND(CALC.D!$C$6<>\"\",CALC.D!$G$6<>\"\",CALC.D!$R$2<>\"\",CALC.D!$AB$20=2,CALC.D!$F$10<>\"\",CALC.D!$E$64<>\"\",CALC.D!$F$10=1,$AV$27=3,CALC.D!$G$59=$BL$26),\"com Caixa TIPO II\",0)","v":0},{"$f":"IF(AND(CALC.D!$C$6<>\"\",CALC.D!$G$6<>\"\",CALC.D!$R$2<>\"\",CALC.D!$AB$20=2,CALC.D!$F$10<>\"\",CALC.D!$E$64<>\"\",CALC.D!$F$10=1,$AV$27=3,CALC.D!$G$59=$BM$26),\"com Caixa TIPO III\",0)","v":0},{"$f":"IF(AND(CALC.D!$C$6<>\"\",CALC.D!$G$6<>\"\",CALC.D!$R$2<>\"\",CALC.D!$AB$20=2,CALC.D!$F$10<>\"\",CALC.D!$E$64<>\"\",CALC.D!$F$10=1,$AV$27=3,CALC.D!$G$59=$BN$26),\"com Caixa TIPO III\",0)","v":0},{"$f":"IF(AND(CALC.D!$C$6<>\"\",CALC.D!$G$6<>\"\",CALC.D!$R$2<>\"\",CALC.D!$AB$20=2,CALC.D!$F$10<>\"\",CALC.D!$E$64<>\"\",CALC.D!$F$10=1,$AV$27=3,CALC.D!$G$59=$BO$26),\"com Caixa TIPO III\",0)","v":0},{"$f":"IF(AND(CALC.D!$C$6<>\"\",CALC.D!$G$6<>\"\",CALC.D!$R$2<>\"\",CALC.D!$AB$20=2,CALC.D!$F$10<>\"\",CALC.D!$E$64<>\"\",CALC.D!$F$10=1,$AV$27=3,CALC.D!$G$59=$BP$26),\"com Caixa TIPO H\",0)","v":0},{"$f":"IF(AND(CALC.D!$C$6<>\"\",CALC.D!$G$6<>\"\",CALC.D!$R$2<>\"\",CALC.D!$AB$20=2,CALC.D!$F$10<>\"\",CALC.D!$E$64<>\"\",CALC.D!$F$10=1,$AV$27=3,CALC.D!$G$59=$BQ$26),\"com Caixa TIPO H\",0)","v":0}]
["CABO DE COBRE TRADICIONAL – 70º - 750 V",null,null,null,null,null,null,null,null,null,null,1,null,null,null,null,null,null,null,null,null,null,null,null,null,null,null,null,null,null,null,null,null,null,null,null,null,null,null,null,null,null,null,null,null,null,null,2,null,6,{"$f":"IF(AND(CALC.D!$C$6<>\"\",CALC.D!$G$6<>\"\",CALC.D!$R$2<>\"\",CALC.D!$AB$20=2,CALC.D!$F$10<>\"\",CALC.D!$E$64<>\"\",CALC.D!$F$10=2,$AV$27=3,CALC.D!$G$59=$AY$26),\"com Caixa TIPO II\",0)","v":0},{"$f":"IF(AND(CALC.D!$C$6<>\"\",CALC.D!$G$6<>\"\",CALC.D!$R$2<>\"\",CALC.D!$AB$20=2,CALC.D!$F$10<>\"\",CALC.D!$E$64<>\"\",CALC.D!$F$10=2,$AV$27=3,CALC.D!$G$59=$AZ$26),\"com Caixa TIPO II\",0)","v":0},{"$f":"IF(AND(CALC.D!$C$6<>\"\",CALC.D!$G$6<>\"\",CALC.D!$R$2<>\"\",CALC.D!$AB$20=2,CALC.D!$F$10<>\"\",CALC.D!$E$64<>\"\",CALC.D!$F$10=2,$AV$27=3,CALC.D!$G$59=$BA$26),\"com Caixa TIPO II\",0)","v":0},{"$f":"IF(AND(CALC.D!$C$6<>\"\",CALC.D!$G$6<>\"\",CALC.D!$R$2<>\"\",CALC.D!$AB$20=2,CALC.D!$F$10<>\"\",CALC.D!$E$64<>\"\",CALC.D!$F$10=2,$AV$27=3,CALC.D!$G$59=$BB$26),\"com Caixa TIPO II\",0)","v":0},{"$f":"IF(AND(CALC.D!$C$6<>\"\",CALC.D!$G$6<>\"\",CALC.D!$R$2<>\"\",CALC.D!$AB$20=2,CALC.D!$F$10<>\"\",CALC.D!$E$64<>\"\",CALC.D!$F$10=2,$AV$27=3,CALC.D!$G$59=$BC$26),\"com Caixa TIPO III\",0)","v":0},{"$f":"IF(AND(CALC.D!$C$6<>\"\",CALC.D!$G$6<>\"\",CALC.D!$R$2<>\"\",CALC.D!$AB$20=2,CALC.D!$F$10<>\"\",CALC.D!$E$64<>\"\",CALC.D!$F$10=2,$AV$27=3,CALC.D!$G$59=$BD$26),\"com Caixa TIPO III\",0)","v":0},{"$f":"IF(AND(CALC.D!$C$6<>\"\",CALC.D!$G$6<>\"\",CALC.D!$R$2<>\"\",CALC.D!$AB$20=2,CALC.D!$F$10<>\"\",CALC.D!$E$64<>\"\",CALC.D!$F$10=2,$AV$27=3,CALC.D!$G$59=$BE$26),\"com Caixa TIPO III\",0)","v":0},{"$f":"IF(AND(CALC.D!$C$6<>\"\",CALC.D!$G$6<>\"\",CALC.D!$R$2<>\"\",CALC.D!$AB$20=2,CALC.D!$F$10<>\"\",CALC.D!$E$64<>\"\",CALC.D!$F$10=2,$AV$27=3,CALC.D!$G$59=$BF$26),\"com Caixa TIPO H\",0)","v":0},{"$f":"IF(AND(CALC.D!$C$6<>\"\",CALC.D!$G$6<>\"\",CALC.D!$R$2<>\"\",CALC.D!$AB$20=2,CALC.D!$F$10<>\"\",CALC.D!$E$64<>\"\",CALC.D!$F$10=2,$AV$27=3,CALC.D!$G$59=$BG$26),\"com Caixa TIPO H\",0)","v":0},{"$f":"IF(AND(CALC.D!$C$6<>\"\",CALC.D!$G$6<>\"\",CALC.D!$R$2<>\"\",CALC.D!$AB$20=2,CALC.D!$F$10<>\"\",CALC.D!$E$64<>\"\",CALC.D!$F$10=2,$AV$27=3,CALC.D!$G$59=$BH$26),\"com Caixa TIPO H\",0)","v":0},6,{"$f":"IF(AND(CALC.D!$C$6<>\"\",CALC.D!$G$6<>\"\",CALC.D!$R$2<>\"\",CALC.D!$AB$20=2,CALC.D!$F$10<>\"\",CALC.D!$E$64<>\"\",CALC.D!$F$10=2,$AV$27=3,CALC.D!$G$59=$AY$26),\"com Caixa TIPO II\",0)","v":0},{"$f":"IF(AND(CALC.D!$C$6<>\"\",CALC.D!$G$6<>\"\",CALC.D!$R$2<>\"\",CALC.D!$AB$20=2,CALC.D!$F$10<>\"\",CALC.D!$E$64<>\"\",CALC.D!$F$10=2,$AV$27=3,CALC.D!$G$59=$AZ$26),\"com Caixa TIPO II\",0)","v":0},{"$f":"IF(AND(CALC.D!$C$6<>\"\",CALC.D!$G$6<>\"\",CALC.D!$R$2<>\"\",CALC.D!$AB$20=2,CALC.D!$F$10<>\"\",CALC.D!$E$64<>\"\",CALC.D!$F$10=2,$AV$27=3,CALC.D!$G$59=$BL$26),\"com Caixa TIPO II\",0)","v":0},{"$f":"IF(AND(CALC.D!$C$6<>\"\",CALC.D!$G$6<>\"\",CALC.D!$R$2<>\"\",CALC.D!$AB$20=2,CALC.D!$F$10<>\"\",CALC.D!$E$64<>\"\",CALC.D!$F$10=2,$AV$27=3,CALC.D!$G$59=$BM$26),\"com Caixa TIPO III\",0)","v":0},{"$f":"IF(AND(CALC.D!$C$6<>\"\",CALC.D!$G$6<>\"\",CALC.D!$R$2<>\"\",CALC.D!$AB$20=2,CALC.D!$F$10<>\"\",CALC.D!$E$64<>\"\",CALC.D!$F$10=2,$AV$27=3,CALC.D!$G$59=$BN$26),\"com Caixa TIPO III\",0)","v":0},{"$f":"IF(AND(CALC.D!$C$6<>\"\",CALC.D!$G$6<>\"\",CALC.D!$R$2<>\"\",CALC.D!$AB$20=2,CALC.D!$F$10<>\"\",CALC.D!$E$64<>\"\",CALC.D!$F$10=2,$AV$27=3,CALC.D!$G$59=$BO$26),\"com Caixa TIPO III\",0)","v":0},{"$f":"IF(AND(CALC.D!$C$6<>\"\",CALC.D!$G$6<>\"\",CALC.D!$R$2<>\"\",CALC.D!$AB$20=2,CALC.D!$F$10<>\"\",CALC.D!$E$64<>\"\",CALC.D!$F$10=2,$AV$27=3,CALC.D!$G$59=$BP$26),\"ou Ligação Coletiva\",0)","v":0},{"$f":"IF(AND(CALC.D!$C$6<>\"\",CALC.D!$G$6<>\"\",CALC.D!$R$2<>\"\",CALC.D!$AB$20=2,CALC.D!$F$10<>\"\",CALC.D!$E$64<>\"\",CALC.D!$F$10=2,$AV$27=3,CALC.D!$G$59=$BQ$26),\"ou Ligação Coletiva\",0)","v":0}]
["CABO DE COBRE ISOLAÇÃO EPR/XLPE – 90º - 1000 V",null,null,null,null,null,null,null,null,null,null,2,null,null,null,null,null,null,null,null,null,null,null,null,null,null,null,null,null,null,null,null,null,null,null,null,null,null,null,null,null,null,null,null,null,null,null,"4 ou mais",null,8,{"$f":"IF(AND(CALC.D!$C$6<>\"\",CALC.D!$G$6<>\"\",CALC.D!$R$2<>\"\",CALC.D!$AB$20=2,CALC.D!$F$10<>\"\",CALC.D!$E$64<>\"\",CALC.D!$F$10=\"4 ou mais\",$AV$27=3,CALC.D!$G$59=$AY$26),\"ou Ligação Coletiva\",0)","v":0},{"$f":"IF(AND(CALC.D!$C$6<>\"\",CALC.D!$G$6<>\"\",CALC.D!$R$2<>\"\",CALC.D!$AB$20=2,CALC.D!$F$10<>\"\",CALC.D!$E$64<>\"\",CALC.D!$F$10=\"4 ou mais\",$AV$27=3,CALC.D!$G$59=$AZ$26),\"ou Ligação Coletiva\",0)","v":0},{"$f":"IF(AND(CALC.D!$C$6<>\"\",CALC.D!$G$6<>\"\",CALC.D!$R$2<>\"\",CALC.D!$AB$20=2,CALC.D!$F$10<>\"\",CALC.D!$E$64<>\"\",CALC.D!$F$10=\"4 ou mais\",$AV$27=3,CALC.D!$G$59=$BA$26),\"ou Ligação Coletiva\",0)","v":0},{"$f":"IF(AND(CALC.D!$C$6<>\"\",CALC.D!$G$6<>\"\",CALC.D!$R$2<>\"\",CALC.D!$AB$20=2,CALC.D!$F$10<>\"\",CALC.D!$E$64<>\"\",CALC.D!$F$10=\"4 ou mais\",$AV$27=3,CALC.D!$G$59=$BB$26),\"ou Ligação Coletiva\",0)","v":0},{"$f":"IF(AND(CALC.D!$C$6<>\"\",CALC.D!$G$6<>\"\",CALC.D!$R$2<>\"\",CALC.D!$AB$20=2,CALC.D!$F$10<>\"\",CALC.D!$E$64<>\"\",CALC.D!$F$10=\"4 ou mais\",$AV$27=3,CALC.D!$G$59=$BC$26),\"ou Ligação Coletiva\",0)","v":0},{"$f":"IF(AND(CALC.D!$C$6<>\"\",CALC.D!$G$6<>\"\",CALC.D!$R$2<>\"\",CALC.D!$AB$20=2,CALC.D!$F$10<>\"\",CALC.D!$E$64<>\"\",CALC.D!$F$10=\"4 ou mais\",$AV$27=3,CALC.D!$G$59=$BD$26),\"ou Ligação Coletiva\",0)","v":0},{"$f":"IF(AND(CALC.D!$C$6<>\"\",CALC.D!$G$6<>\"\",CALC.D!$R$2<>\"\",CALC.D!$AB$20=2,CALC.D!$F$10<>\"\",CALC.D!$E$64<>\"\",CALC.D!$F$10=\"4 ou mais\",$AV$27=3,CALC.D!$G$59=$BE$26),\"ou Ligação Coletiva\",0)","v":0},{"$f":"IF(AND(CALC.D!$C$6<>\"\",CALC.D!$G$6<>\"\",CALC.D!$R$2<>\"\",CALC.D!$AB$20=2,CALC.D!$F$10<>\"\",CALC.D!$E$64<>\"\",CALC.D!$F$10=\"4 ou mais\",$AV$27=3,CALC.D!$G$59=$BF$26),\"ou Ligação Coletiva\",0)","v":0},{"$f":"IF(AND(CALC.D!$C$6<>\"\",CALC.D!$G$6<>\"\",CALC.D!$R$2<>\"\",CALC.D!$AB$20=2,CALC.D!$F$10<>\"\",CALC.D!$E$64<>\"\",CALC.D!$F$10=\"4 ou mais\",$AV$27=3,CALC.D!$G$59=$BG$26),\"ou Ligação Coletiva\",0)","v":0},{"$f":"IF(AND(CALC.D!$C$6<>\"\",CALC.D!$G$6<>\"\",CALC.D!$R$2<>\"\",CALC.D!$AB$20=2,CALC.D!$F$10<>\"\",CALC.D!$E$64<>\"\",CALC.D!$F$10=\"4 ou mais\",$AV$27=3,CALC.D!$G$59=$BH$26),\"ou Ligação Coletiva\",0)","v":0},8,{"$f":"IF(AND(CALC.D!$C$6<>\"\",CALC.D!$G$6<>\"\",CALC.D!$R$2<>\"\",CALC.D!$AB$20=2,CALC.D!$F$10<>\"\",CALC.D!$E$64<>\"\",CALC.D!$F$10=\"4 ou mais\",$AV$27=3,CALC.D!$G$59=$AY$26),\"ou Ligação Coletiva\",0)","v":0},{"$f":"IF(AND(CALC.D!$C$6<>\"\",CALC.D!$G$6<>\"\",CALC.D!$R$2<>\"\",CALC.D!$AB$20=2,CALC.D!$F$10<>\"\",CALC.D!$E$64<>\"\",CALC.D!$F$10=\"4 ou mais\",$AV$27=3,CALC.D!$G$59=$AZ$26),\"ou Ligação Coletiva\",0)","v":0},{"$f":"IF(AND(CALC.D!$C$6<>\"\",CALC.D!$G$6<>\"\",CALC.D!$R$2<>\"\",CALC.D!$AB$20=2,CALC.D!$F$10<>\"\",CALC.D!$E$64<>\"\",CALC.D!$F$10=\"4 ou mais\",$AV$27=3,CALC.D!$G$59=$BL$26),\"ou Ligação Coletiva\",0)","v":0},{"$f":"IF(AND(CALC.D!$C$6<>\"\",CALC.D!$G$6<>\"\",CALC.D!$R$2<>\"\",CALC.D!$AB$20=2,CALC.D!$F$10<>\"\",CALC.D!$E$64<>\"\",CALC.D!$F$10=\"4 ou mais\",$AV$27=3,CALC.D!$G$59=$BM$26),\"ou Ligação Coletiva\",0)","v":0},{"$f":"IF(AND(CALC.D!$C$6<>\"\",CALC.D!$G$6<>\"\",CALC.D!$R$2<>\"\",CALC.D!$AB$20=2,CALC.D!$F$10<>\"\",CALC.D!$E$64<>\"\",CALC.D!$F$10=\"4 ou mais\",$AV$27=3,CALC.D!$G$59=$BN$26),\"ou Ligação Coletiva\",0)","v":0},{"$f":"IF(AND(CALC.D!$C$6<>\"\",CALC.D!$G$6<>\"\",CALC.D!$R$2<>\"\",CALC.D!$AB$20=2,CALC.D!$F$10<>\"\",CALC.D!$E$64<>\"\",CALC.D!$F$10=\"4 ou mais\",$AV$27=3,CALC.D!$G$59=$BO$26),\"ou Ligação Coletiva\",0)","v":0},{"$f":"IF(AND(CALC.D!$C$6<>\"\",CALC.D!$G$6<>\"\",CALC.D!$R$2<>\"\",CALC.D!$AB$20=2,CALC.D!$F$10<>\"\",CALC.D!$E$64<>\"\",CALC.D!$F$10=\"4 ou mais\",$AV$27=3,CALC.D!$G$59=$BP$26),\"ou Ligação Coletiva\",0)","v":0},{"$f":"IF(AND(CALC.D!$C$6<>\"\",CALC.D!$G$6<>\"\",CALC.D!$R$2<>\"\",CALC.D!$AB$20=2,CALC.D!$F$10<>\"\",CALC.D!$E$64<>\"\",CALC.D!$F$10=\"4 ou mais\",$AV$27=3,CALC.D!$G$59=$BQ$26),\"ou Ligação Coletiva\",0)","v":0}]
["CABO DE ALUMÍNIO MULTIPLEX – ISOLAÇÃO EPR/XLPE",null,null,null,null,null,null,null,null,null,null,3,null,null,null,null,null,null,null,null,null,null,null,null,null,null,null,null,null,null,null,null,null,null,null,null,null,null,null,null,null,null,null,null,null,null,"POSTE METÁLICO",1,{"$f":"IF(CALC.D!$E$64=TABELAS!A63,VLOOKUP(CALC.D!$F$10,$AV$35:$AX$37,3,FALSE),0)","v":0},9,{"$f":"IF(AND(CALC.D!$C$6<>\"\",CALC.D!$G$6<>\"\",CALC.D!$R$2<>\"\",CALC.D!$AB$20=2,CALC.D!$F$10<>\"\",CALC.D!$E$64<>\"\",CALC.D!$F$10=1,$AV$27=4,CALC.D!$G$59=$AY$2),\"com Caixa TIPO II\",0)","v":0},{"$f":"IF(AND(CALC.D!$C$6<>\"\",CALC.D!$G$6<>\"\",CALC.D!$R$2<>\"\",CALC.D!$AB$20=2,CALC.D!$F$10<>\"\",CALC.D!$E$64<>\"\",CALC.D!$F$10=1,$AV$27=4,CALC.D!$G$59=$AZ$26),\"com Caixa TIPO II\",0)","v":0},{"$f":"IF(AND(CALC.D!$C$6<>\"\",CALC.D!$G$6<>\"\",CALC.D!$R$2<>\"\",CALC.D!$AB$20=2,CALC.D!$F$10<>\"\",CALC.D!$E$64<>\"\",CALC.D!$F$10=1,$AV$27=4,CALC.D!$G$59=$BA$26),\"com Caixa TIPO II\",0)","v":0},{"$f":"IF(AND(CALC.D!$C$6<>\"\",CALC.D!$G$6<>\"\",CALC.D!$R$2<>\"\",CALC.D!$AB$20=2,CALC.D!$F$10<>\"\",CALC.D!$E$64<>\"\",CALC.D!$F$10=1,$AV$27=4,CALC.D!$G$59=$BB$26),\"com Caixa TIPO II\",0)","v":0},{"$f":"IF(AND(CALC.D!$C$6<>\"\",CALC.D!$G$6<>\"\",CALC.D!$R$2<>\"\",CALC.D!$AB$20=2,CALC.D!$F$10<>\"\",CALC.D!$E$64<>\"\",CALC.D!$F$10=1,$AV$27=4,CALC.D!$G$59=$BC$26),\"com Caixa TIPO III\",0)","v":0},{"$f":"IF(AND(CALC.D!$C$6<>\"\",CALC.D!$G$6<>\"\",CALC.D!$R$2<>\"\",CALC.D!$AB$20=2,CALC.D!$F$10<>\"\",CALC.D!$E$64<>\"\",CALC.D!$F$10=1,$AV$27=4,CALC.D!$G$59=$BD$26),\"com Caixa TIPO III\",0)","v":0},{"$f":"IF(AND(CALC.D!$C$6<>\"\",CALC.D!$G$6<>\"\",CALC.D!$R$2<>\"\",CALC.D!$AB$20=2,CALC.D!$F$10<>\"\",CALC.D!$E$64<>\"\",CALC.D!$F$10=1,$AV$27=4,CALC.D!$G$59=$BE$26),\"com Caixa TIPO III\",0)","v":0},{"$f":"IF(AND(CALC.D!$C$6<>\"\",CALC.D!$G$6<>\"\",CALC.D!$R$2<>\"\",CALC.D!$AB$20=2,CALC.D!$F$10<>\"\",CALC.D!$E$64<>\"\",CALC.D!$F$10=1,$AV$27=4,CALC.D!$G$59=$BF$26),\"CATEGORIA SOLICITADA\",0)","v":0},{"$f":"IF(AND(CALC.D!$C$6<>\"\",CALC.D!$G$6<>\"\",CALC.D!$R$2<>\"\",CALC.D!$AB$20=2,CALC.D!$F$10<>\"\",CALC.D!$E$64<>\"\",CALC.D!$F$10=1,$AV$27=4,CALC.D!$G$59=$BG$26),\"CATEGORIA SOLICITADA\",0)","v":0},{"$f":"IF(AND(CALC.D!$C$6<>\"\",CALC.D!$G$6<>\"\",CALC.D!$R$2<>\"\",CALC.D!$AB$20=2,CALC.D!$F$10<>\"\",CALC.D!$E$64<>\"\",CALC.D!$F$10=1,$AV$27=4,CALC.D!$G$59=$BH$26),\"CATEGORIA SOLICITADA\",0)","v":0},9,{"$f":"IF(AND(CALC.D!$C$6<>\"\",CALC.D!$G$6<>\"\",CALC.D!$R$2<>\"\",CALC.D!$AB$20=2,CALC.D!$F$10<>\"\",CALC.D!$E$64<>\"\",CALC.D!$F$10=1,$AV$27=4,CALC.D!$G$59=$AY$2),\"com Caixa TIPO II\",0)","v":0},{"$f":"IF(AND(CALC.D!$C$6<>\"\",CALC.D!$G$6<>\"\",CALC.D!$R$2<>\"\",CALC.D!$AB$20=2,CALC.D!$F$10<>\"\",CALC.D!$E$64<>\"\",CALC.D!$F$10=1,$AV$27=4,CALC.D!$G$59=$AZ$26),\"com Caixa TIPO II\",0)","v":0},{"$f":"IF(AND(CALC.D!$C$6<>\"\",CALC.D!$G$6<>\"\",CALC.D!$R$2<>\"\",CALC.D!$AB$20=2,CALC.D!$F$10<>\"\",CALC.D!$E$64<>\"\",CALC.D!$F$10=1,$AV$27=4,CALC.D!$G$59=$BL$26),\"com Caixa TIPO II\",0)","v":0},{"$f":"IF(AND(CALC.D!$C$6<>\"\",CALC.D!$G$6<>\"\",CALC.D!$R$2<>\"\",CALC.D!$AB$20=2,CALC.D!$F$10<>\"\",CALC.D!$E$64<>\"\",CALC.D!$F$10=1,$AV$27=4,CALC.D!$G$59=$BM$26),\"com Caixa TIPO III\",0)","v":0},{"$f":"IF(AND(CALC.D!$C$6<>\"\",CALC.D!$G$6<>\"\",CALC.D!$R$2<>\"\",CALC.D!$AB$20=2,CALC.D!$F$10<>\"\",CALC.D!$E$64<>\"\",CALC.D!$F$10=1,$AV$27=4,CALC.D!$G$59=$BN$26),\"com Caixa TIPO III\",0)","v":0},{"$f":"IF(AND(CALC.D!$C$6<>\"\",CALC.D!$G$6<>\"\",CALC.D!$R$2<>\"\",CALC.D!$AB$20=2,CALC.D!$F$10<>\"\",CALC.D!$E$64<>\"\",CALC.D!$F$10=1,$AV$27=4,CALC.D!$G$59=$BO$26),\"com Caixa TIPO III\",0)","v":0},{"$f":"IF(AND(CALC.D!$C$6<>\"\",CALC.D!$G$6<>\"\",CALC.D!$R$2<>\"\",CALC.D!$AB$20=2,CALC.D!$F$10<>\"\",CALC.D!$E$64<>\"\",CALC.D!$F$10=1,$AV$27=4,CALC.D!$G$59=$BP$26),\"\",0)","v":0},{"$f":"IF(AND(CALC.D!$C$6<>\"\",CALC.D!$G$6<>\"\",CALC.D!$R$2<>\"\",CALC.D!$AB$20=2,CALC.D!$F$10<>\"\",CALC.D!$E$64<>\"\",CALC.D!$F$10=1,$AV$27=4,CALC.D!$G$59=$BQ$26),\"\",0)","v":0}]
[null,null,null,null,null,null,null,null,null,null,null,null,null,null,null,null,null,null,null,null,null,null,null,null,null,null,null,null,null,null,null,null,null,null,null,null,null,null,null,null,null,null,null,null,null,null,null,2,null,10,{"$f":"IF(AND(CALC.D!$C$6<>\"\",CALC.D!$G$6<>\"\",CALC.D!$R$2<>\"\",CALC.D!$AB$20=2,CALC.D!$F$10<>\"\",CALC.D!$E$64<>\"\",CALC.D!$F$10=2,$AV$27=4,CALC.D!$G$59=$AY$26),\"com Caixa TIPO II\",0)","v":0},{"$f":"IF(AND(CALC.D!$C$6<>\"\",CALC.D!$G$6<>\"\",CALC.D!$R$2<>\"\",CALC.D!$AB$20=2,CALC.D!$F$10<>\"\",CALC.D!$E$64<>\"\",CALC.D!$F$10=2,$AV$27=4,CALC.D!$G$59=$AZ$26),\"com Caixa TIPO II\",0)","v":0},{"$f":"IF(AND(CALC.D!$C$6<>\"\",CALC.D!$G$6<>\"\",CALC.D!$R$2<>\"\",CALC.D!$AB$20=2,CALC.D!$F$10<>\"\",CALC.D!$E$64<>\"\",CALC.D!$F$10=2,$AV$27=4,CALC.D!$G$59=$BA$26),\"com Caixa TIPO II\",0)","v":0},{"$f":"IF(AND(CALC.D!$C$6<>\"\",CALC.D!$G$6<>\"\",CALC.D!$R$2<>\"\",CALC.D!$AB$20=2,CALC.D!$F$10<>\"\",CALC.D!$E$64<>\"\",CALC.D!$F$10=2,$AV$27=4,CALC.D!$G$59=$BB$26),\"com Caixa TIPO II\",0)","v":0},{"$f":"IF(AND(CALC.D!$C$6<>\"\",CALC.D!$G$6<>\"\",CALC.D!$R$2<>\"\",CALC.D!$AB$20=2,CALC.D!$F$10<>\"\",CALC.D!$E$64<>\"\",CALC.D!$F$10=2,$AV$27=4,CALC.D!$G$59=$BC$26),\"com Caixa TIPO III\",0)","v":0},{"$f":"IF(AND(CALC.D!$C$6<>\"\",CALC.D!$G$6<>\"\",CALC.D!$R$2<>\"\",CALC.D!$AB$20=2,CALC.D!$F$10<>\"\",CALC.D!$E$64<>\"\",CALC.D!$F$10=2,$AV$27=4,CALC.D!$G$59=$BD$26),\"com Caixa TIPO III\",0)","v":0},{"$f":"IF(AND(CALC.D!$C$6<>\"\",CALC.D!$G$6<>\"\",CALC.D!$R$2<>\"\",CALC.D!$AB$20=2,CALC.D!$F$10<>\"\",CALC.D!$E$64<>\"\",CALC.D!$F$10=2,$AV$27=4,CALC.D!$G$59=$BE$26),\"com Caixa TIPO III\",0)","v":0},{"$f":"IF(AND(CALC.D!$C$6<>\"\",CALC.D!$G$6<>\"\",CALC.D!$R$2<>\"\",CALC.D!$AB$20=2,CALC.D!$F$10<>\"\",CALC.D!$E$64<>\"\",CALC.D!$F$10=2,$AV$27=4,CALC.D!$G$59=$BF$26),\"CATEGORIA SOLICITADA\",0)","v":0},{"$f":"IF(AND(CALC.D!$C$6<>\"\",CALC.D!$G$6<>\"\",CALC.D!$R$2<>\"\",CALC.D!$AB$20=2,CALC.D!$F$10<>\"\",CALC.D!$E$64<>\"\",CALC.D!$F$10=2,$AV$27=4,CALC.D!$G$59=$BG$26),\"CATEGORIA SOLICITADA\",0)","v":0},{"$f":"IF(AND(CALC.D!$C$6<>\"\",CALC.D!$G$6<>\"\",CALC.D!$R$2<>\"\",CALC.D!$AB$20=2,CALC.D!$F$10<>\"\",CALC.D!$E$64<>\"\",CALC.D!$F$10=2,$AV$27=4,CALC.D!$G$59=$BH$26),\"CATEGORIA SOLICITADA\",0)","v":0},10,{"$f":"IF(AND(CALC.D!$C$6<>\"\",CALC.D!$G$6<>\"\",CALC.D!$R$2<>\"\",CALC.D!$AB$20=2,CALC.D!$F$10<>\"\",CALC.D!$E$64<>\"\",CALC.D!$F$10=2,$AV$27=4,CALC.D!$G$59=$AY$26),\"com Caixa TIPO II\",0)","v":0},{"$f":"IF(AND(CALC.D!$C$6<>\"\",CALC.D!$G$6<>\"\",CALC.D!$R$2<>\"\",CALC.D!$AB$20=2,CALC.D!$F$10<>\"\",CALC.D!$E$64<>\"\",CALC.D!$F$10=2,$AV$27=4,CALC.D!$G$59=$AZ$26),\"com Caixa TIPO II\",0)","v":0},{"$f":"IF(AND(CALC.D!$C$6<>\"\",CALC.D!$G$6<>\"\",CALC.D!$R$2<>\"\",CALC.D!$AB$20=2,CALC.D!$F$10<>\"\",CALC.D!$E$64<>\"\",CALC.D!$F$10=2,$AV$27=4,CALC.D!$G$59=$BL$26),\"com Caixa TIPO II\",0)","v":0},{"$f":"IF(AND(CALC.D!$C$6<>\"\",CALC.D!$G$6<>\"\",CALC.D!$R$2<>\"\",CALC.D!$AB$20=2,CALC.D!$F$10<>\"\",CALC.D!$E$64<>\"\",CALC.D!$F$10=2,$AV$27=4,CALC.D!$G$59=$BM$26),\"com Caixa TIPO III\",0)","v":0},{"$f":"IF(AND(CALC.D!$C$6<>\"\",CALC.D!$G$6<>\"\",CALC.D!$R$2<>\"\",CALC.D!$AB$20=2,CALC.D!$F$10<>\"\",CALC.D!$E$64<>\"\",CALC.D!$F$10=2,$AV$27=4,CALC.D!$G$59=$BN$26),\"com Caixa TIPO III\",0)","v":0},{"$f":"IF(AND(CALC.D!$C$6<>\"\",CALC.D!$G$6<>\"\",CALC.D!$R$2<>\"\",CALC.D!$AB$20=2,CALC.D!$F$10<>\"\",CALC.D!$E$64<>\"\",CALC.D!$F$10=2,$AV$27=4,CALC.D!$G$59=$BO$26),\"com Caixa TIPO III\",0)","v":0},{"$f":"IF(AND(CALC.D!$C$6<>\"\",CALC.D!$G$6<>\"\",CALC.D!$R$2<>\"\",CALC.D!$AB$20=2,CALC.D!$F$10<>\"\",CALC.D!$E$64<>\"\",CALC.D!$F$10=2,$AV$27=4,CALC.D!$G$59=$BP$26),\"\",0)","v":0},{"$f":"IF(AND(CALC.D!$C$6<>\"\",CALC.D!$G$6<>\"\",CALC.D!$R$2<>\"\",CALC.D!$AB$20=2,CALC.D!$F$10<>\"\",CALC.D!$E$64<>\"\",CALC.D!$F$10=2,$AV$27=4,CALC.D!$G$59=$BQ$26),\"\",0)","v":0}]
[null,null,null,null,null,null,null,null,null,null,null,null,null,null,null,null,null,null,null,null,null,null,null,null,null,null,null,null,null,null,null,null,null,null,null,null,null,null,null,null,null,null,null,null,null,null,null,"4 ou mais",null,12,{"$f":"IF(AND(CALC.D!$C$6<>\"\",CALC.D!$G$6<>\"\",CALC.D!$R$2<>\"\",CALC.D!$AB$20=2,CALC.D!$F$10<>\"\",CALC.D!$E$64<>\"\",CALC.D!$F$10=\"4 ou mais\",$AV$27=4,CALC.D!$G$59=$AY$26),\"ou Ligação Coletiva\",0)","v":0},{"$f":"IF(AND(CALC.D!$C$6<>\"\",CALC.D!$G$6<>\"\",CALC.D!$R$2<>\"\",CALC.D!$AB$20=2,CALC.D!$F$10<>\"\",CALC.D!$E$64<>\"\",CALC.D!$F$10=\"4 ou mais\",$AV$27=4,CALC.D!$G$59=$AZ$26),\"ou Ligação Coletiva\",0)","v":0},{"$f":"IF(AND(CALC.D!$C$6<>\"\",CALC.D!$G$6<>\"\",CALC.D!$R$2<>\"\",CALC.D!$AB$20=2,CALC.D!$F$10<>\"\",CALC.D!$E$64<>\"\",CALC.D!$F$10=\"4 ou mais\",$AV$27=4,CALC.D!$G$59=$BA$26),\"ou Ligação Coletiva\",0)","v":0},{"$f":"IF(AND(CALC.D!$C$6<>\"\",CALC.D!$G$6<>\"\",CALC.D!$R$2<>\"\",CALC.D!$AB$20=2,CALC.D!$F$10<>\"\",CALC.D!$E$64<>\"\",CALC.D!$F$10=\"4 ou mais\",$AV$27=4,CALC.D!$G$59=$BB$26),\"ou Ligação Coletiva\",0)","v":0},{"$f":"IF(AND(CALC.D!$C$6<>\"\",CALC.D!$G$6<>\"\",CALC.D!$R$2<>\"\",CALC.D!$AB$20=2,CALC.D!$F$10<>\"\",CALC.D!$E$64<>\"\",CALC.D!$F$10=\"4 ou mais\",$AV$27=4,CALC.D!$G$59=$BC$26),\"ou Ligação Coletiva\",0)","v":0},{"$f":"IF(AND(CALC.D!$C$6<>\"\",CALC.D!$G$6<>\"\",CALC.D!$R$2<>\"\",CALC.D!$AB$20=2,CALC.D!$F$10<>\"\",CALC.D!$E$64<>\"\",CALC.D!$F$10=\"4 ou mais\",$AV$27=4,CALC.D!$G$59=$BD$26),\"ou Ligação Coletiva\",0)","v":0},{"$f":"IF(AND(CALC.D!$C$6<>\"\",CALC.D!$G$6<>\"\",CALC.D!$R$2<>\"\",CALC.D!$AB$20=2,CALC.D!$F$10<>\"\",CALC.D!$E$64<>\"\",CALC.D!$F$10=\"4 ou mais\",$AV$27=4,CALC.D!$G$59=$BE$26),\"ou Ligação Coletiva\",0)","v":0},{"$f":"IF(AND(CALC.D!$C$6<>\"\",CALC.D!$G$6<>\"\",CALC.D!$R$2<>\"\",CALC.D!$AB$20=2,CALC.D!$F$10<>\"\",CALC.D!$E$64<>\"\",CALC.D!$F$10=\"4 ou mais\",$AV$27=4,CALC.D!$G$59=$BF$26),\"\",0)","v":0},{"$f":"IF(AND(CALC.D!$C$6<>\"\",CALC.D!$G$6<>\"\",CALC.D!$R$2<>\"\",CALC.D!$AB$20=2,CALC.D!$F$10<>\"\",CALC.D!$E$64<>\"\",CALC.D!$F$10=\"4 ou mais\",$AV$27=4,CALC.D!$G$59=$BG$26),\"\",0)","v":0},{"$f":"IF(AND(CALC.D!$C$6<>\"\",CALC.D!$G$6<>\"\",CALC.D!$R$2<>\"\",CALC.D!$AB$20=2,CALC.D!$F$10<>\"\",CALC.D!$E$64<>\"\",CALC.D!$F$10=\"4 ou mais\",$AV$27=4,CALC.D!$G$59=$BH$26),\"\",0)","v":0},12,{"$f":"IF(AND(CALC.D!$C$6<>\"\",CALC.D!$G$6<>\"\",CALC.D!$R$2<>\"\",CALC.D!$AB$20=2,CALC.D!$F$10<>\"\",CALC.D!$E$64<>\"\",CALC.D!$F$10=\"4 ou mais\",$AV$27=4,CALC.D!$G$59=$AY$26),\"ou Ligação Coletiva\",0)","v":0},{"$f":"IF(AND(CALC.D!$C$6<>\"\",CALC.D!$G$6<>\"\",CALC.D!$R$2<>\"\",CALC.D!$AB$20=2,CALC.D!$F$10<>\"\",CALC.D!$E$64<>\"\",CALC.D!$F$10=\"4 ou mais\",$AV$27=4,CALC.D!$G$59=$AZ$26),\"ou Ligação Coletiva\",0)","v":0},{"$f":"IF(AND(CALC.D!$C$6<>\"\",CALC.D!$G$6<>\"\",CALC.D!$R$2<>\"\",CALC.D!$AB$20=2,CALC.D!$F$10<>\"\",CALC.D!$E$64<>\"\",CALC.D!$F$10=\"4 ou mais\",$AV$27=4,CALC.D!$G$59=$BL$26),\"ou Ligação Coletiva\",0)","v":0},{"$f":"IF(AND(CALC.D!$C$6<>\"\",CALC.D!$G$6<>\"\",CALC.D!$R$2<>\"\",CALC.D!$AB$20=2,CALC.D!$F$10<>\"\",CALC.D!$E$64<>\"\",CALC.D!$F$10=\"4 ou mais\",$AV$27=4,CALC.D!$G$59=$BM$26),\"ou Ligação Coletiva\",0)","v":0},{"$f":"IF(AND(CALC.D!$C$6<>\"\",CALC.D!$G$6<>\"\",CALC.D!$R$2<>\"\",CALC.D!$AB$20=2,CALC.D!$F$10<>\"\",CALC.D!$E$64<>\"\",CALC.D!$F$10=\"4 ou mais\",$AV$27=4,CALC.D!$G$59=$BN$26),\"ou Ligação Coletiva\",0)","v":0},{"$f":"IF(AND(CALC.D!$C$6<>\"\",CALC.D!$G$6<>\"\",CALC.D!$R$2<>\"\",CALC.D!$AB$20=2,CALC.D!$F$10<>\"\",CALC.D!$E$64<>\"\",CALC.D!$F$10=\"4 ou mais\",$AV$27=4,CALC.D!$G$59=$BO$26),\"ou Ligação Coletiva\",0)","v":0},{"$f":"IF(AND(CALC.D!$C$6<>\"\",CALC.D!$G$6<>\"\",CALC.D!$R$2<>\"\",CALC.D!$AB$20=2,CALC.D!$F$10<>\"\",CALC.D!$E$64<>\"\",CALC.D!$F$10=\"4 ou mais\",$AV$27=4,CALC.D!$G$59=$BP$26),\"\",0)","v":0},{"$f":"IF(AND(CALC.D!$C$6<>\"\",CALC.D!$G$6<>\"\",CALC.D!$R$2<>\"\",CALC.D!$AB$20=2,CALC.D!$F$10<>\"\",CALC.D!$E$64<>\"\",CALC.D!$F$10=\"4 ou mais\",$AV$27=4,CALC.D!$G$59=$BQ$26),\"\",0)","v":0}]
["DADOS FINAL DA PLANILHA",null,null,null,null,null,null,null,null,null,null,null,null,null,null,null,null,null,null,null,null,null,null,null,null,null,null,null,null,null,null,null,null,null,null,null,null,null,null,null,null,null,null,null,null,null,"POSTE FIBRA DE VIDRO",1,{"$f":"IF(CALC.D!$E$64=TABELAS!A64,VLOOKUP(CALC.D!$F$10,$AV$38:$AX$39,3,FALSE),0)","v":0},13,{"$f":"IF(AND(CALC.D!$C$6<>\"\",CALC.D!$G$6<>\"\",CALC.D!$R$2<>\"\",CALC.D!$AB$20=2,CALC.D!$F$10<>\"\",CALC.D!$E$64<>\"\",CALC.D!$F$10=1,$AV$27=5,CALC.D!$G$59=$AY$26),\"com Caixa TIPO II\",0)","v":0},{"$f":"IF(AND(CALC.D!$C$6<>\"\",CALC.D!$G$6<>\"\",CALC.D!$R$2<>\"\",CALC.D!$AB$20=2,CALC.D!$F$10<>\"\",CALC.D!$E$64<>\"\",CALC.D!$F$10=1,$AV$27=5,CALC.D!$G$59=$AZ$26),\"com Caixa TIPO II\",0)","v":0},{"$f":"IF(AND(CALC.D!$C$6<>\"\",CALC.D!$G$6<>\"\",CALC.D!$R$2<>\"\",CALC.D!$AB$20=2,CALC.D!$F$10<>\"\",CALC.D!$E$64<>\"\",CALC.D!$F$10=1,$AV$27=5,CALC.D!$G$59=$BA$26),\"com Caixa TIPO II\",0)","v":0},{"$f":"IF(AND(CALC.D!$C$6<>\"\",CALC.D!$G$6<>\"\",CALC.D!$R$2<>\"\",CALC.D!$AB$20=2,CALC.D!$F$10<>\"\",CALC.D!$E$64<>\"\",CALC.D!$F$10=1,$AV$27=5,CALC.D!$G$59=$BB$26),\"com Caixa TIPO II\",0)","v":0},{"$f":"IF(AND(CALC.D!$C$6<>\"\",CALC.D!$G$6<>\"\",CALC.D!$R$2<>\"\",CALC.D!$AB$20=2,CALC.D!$F$10<>\"\",CALC.D!$E$64<>\"\",CALC.D!$F$10=1,$AV$27=5,CALC.D!$G$59=$BC$26),\"com Caixa TIPO III\",0)","v":0},{"$f":"IF(AND(CALC.D!$C$6<>\"\",CALC.D!$G$6<>\"\",CALC.D!$R$2<>\"\",CALC.D!$AB$20=2,CALC.D!$F$10<>\"\",CALC.D!$E$64<>\"\",CALC.D!$F$10=1,$AV$27=5,CALC.D!$G$59=$BD$26),\"com Caixa TIPO III\",0)","v":0},{"$f":"IF(AND(CALC.D!$C$6<>\"\",CALC.D!$G$6<>\"\",CALC.D!$R$2<>\"\",CALC.D!$AB$20=2,CALC.D!$F$10<>\"\",CALC.D!$E$64<>\"\",CALC.D!$F$10=1,$AV$27=5,CALC.D!$G$59=$BE$26),\"com Caixa TIPO III\",0)","v":0},{"$f":"IF(AND(CALC.D!$C$6<>\"\",CALC.D!$G$6<>\"\",CALC.D!$R$2<>\"\",CALC.D!$AB$20=2,CALC.D!$F$10<>\"\",CALC.D!$E$64<>\"\",CALC.D!$F$10=1,$AV$27=5,CALC.D!$G$59=$BF$26),\"com Caixa TIPO H\",0)","v":0},{"$f":"IF(AND(CALC.D!$C$6<>\"\",CALC.D!$G$6<>\"\",CALC.D!$R$2<>\"\",CALC.D!$AB$20=2,CALC.D!$F$10<>\"\",CALC.D!$E$64<>\"\",CALC.D!$F$10=1,$AV$27=5,CALC.D!$G$59=$BG$26),\"com Caixa TIPO H\",0)","v":0},{"$f":"IF(AND(CALC.D!$C$6<>\"\",CALC.D!$G$6<>\"\",CALC.D!$R$2<>\"\",CALC.D!$AB$20=2,CALC.D!$F$10<>\"\",CALC.D!$E$64<>\"\",CALC.D!$F$10=1,$AV$27=5,CALC.D!$G$59=$BH$26),\"com Caixa TIPO H\",0)","v":0},13,{"$f":"IF(AND(CALC.D!$C$6<>\"\",CALC.D!$G$6<>\"\",CALC.D!$R$2<>\"\",CALC.D!$AB$20=2,CALC.D!$F$10<>\"\",CALC.D!$E$64<>\"\",CALC.D!$F$10=1,$AV$27=5,CALC.D!$G$59=$AY$26),\"com Caixa TIPO II\",0)","v":0},{"$f":"IF(AND(CALC.D!$C$6<>\"\",CALC.D!$G$6<>\"\",CALC.D!$R$2<>\"\",CALC.D!$AB$20=2,CALC.D!$F$10<>\"\",CALC.D!$E$64<>\"\",CALC.D!$F$10=1,$AV$27=5,CALC.D!$G$59=$AZ$26),\"com Caixa TIPO II\",0)","v":0},{"$f":"IF(AND(CALC.D!$C$6<>\"\",CALC.D!$G$6<>\"\",CALC.D!$R$2<>\"\",CALC.D!$AB$20=2,CALC.D!$F$10<>\"\",CALC.D!$E$64<>\"\",CALC.D!$F$10=1,$AV$27=5,CALC.D!$G$59=$BL$26),\"com Caixa TIPO II\",0)","v":0},{"$f":"IF(AND(CALC.D!$C$6<>\"\",CALC.D!$G$6<>\"\",CALC.D!$R$2<>\"\",CALC.D!$AB$20=2,CALC.D!$F$10<>\"\",CALC.D!$E$64<>\"\",CALC.D!$F$10=1,$AV$27=5,CALC.D!$G$59=$BM$26),\"com Caixa TIPO III\",0)","v":0},{"$f":"IF(AND(CALC.D!$C$6<>\"\",CALC.D!$G$6<>\"\",CALC.D!$R$2<>\"\",CALC.D!$AB$20=2,CALC.D!$F$10<>\"\",CALC.D!$E$64<>\"\",CALC.D!$F$10=1,$AV$27=5,CALC.D!$G$59=$BN$26),\"com Caixa TIPO III\",0)","v":0},{"$f":"IF(AND(CALC.D!$C$6<>\"\",CALC.D!$G$6<>\"\",CALC.D!$R$2<>\"\",CALC.D!$AB$20=2,CALC.D!$F$10<>\"\",CALC.D!$E$64<>\"\",CALC.D!$F$10=1,$AV$27=5,CALC.D!$G$59=$BO$26),\"com Caixa TIPO III\",0)","v":0},{"$f":"IF(AND(CALC.D!$C$6<>\"\",CALC.D!$G$6<>\"\",CALC.D!$R$2<>\"\",CALC.D!$AB$20=2,CALC.D!$F$10<>\"\",CALC.D!$E$64<>\"\",CALC.D!$F$10=1,$AV$27=5,CALC.D!$G$59=$BP$26),\"com Caixa TIPO H\",0)","v":0},{"$f":"IF(AND(CALC.D!$C$6<>\"\",CALC.D!$G$6<>\"\",CALC.D!$R$2<>\"\",CALC.D!$AB$20=2,CALC.D!$F$10<>\"\",CALC.D!$E$64<>\"\",CALC.D!$F$10=1,$AV$27=5,CALC.D!$G$59=$BQ$26),\"com Caixa TIPO H\",0)","v":0}]
[null,null,null,null,null,null,null,null,null,null,null,null,null,null,null,null,null,null,null,null,null,null,null,null,null,null,null,null,null,null,null,null,null,null,null,null,null,null,null,null,null,null,null,null,null,null,null,"4 ou mais",null,16,{"$f":"IF(AND(CALC.D!$C$6<>\"\",CALC.D!$G$6<>\"\",CALC.D!$R$2<>\"\",CALC.D!$AB$20=2,CALC.D!$F$10<>\"\",CALC.D!$E$64<>\"\",CALC.D!$F$10=\"4 ou mais\",$AV$27=5,CALC.D!$G$59=$AY$26),\"ou Ligação Coletiva\",0)","v":0},{"$f":"IF(AND(CALC.D!$C$6<>\"\",CALC.D!$G$6<>\"\",CALC.D!$R$2<>\"\",CALC.D!$AB$20=2,CALC.D!$F$10<>\"\",CALC.D!$E$64<>\"\",CALC.D!$F$10=\"4 ou mais\",$AV$27=5,CALC.D!$G$59=$AZ$26),\"ou Ligação Coletiva\",0)","v":0},{"$f":"IF(AND(CALC.D!$C$6<>\"\",CALC.D!$G$6<>\"\",CALC.D!$R$2<>\"\",CALC.D!$AB$20=2,CALC.D!$F$10<>\"\",CALC.D!$E$64<>\"\",CALC.D!$F$10=\"4 ou mais\",$AV$27=5,CALC.D!$G$59=$BA$26),\"ou Ligação Coletiva\",0)","v":0},{"$f":"IF(AND(CALC.D!$C$6<>\"\",CALC.D!$G$6<>\"\",CALC.D!$R$2<>\"\",CALC.D!$AB$20=2,CALC.D!$F$10<>\"\",CALC.D!$E$64<>\"\",CALC.D!$F$10=\"4 ou mais\",$AV$27=5,CALC.D!$G$59=$BB$26),\"ou Ligação Coletiva\",0)","v":0},{"$f":"IF(AND(CALC.D!$C$6<>\"\",CALC.D!$G$6<>\"\",CALC.D!$R$2<>\"\",CALC.D!$AB$20=2,CALC.D!$F$10<>\"\",CALC.D!$E$64<>\"\",CALC.D!$F$10=\"4 ou mais\",$AV$27=5,CALC.D!$G$59=$BC$26),\"ou Ligação Coletiva\",0)","v":0},{"$f":"IF(AND(CALC.D!$C$6<>\"\",CALC.D!$G$6<>\"\",CALC.D!$R$2<>\"\",CALC.D!$AB$20=2,CALC.D!$F$10<>\"\",CALC.D!$E$64<>\"\",CALC.D!$F$10=\"4 ou mais\",$AV$27=5,CALC.D!$G$59=$BD$26),\"ou Ligação Coletiva\",0)","v":0},{"$f":"IF(AND(CALC.D!$C$6<>\"\",CALC.D!$G$6<>\"\",CALC.D!$R$2<>\"\",CALC.D!$AB$20=2,CALC.D!$F$10<>\"\",CALC.D!$E$64<>\"\",CALC.D!$F$10=\"4 ou mais\",$AV$27=5,CALC.D!$G$59=$BE$26),\"ou Ligação Coletiva\",0)","v":0},{"$f":"IF(AND(CALC.D!$C$6<>\"\",CALC.D!$G$6<>\"\",CALC.D!$R$2<>\"\",CALC.D!$AB$20=2,CALC.D!$F$10<>\"\",CALC.D!$E$64<>\"\",CALC.D!$F$10=\"4 ou mais\",$AV$27=5,CALC.D!$G$59=$BF$26),\"ou Ligação Coletiva\",0)","v":0},{"$f":"IF(AND(CALC.D!$C$6<>\"\",CALC.D!$G$6<>\"\",CALC.D!$R$2<>\"\",CALC.D!$AB$20=2,CALC.D!$F$10<>\"\",CALC.D!$E$64<>\"\",CALC.D!$F$10=\"4 ou mais\",$AV$27=5,CALC.D!$G$59=$BG$26),\"ou Ligação Coletiva\",0)","v":0},{"$f":"IF(AND(CALC.D!$C$6<>\"\",CALC.D!$G$6<>\"\",CALC.D!$R$2<>\"\",CALC.D!$AB$20=2,CALC.D!$F$10<>\"\",CALC.D!$E$64<>\"\",CALC.D!$F$10=\"4 ou mais\",$AV$27=5,CALC.D!$G$59=$BH$26),\"ou Ligação Coletiva\",0)","v":0},16,{"$f":"IF(AND(CALC.D!$C$6<>\"\",CALC.D!$G$6<>\"\",CALC.D!$R$2<>\"\",CALC.D!$AB$20=2,CALC.D!$F$10<>\"\",CALC.D!$E$64<>\"\",CALC.D!$F$10=\"4 ou mais\",$AV$27=5,CALC.D!$G$59=$AY$26),\"ou Ligação Coletiva\",0)","v":0},{"$f":"IF(AND(CALC.D!$C$6<>\"\",CALC.D!$G$6<>\"\",CALC.D!$R$2<>\"\",CALC.D!$AB$20=2,CALC.D!$F$10<>\"\",CALC.D!$E$64<>\"\",CALC.D!$F$10=\"4 ou mais\",$AV$27=5,CALC.D!$G$59=$AZ$26),\"ou Ligação Coletiva\",0)","v":0},{"$f":"IF(AND(CALC.D!$C$6<>\"\",CALC.D!$G$6<>\"\",CALC.D!$R$2<>\"\",CALC.D!$AB$20=2,CALC.D!$F$10<>\"\",CALC.D!$E$64<>\"\",CALC.D!$F$10=\"4 ou mais\",$AV$27=5,CALC.D!$G$59=$BL$26),\"ou Ligação Coletiva\",0)","v":0},{"$f":"IF(AND(CALC.D!$C$6<>\"\",CALC.D!$G$6<>\"\",CALC.D!$R$2<>\"\",CALC.D!$AB$20=2,CALC.D!$F$10<>\"\",CALC.D!$E$64<>\"\",CALC.D!$F$10=\"4 ou mais\",$AV$27=5,CALC.D!$G$59=$BM$26),\"ou Ligação Coletiva\",0)","v":0},{"$f":"IF(AND(CALC.D!$C$6<>\"\",CALC.D!$G$6<>\"\",CALC.D!$R$2<>\"\",CALC.D!$AB$20=2,CALC.D!$F$10<>\"\",CALC.D!$E$64<>\"\",CALC.D!$F$10=\"4 ou mais\",$AV$27=5,CALC.D!$G$59=$BN$26),\"ou Ligação Coletiva\",0)","v":0},{"$f":"IF(AND(CALC.D!$C$6<>\"\",CALC.D!$G$6<>\"\",CALC.D!$R$2<>\"\",CALC.D!$AB$20=2,CALC.D!$F$10<>\"\",CALC.D!$E$64<>\"\",CALC.D!$F$10=\"4 ou mais\",$AV$27=5,CALC.D!$G$59=$BO$26),\"ou Ligação Coletiva\",0)","v":0},{"$f":"IF(AND(CALC.D!$C$6<>\"\",CALC.D!$G$6<>\"\",CALC.D!$R$2<>\"\",CALC.D!$AB$20=2,CALC.D!$F$10<>\"\",CALC.D!$E$64<>\"\",CALC.D!$F$10=\"4 ou mais\",$AV$27=5,CALC.D!$G$59=$BP$26),\"ou Ligação Coletiva\",0)","v":0},{"$f":"IF(AND(CALC.D!$C$6<>\"\",CALC.D!$G$6<>\"\",CALC.D!$R$2<>\"\",CALC.D!$AB$20=2,CALC.D!$F$10<>\"\",CALC.D!$E$64<>\"\",CALC.D!$F$10=\"4 ou mais\",$AV$27=5,CALC.D!$G$59=$BQ$26),\"ou Ligação Coletiva\",0)","v":0}]
[null,null,null,null,null,null,null,null,null,null,null,null,null,null,null,null,null,null,null,null,null,null,null,null,null,null,null,null,null,null,null,null,null,null,null,null,null,null,null,null,null,null,null,null,null,null,"PONTALETE",1,{"$f":"IF(CALC.D!$E$64=TABELAS!A65,VLOOKUP(CALC.D!$F$10,$AV$40:$AX$41,3,FALSE),0)","v":0},17,{"$f":"IF(AND(CALC.D!$C$6<>\"\",CALC.D!$G$6<>\"\",CALC.D!$R$2<>\"\",CALC.D!$AB$20=2,CALC.D!$F$10<>\"\",CALC.D!$E$64<>\"\",CALC.D!$F$10=1,$AV$27=6,CALC.D!$G$59=$AY$26),\"com Caixa TIPO II\",0)","v":0},{"$f":"IF(AND(CALC.D!$C$6<>\"\",CALC.D!$G$6<>\"\",CALC.D!$R$2<>\"\",CALC.D!$AB$20=2,CALC.D!$F$10<>\"\",CALC.D!$E$64<>\"\",CALC.D!$F$10=1,$AV$27=6,CALC.D!$G$59=$AZ$26),\"com Caixa TIPO II\",0)","v":0},{"$f":"IF(AND(CALC.D!$C$6<>\"\",CALC.D!$G$6<>\"\",CALC.D!$R$2<>\"\",CALC.D!$AB$20=2,CALC.D!$F$10<>\"\",CALC.D!$E$64<>\"\",CALC.D!$F$10=1,$AV$27=6,CALC.D!$G$59=$BA$26),\"com Caixa TIPO II\",0)","v":0},{"$f":"IF(AND(CALC.D!$C$6<>\"\",CALC.D!$G$6<>\"\",CALC.D!$R$2<>\"\",CALC.D!$AB$20=2,CALC.D!$F$10<>\"\",CALC.D!$E$64<>\"\",CALC.D!$F$10=1,$AV$27=6,CALC.D!$G$59=$BB$26),\"com Caixa TIPO II\",0)","v":0},{"$f":"IF(AND(CALC.D!$C$6<>\"\",CALC.D!$G$6<>\"\",CALC.D!$R$2<>\"\",CALC.D!$AB$20=2,CALC.D!$F$10<>\"\",CALC.D!$E$64<>\"\",CALC.D!$F$10=1,$AV$27=6,CALC.D!$G$59=$BC$26),\"com Caixa TIPO III\",0)","v":0},{"$f":"IF(AND(CALC.D!$C$6<>\"\",CALC.D!$G$6<>\"\",CALC.D!$R$2<>\"\",CALC.D!$AB$20=2,CALC.D!$F$10<>\"\",CALC.D!$E$64<>\"\",CALC.D!$F$10=1,$AV$27=6,CALC.D!$G$59=$BD$26),\"CATEGORIA CALCULADA\",0)","v":0},{"$f":"IF(AND(CALC.D!$C$6<>\"\",CALC.D!$G$6<>\"\",CALC.D!$R$2<>\"\",CALC.D!$AB$20=2,CALC.D!$F$10<>\"\",CALC.D!$E$64<>\"\",CALC.D!$F$10=1,$AV$27=6,CALC.D!$G$59=$BE$26),\"CATEGORIA CALCULADA\",0)","v":0},{"$f":"IF(AND(CALC.D!$C$6<>\"\",CALC.D!$G$6<>\"\",CALC.D!$R$2<>\"\",CALC.D!$AB$20=2,CALC.D!$F$10<>\"\",CALC.D!$E$64<>\"\",CALC.D!$F$10=1,$AV$27=6,CALC.D!$G$59=$BF$26),\"CATEGORIA CALCULADA\",0)","v":0},{"$f":"IF(AND(CALC.D!$C$6<>\"\",CALC.D!$G$6<>\"\",CALC.D!$R$2<>\"\",CALC.D!$AB$20=2,CALC.D!$F$10<>\"\",CALC.D!$E$64<>\"\",CALC.D!$F$10=1,$AV$27=6,CALC.D!$G$59=$BG$26),\"CATEGORIA CALCULADA\",0)","v":0},{"$f":"IF(AND(CALC.D!$C$6<>\"\",CALC.D!$G$6<>\"\",CALC.D!$R$2<>\"\",CALC.D!$AB$20=2,CALC.D!$F$10<>\"\",CALC.D!$E$64<>\"\",CALC.D!$F$10=1,$AV$27=6,CALC.D!$G$59=$BH$26),\"CATEGORIA CALCULADA\",0)","v":0},17,{"$f":"IF(AND(CALC.D!$C$6<>\"\",CALC.D!$G$6<>\"\",CALC.D!$R$2<>\"\",CALC.D!$AB$20=2,CALC.D!$F$10<>\"\",CALC.D!$E$64<>\"\",CALC.D!$F$10=1,$AV$27=6,CALC.D!$G$59=$AY$26),\"com Caixa TIPO II\",0)","v":0},{"$f":"IF(AND(CALC.D!$C$6<>\"\",CALC.D!$G$6<>\"\",CALC.D!$R$2<>\"\",CALC.D!$AB$20=2,CALC.D!$F$10<>\"\",CALC.D!$E$64<>\"\",CALC.D!$F$10=1,$AV$27=6,CALC.D!$G$59=$AZ$26),\"com Caixa TIPO II\",0)","v":0},{"$f":"IF(AND(CALC.D!$C$6<>\"\",CALC.D!$G$6<>\"\",CALC.D!$R$2<>\"\",CALC.D!$AB$20=2,CALC.D!$F$10<>\"\",CALC.D!$E$64<>\"\",CALC.D!$F$10=1,$AV$27=6,CALC.D!$G$59=$BL$26),\"com Caixa TIPO II\",0)","v":0},{"$f":"IF(AND(CALC.D!$C$6<>\"\",CALC.D!$G$6<>\"\",CALC.D!$R$2<>\"\",CALC.D!$AB$20=2,CALC.D!$F$10<>\"\",CALC.D!$E$64<>\"\",CALC.D!$F$10=1,$AV$27=6,CALC.D!$G$59=$BM$26),\"com Caixa TIPO III\",0)","v":0},{"$f":"IF(AND(CALC.D!$C$6<>\"\",CALC.D!$G$6<>\"\",CALC.D!$R$2<>\"\",CALC.D!$AB$20=2,CALC.D!$F$10<>\"\",CALC.D!$E$64<>\"\",CALC.D!$F$10=1,$AV$27=6,CALC.D!$G$59=$BN$26),\"com Caixa TIPO III\",0)","v":0},{"$f":"IF(AND(CALC.D!$C$6<>\"\",CALC.D!$G$6<>\"\",CALC.D!$R$2<>\"\",CALC.D!$AB$20=2,CALC.D!$F$10<>\"\",CALC.D!$E$64<>\"\",CALC.D!$F$10=1,$AV$27=6,CALC.D!$G$59=$BO$26),\"com Caixa TIPO III\",0)","v":0},{"$f":"IF(AND(CALC.D!$C$6<>\"\",CALC.D!$G$6<>\"\",CALC.D!$R$2<>\"\",CALC.D!$AB$20=2,CALC.D!$F$10<>\"\",CALC.D!$E$64<>\"\",CALC.D!$F$10=1,$AV$27=6,CALC.D!$G$59=$BP$26),\"com Caixa TIPO H\",0)","v":0},{"$f":"IF(AND(CALC.D!$C$6<>\"\",CALC.D!$G$6<>\"\",CALC.D!$R$2<>\"\",CALC.D!$AB$20=2,CALC.D!$F$10<>\"\",CALC.D!$E$64<>\"\",CALC.D!$F$10=1,$AV$27=6,CALC.D!$G$59=$BQ$26),\"com Caixa TIPO H\",0)","v":0}]
["INFORMAÇÃO DE - TABELA APLICADA",null,null,null,null,null,null,null,null,null,null,null,null,null,null,null,null,null,null,null,null,null,null,null,null,null,null,null,null,null,null,null,null,null,null,null,null,null,null,null,null,null,null,null,null,null,null,"4 ou mais",null,20,{"$f":"IF(AND(CALC.D!$C$6<>\"\",CALC.D!$G$6<>\"\",CALC.D!$R$2<>\"\",CALC.D!$AB$20=2,CALC.D!$F$10<>\"\",CALC.D!$E$64<>\"\",CALC.D!$F$10=\"4 ou mais\",$AV$27=6,CALC.D!$G$59=$AY$26),\"ou Ligação Coletiva\",0)","v":0},{"$f":"IF(AND(CALC.D!$C$6<>\"\",CALC.D!$G$6<>\"\",CALC.D!$R$2<>\"\",CALC.D!$AB$20=2,CALC.D!$F$10<>\"\",CALC.D!$E$64<>\"\",CALC.D!$F$10=\"4 ou mais\",$AV$27=6,CALC.D!$G$59=$AZ$26),\"ou Ligação Coletiva\",0)","v":0},{"$f":"IF(AND(CALC.D!$C$6<>\"\",CALC.D!$G$6<>\"\",CALC.D!$R$2<>\"\",CALC.D!$AB$20=2,CALC.D!$F$10<>\"\",CALC.D!$E$64<>\"\",CALC.D!$F$10=\"4 ou mais\",$AV$27=6,CALC.D!$G$59=$BA$26),\"ou Ligação Coletiva\",0)","v":0},{"$f":"IF(AND(CALC.D!$C$6<>\"\",CALC.D!$G$6<>\"\",CALC.D!$R$2<>\"\",CALC.D!$AB$20=2,CALC.D!$F$10<>\"\",CALC.D!$E$64<>\"\",CALC.D!$F$10=\"4 ou mais\",$AV$27=6,CALC.D!$G$59=$BB$26),\"ou Ligação Coletiva\",0)","v":0},{"$f":"IF(AND(CALC.D!$C$6<>\"\",CALC.D!$G$6<>\"\",CALC.D!$R$2<>\"\",CALC.D!$AB$20=2,CALC.D!$F$10<>\"\",CALC.D!$E$64<>\"\",CALC.D!$F$10=\"4 ou mais\",$AV$27=6,CALC.D!$G$59=$BC$26),\"ou Ligação Coletiva\",0)","v":0},{"$f":"IF(AND(CALC.D!$C$6<>\"\",CALC.D!$G$6<>\"\",CALC.D!$R$2<>\"\",CALC.D!$AB$20=2,CALC.D!$F$10<>\"\",CALC.D!$E$64<>\"\",CALC.D!$F$10=\"4 ou mais\",$AV$27=6,CALC.D!$G$59=$BD$26),\"ou Ligação Coletiva\",0)","v":0},{"$f":"IF(AND(CALC.D!$C$6<>\"\",CALC.D!$G$6<>\"\",CALC.D!$R$2<>\"\",CALC.D!$AB$20=2,CALC.D!$F$10<>\"\",CALC.D!$E$64<>\"\",CALC.D!$F$10=\"4 ou mais\",$AV$27=6,CALC.D!$G$59=$BE$26),\"ou Ligação Coletiva\",0)","v":0},{"$f":"IF(AND(CALC.D!$C$6<>\"\",CALC.D!$G$6<>\"\",CALC.D!$R$2<>\"\",CALC.D!$AB$20=2,CALC.D!$F$10<>\"\",CALC.D!$E$64<>\"\",CALC.D!$F$10=\"4 ou mais\",$AV$27=6,CALC.D!$G$59=$BF$26),\"ou Ligação Coletiva\",0)","v":0},{"$f":"IF(AND(CALC.D!$C$6<>\"\",CALC.D!$G$6<>\"\",CALC.D!$R$2<>\"\",CALC.D!$AB$20=2,CALC.D!$F$10<>\"\",CALC.D!$E$64<>\"\",CALC.D!$F$10=\"4 ou mais\",$AV$27=6,CALC.D!$G$59=$BG$26),\"ou Ligação Coletiva\",0)","v":0},{"$f":"IF(AND(CALC.D!$C$6<>\"\",CALC.D!$G$6<>\"\",CALC.D!$R$2<>\"\",CALC.D!$AB$20=2,CALC.D!$F$10<>\"\",CALC.D!$E$64<>\"\",CALC.D!$F$10=\"4 ou mais\",$AV$27=6,CALC.D!$G$59=$BH$26),\"ou Ligação Coletiva\",0)","v":0},20,{"$f":"IF(AND(CALC.D!$C$6<>\"\",CALC.D!$G$6<>\"\",CALC.D!$R$2<>\"\",CALC.D!$AB$20=2,CALC.D!$F$10<>\"\",CALC.D!$E$64<>\"\",CALC.D!$F$10=\"4 ou mais\",$AV$27=6,CALC.D!$G$59=$AY$26),\"ou Ligação Coletiva\",0)","v":0},{"$f":"IF(AND(CALC.D!$C$6<>\"\",CALC.D!$G$6<>\"\",CALC.D!$R$2<>\"\",CALC.D!$AB$20=2,CALC.D!$F$10<>\"\",CALC.D!$E$64<>\"\",CALC.D!$F$10=\"4 ou mais\",$AV$27=6,CALC.D!$G$59=$AZ$26),\"ou Ligação Coletiva\",0)","v":0},{"$f":"IF(AND(CALC.D!$C$6<>\"\",CALC.D!$G$6<>\"\",CALC.D!$R$2<>\"\",CALC.D!$AB$20=2,CALC.D!$F$10<>\"\",CALC.D!$E$64<>\"\",CALC.D!$F$10=\"4 ou mais\",$AV$27=6,CALC.D!$G$59=$BL$26),\"ou Ligação Coletiva\",0)","v":0},{"$f":"IF(AND(CALC.D!$C$6<>\"\",CALC.D!$G$6<>\"\",CALC.D!$R$2<>\"\",CALC.D!$AB$20=2,CALC.D!$F$10<>\"\",CALC.D!$E$64<>\"\",CALC.D!$F$10=\"4 ou mais\",$AV$27=6,CALC.D!$G$59=$BM$26),\"ou Ligação Coletiva\",0)","v":0},{"$f":"IF(AND(CALC.D!$C$6<>\"\",CALC.D!$G$6<>\"\",CALC.D!$R$2<>\"\",CALC.D!$AB$20=2,CALC.D!$F$10<>\"\",CALC.D!$E$64<>\"\",CALC.D!$F$10=\"4 ou mais\",$AV$27=6,CALC.D!$G$59=$BN$26),\"ou Ligação Coletiva\",0)","v":0},{"$f":"IF(AND(CALC.D!$C$6<>\"\",CALC.D!$G$6<>\"\",CALC.D!$R$2<>\"\",CALC.D!$AB$20=2,CALC.D!$F$10<>\"\",CALC.D!$E$64<>\"\",CALC.D!$F$10=\"4 ou mais\",$AV$27=6,CALC.D!$G$59=$BO$26),\"ou Ligação Coletiva\",0)","v":0},{"$f":"IF(AND(CALC.D!$C$6<>\"\",CALC.D!$G$6<>\"\",CALC.D!$R$2<>\"\",CALC.D!$AB$20=2,CALC.D!$F$10<>\"\",CALC.D!$E$64<>\"\",CALC.D!$F$10=\"4 ou mais\",$AV$27=6,CALC.D!$G$59=$BP$26),\"ou Ligação Coletiva\",0)","v":0},{"$f":"IF(AND(CALC.D!$C$6<>\"\",CALC.D!$G$6<>\"\",CALC.D!$R$2<>\"\",CALC.D!$AB$20=2,CALC.D!$F$10<>\"\",CALC.D!$E$64<>\"\",CALC.D!$F$10=\"4 ou mais\",$AV$27=6,CALC.D!$G$59=$BQ$26),\"ou Ligação Coletiva\",0)","v":0}]
[null,null,null,null,"NORMA CPFL",null,null,null,null,"NORMA CERIM",null,null,null,null,null,null,null,null,"TAB. 1A","TAB. 1C",null,null,null,null,null,null,null,null,null,null,null,null,null,null,null,null,null,null,null,null,null,null,null,null,null,null,"COLUNA CONSTRUIDA",1,{"$f":"IF(CALC.D!$E$64=TABELAS!A66,VLOOKUP(CALC.D!$F$10,$AV$42:$AX$45,3,FALSE),0)","v":0},21,{"$f":"IF(AND(CALC.D!$C$6<>\"\",CALC.D!$G$6<>\"\",CALC.D!$R$2<>\"\",CALC.D!$AB$20=2,CALC.D!$F$10<>\"\",CALC.D!$E$64<>\"\",CALC.D!$F$10=1,$AV$27=7,CALC.D!$G$59=$AY$26),\"USAR CAIXA TIPO II\",0)","v":0},{"$f":"IF(AND(CALC.D!$C$6<>\"\",CALC.D!$G$6<>\"\",CALC.D!$R$2<>\"\",CALC.D!$AB$20=2,CALC.D!$F$10<>\"\",CALC.D!$E$64<>\"\",CALC.D!$F$10=1,$AV$27=7,CALC.D!$G$59=$AZ$26),\"USAR CAIXA TIPO II\",0)","v":0},{"$f":"IF(AND(CALC.D!$C$6<>\"\",CALC.D!$G$6<>\"\",CALC.D!$R$2<>\"\",CALC.D!$AB$20=2,CALC.D!$F$10<>\"\",CALC.D!$E$64<>\"\",CALC.D!$F$10=1,$AV$27=7,CALC.D!$G$59=$BA$26),\"USAR CAIXA TIPO II\",0)","v":0},{"$f":"IF(AND(CALC.D!$C$6<>\"\",CALC.D!$G$6<>\"\",CALC.D!$R$2<>\"\",CALC.D!$AB$20=2,CALC.D!$F$10<>\"\",CALC.D!$E$64<>\"\",CALC.D!$F$10=1,$AV$27=7,CALC.D!$G$59=$BB$26),\"USAR CAIXA TIPO II\",0)","v":0},{"$f":"IF(AND(CALC.D!$C$6<>\"\",CALC.D!$G$6<>\"\",CALC.D!$R$2<>\"\",CALC.D!$AB$20=2,CALC.D!$F$10<>\"\",CALC.D!$E$64<>\"\",CALC.D!$F$10=1,$AV$27=7,CALC.D!$G$59=$BC$26),\"USAR CAIXA TIPO III\",0)","v":0},{"$f":"IF(AND(CALC.D!$C$6<>\"\",CALC.D!$G$6<>\"\",CALC.D!$R$2<>\"\",CALC.D!$AB$20=2,CALC.D!$F$10<>\"\",CALC.D!$E$64<>\"\",CALC.D!$F$10=1,$AV$27=7,CALC.D!$G$59=$BD$26),\"USAR CAIXA TIPO III\",0)","v":0},{"$f":"IF(AND(CALC.D!$C$6<>\"\",CALC.D!$G$6<>\"\",CALC.D!$R$2<>\"\",CALC.D!$AB$20=2,CALC.D!$F$10<>\"\",CALC.D!$E$64<>\"\",CALC.D!$F$10=1,$AV$27=7,CALC.D!$G$59=$BE$26),\"USAR CAIXA TIPO III\",0)","v":0},{"$f":"IF(AND(CALC.D!$C$6<>\"\",CALC.D!$G$6<>\"\",CALC.D!$R$2<>\"\",CALC.D!$AB$20=2,CALC.D!$F$10<>\"\",CALC.D!$E$64<>\"\",CALC.D!$F$10=1,$AV$27=7,CALC.D!$G$59=$BF$26),\"USAR CAIXA TIPO H\",0)","v":0},{"$f":"IF(AND(CALC.D!$C$6<>\"\",CALC.D!$G$6<>\"\",CALC.D!$R$2<>\"\",CALC.D!$AB$20=2,CALC.D!$F$10<>\"\",CALC.D!$E$64<>\"\",CALC.D!$F$10=1,$AV$27=7,CALC.D!$G$59=$BG$26),\"USAR CAIXA TIPO H\",0)","v":0},{"$f":"IF(AND(CALC.D!$C$6<>\"\",CALC.D!$G$6<>\"\",CALC.D!$R$2<>\"\",CALC.D!$AB$20=2,CALC.D!$F$10<>\"\",CALC.D!$E$64<>\"\",CALC.D!$F$10=1,$AV$27=7,CALC.D!$G$59=$BH$26),\"USAR CAIXA TIPO H\",0)","v":0},21,{"$f":"IF(AND(CALC.D!$C$6<>\"\",CALC.D!$G$6<>\"\",CALC.D!$R$2<>\"\",CALC.D!$AB$20=2,CALC.D!$F$10<>\"\",CALC.D!$E$64<>\"\",CALC.D!$F$10=1,$AV$27=8,CALC.D!$G$59=$BP$26),\"RESPONSABILIDADE TÉCNICA (ART/RRT/TRT) DA PARTE CIVIL\",0)","v":0},{"$f":"IF(AND(CALC.D!$C$6<>\"\",CALC.D!$G$6<>\"\",CALC.D!$R$2<>\"\",CALC.D!$AB$20=2,CALC.D!$F$10<>\"\",CALC.D!$E$64<>\"\",CALC.D!$F$10=1,$AV$27=7,CALC.D!$G$59=$AZ$26),\"USAR CAIXA TIPO II\",0)","v":0},{"$f":"IF(AND(CALC.D!$C$6<>\"\",CALC.D!$G$6<>\"\",CALC.D!$R$2<>\"\",CALC.D!$AB$20=2,CALC.D!$F$10<>\"\",CALC.D!$E$64<>\"\",CALC.D!$F$10=1,$AV$27=7,CALC.D!$G$59=$BL$26),\"USAR CAIXA TIPO II\",0)","v":0},{"$f":"IF(AND(CALC.D!$C$6<>\"\",CALC.D!$G$6<>\"\",CALC.D!$R$2<>\"\",CALC.D!$AB$20=2,CALC.D!$F$10<>\"\",CALC.D!$E$64<>\"\",CALC.D!$F$10=1,$AV$27=7,CALC.D!$G$59=$BM$26),\"USAR CAIXA TIPO II\",0)","v":0},{"$f":"IF(AND(CALC.D!$C$6<>\"\",CALC.D!$G$6<>\"\",CALC.D!$R$2<>\"\",CALC.D!$AB$20=2,CALC.D!$F$10<>\"\",CALC.D!$E$64<>\"\",CALC.D!$F$10=1,$AV$27=7,CALC.D!$G$59=$BN$26),\"USAR CAIXA TIPO III\",0)","v":0},{"$f":"IF(AND(CALC.D!$C$6<>\"\",CALC.D!$G$6<>\"\",CALC.D!$R$2<>\"\",CALC.D!$AB$20=2,CALC.D!$F$10<>\"\",CALC.D!$E$64<>\"\",CALC.D!$F$10=1,$AV$27=7,CALC.D!$G$59=$BO$26),\"USAR CAIXA TIPO III\",0)","v":0},{"$f":"IF(AND(CALC.D!$C$6<>\"\",CALC.D!$G$6<>\"\",CALC.D!$R$2<>\"\",CALC.D!$AB$20=2,CALC.D!$F$10<>\"\",CALC.D!$E$64<>\"\",CALC.D!$F$10=1,$AV$27=7,CALC.D!$G$59=$BP$26),\"USAR CAIXA TIPO III\",0)","v":0},{"$f":"IF(AND(CALC.D!$C$6<>\"\",CALC.D!$G$6<>\"\",CALC.D!$R$2<>\"\",CALC.D!$AB$20=2,CALC.D!$F$10<>\"\",CALC.D!$E$64<>\"\",CALC.D!$F$10=1,$AV$27=7,CALC.D!$G$59=$BQ$26),\"USAR CAIXA TIPO H\",0)","v":0}]
["CONDUTOR","TENSÃO","ANCORAGEM","NORMA","TAB. 1A","TAB. 1B","TAB. 1C","TAB. 1C","TAB. 1D","TAB. 9 (220)","TAB. 9 (380)",null,"RESULTADO",null,null,null,null,null,"CABOS PVC","CABOS PVC",null,null,null,null,null,null,null,null,null,null,null,null,null,null,null,null,null,null,null,null,null,null,null,null,null,null,null,2,null,22,{"$f":"IF(AND(CALC.D!$C$6<>\"\",CALC.D!$G$6<>\"\",CALC.D!$R$2<>\"\",CALC.D!$AB$20=2,CALC.D!$F$10<>\"\",CALC.D!$E$64<>\"\",CALC.D!$F$10=2,$AV$27=7,CALC.D!$G$59=$AY$26),\"USAR CAIXA TIPO II\",0)","v":0},{"$f":"IF(AND(CALC.D!$C$6<>\"\",CALC.D!$G$6<>\"\",CALC.D!$R$2<>\"\",CALC.D!$AB$20=2,CALC.D!$F$10<>\"\",CALC.D!$E$64<>\"\",CALC.D!$F$10=2,$AV$27=7,CALC.D!$G$59=$AZ$26),\"USAR CAIXA TIPO II\",0)","v":0},{"$f":"IF(AND(CALC.D!$C$6<>\"\",CALC.D!$G$6<>\"\",CALC.D!$R$2<>\"\",CALC.D!$AB$20=2,CALC.D!$F$10<>\"\",CALC.D!$E$64<>\"\",CALC.D!$F$10=2,$AV$27=7,CALC.D!$G$59=$BA$26),\"USAR CAIXA TIPO II\",0)","v":0},{"$f":"IF(AND(CALC.D!$C$6<>\"\",CALC.D!$G$6<>\"\",CALC.D!$R$2<>\"\",CALC.D!$AB$20=2,CALC.D!$F$10<>\"\",CALC.D!$E$64<>\"\",CALC.D!$F$10=2,$AV$27=7,CALC.D!$G$59=$BB$26),\"USAR CAIXA TIPO II\",0)","v":0},{"$f":"IF(AND(CALC.D!$C$6<>\"\",CALC.D!$G$6<>\"\",CALC.D!$R$2<>\"\",CALC.D!$AB$20=2,CALC.D!$F$10<>\"\",CALC.D!$E$64<>\"\",CALC.D!$F$10=2,$AV$27=7,CALC.D!$G$59=$BC$26),\"USAR CAIXA TIPO III\",0)","v":0},{"$f":"IF(AND(CALC.D!$C$6<>\"\",CALC.D!$G$6<>\"\",CALC.D!$R$2<>\"\",CALC.D!$AB$20=2,CALC.D!$F$10<>\"\",CALC.D!$E$64<>\"\",CALC.D!$F$10=2,$AV$27=7,CALC.D!$G$59=$BD$26),\"USAR CAIXA TIPO III\",0)","v":0},{"$f":"IF(AND(CALC.D!$C$6<>\"\",CALC.D!$G$6<>\"\",CALC.D!$R$2<>\"\",CALC.D!$AB$20=2,CALC.D!$F$10<>\"\",CALC.D!$E$64<>\"\",CALC.D!$F$10=2,$AV$27=7,CALC.D!$G$59=$BE$26),\"USAR CAIXA TIPO III\",0)","v":0},{"$f":"IF(AND(CALC.D!$C$6<>\"\",CALC.D!$G$6<>\"\",CALC.D!$R$2<>\"\",CALC.D!$AB$20=2,CALC.D!$F$10<>\"\",CALC.D!$E$64<>\"\",CALC.D!$F$10=2,$AV$27=7,CALC.D!$G$59=$BF$26),\"USAR CAIXA TIPO H\",0)","v":0},{"$f":"IF(AND(CALC.D!$C$6<>\"\",CALC.D!$G$6<>\"\",CALC.D!$R$2<>\"\",CALC.D!$AB$20=2,CALC.D!$F$10<>\"\",CALC.D!$E$64<>\"\",CALC.D!$F$10=2,$AV$27=7,CALC.D!$G$59=$BG$26),\"USAR CAIXA TIPO H\",0)","v":0},{"$f":"IF(AND(CALC.D!$C$6<>\"\",CALC.D!$G$6<>\"\",CALC.D!$R$2<>\"\",CALC.D!$AB$20=2,CALC.D!$F$10<>\"\",CALC.D!$E$64<>\"\",CALC.D!$F$10=2,$AV$27=7,CALC.D!$G$59=$BH$26),\"USAR CAIXA TIPO H\",0)","v":0},22,{"$f":"IF(AND(CALC.D!$C$6<>\"\",CALC.D!$G$6<>\"\",CALC.D!$R$2<>\"\",CALC.D!$AB$20=2,CALC.D!$F$10<>\"\",CALC.D!$E$64<>\"\",CALC.D!$F$10=2,$AV$27=7,CALC.D!$G$59=$AY$26),\"RESPONSABILIDADE TÉCNICA (ART/RRT/TRT) DA PARTE CIVIL\",0)","v":0},{"$f":"IF(AND(CALC.D!$C$6<>\"\",CALC.D!$G$6<>\"\",CALC.D!$R$2<>\"\",CALC.D!$AB$20=2,CALC.D!$F$10<>\"\",CALC.D!$E$64<>\"\",CALC.D!$F$10=2,$AV$27=7,CALC.D!$G$59=$AZ$26),\"USAR CAIXA TIPO II\",0)","v":0},{"$f":"IF(AND(CALC.D!$C$6<>\"\",CALC.D!$G$6<>\"\",CALC.D!$R$2<>\"\",CALC.D!$AB$20=2,CALC.D!$F$10<>\"\",CALC.D!$E$64<>\"\",CALC.D!$F$10=2,$AV$27=7,CALC.D!$G$59=$BL$26),\"USAR CAIXA TIPO II\",0)","v":0},{"$f":"IF(AND(CALC.D!$C$6<>\"\",CALC.D!$G$6<>\"\",CALC.D!$R$2<>\"\",CALC.D!$AB$20=2,CALC.D!$F$10<>\"\",CALC.D!$E$64<>\"\",CALC.D!$F$10=2,$AV$27=7,CALC.D!$G$59=$BM$26),\"USAR CAIXA TIPO II\",0)","v":0},{"$f":"IF(AND(CALC.D!$C$6<>\"\",CALC.D!$G$6<>\"\",CALC.D!$R$2<>\"\",CALC.D!$AB$20=2,CALC.D!$F$10<>\"\",CALC.D!$E$64<>\"\",CALC.D!$F$10=2,$AV$27=7,CALC.D!$G$59=$BN$26),\"USAR CAIXA TIPO III\",0)","v":0},{"$f":"IF(AND(CALC.D!$C$6<>\"\",CALC.D!$G$6<>\"\",CALC.D!$R$2<>\"\",CALC.D!$AB$20=2,CALC.D!$F$10<>\"\",CALC.D!$E$64<>\"\",CALC.D!$F$10=2,$AV$27=7,CALC.D!$G$59=$BO$26),\"USAR CAIXA TIPO III\",0)","v":0},{"$f":"IF(AND(CALC.D!$C$6<>\"\",CALC.D!$G$6<>\"\",CALC.D!$R$2<>\"\",CALC.D!$AB$20=2,CALC.D!$F$10<>\"\",CALC.D!$E$64<>\"\",CALC.D!$F$10=2,$AV$27=7,CALC.D!$G$59=$BP$26),\"USAR CAIXA TIPO III\",0)","v":0},{"$f":"IF(AND(CALC.D!$C$6<>\"\",CALC.D!$G$6<>\"\",CALC.D!$R$2<>\"\",CALC.D!$AB$20=2,CALC.D!$F$10<>\"\",CALC.D!$E$64<>\"\",CALC.D!$F$10=2,$AV$27=7,CALC.D!$G$59=$BQ$26),\"USAR CAIXA TIPO H\",0)","v":0}]
[{"$f":"IF(CALC.D!B15<>\"\",CALC.D!AB16,0)","v":0},{"$f":"IF(CALC.D!AB15=0,1,IF(CALC.D!AB15=1,2))","v":1},{"$f":"IF(AND(CALC.D!AB20<>\"\",CALC.D!E64<>\"\"),CALC.D!AB8,\"\")","v":""},{"$f":"CALC.D!AB20","v":2},{"$f":"IF(AND(A44<>\"\",B44<>\"\",C44<>\"\",D44<>\"\"),IF(AND(A44=1,B44=1,OR(C44=2,C44=6,C44=7,C44=8),D44=2),1,0),\"\")","v":""},{"$f":"IF(AND(A44<>\"\",B44<>\"\",C44<>\"\",D44<>\"\"),IF(AND(A44=1,B44=2,OR(C44=3,C44=6),D44=2),1,0),\"\")","v":""},{"$f":"IF(AND(A44<>\"\",B44<>\"\",C44<>\"\",D44<>\"\"),IF(AND(A44=1,B44=1,OR(C44=3,C44=4,C44=6),D44=2),1,0),\"\")","v":""},{"$f":"IF(AND(A44<>\"\",B44<>\"\",C44<>\"\",D44<>\"\"),IF(AND(A44=2,B44=1,D44=2),1,0),\"\")","v":""},{"$f":"IF(AND(A44<>\"\",B44<>\"\",C44<>\"\",D44<>\"\"),IF(AND(A44=3,B44=1,D44=2),1,0),\"\")","v":""},{"$f":"IF(AND(A44<>\"\",B44<>\"\",C44<>\"\",D44<>\"\"),IF(AND(A44=1,B44=1,OR(C44=1,C44=2,C44=3,C44=4,C44=5,C44=6),D44=1),1,0),\"\")","v":""},{"$f":"IF(AND(A44<>\"\",B44<>\"\",C44<>\"\",D44<>\"\"),IF(AND(A44=1,B44=2,OR(C44=1,C44=2,C44=3,C44=4,C44=5,C44=6),D44=1),1,0),\"\")","v":""},"VINC.",{"$f":"IF(L45=1,\"NORMA GED13 CPFL - TABELA 1A\",IF(L45=2,\"NORMA GED13 CPFL - TABELA 1B\",IF(L45=3,\"NORMA GED13 CPFL - TABELA 1C\",IF(L45=4,\"NORMA GED13 CPFL - TABELA 1C\",IF(L45=5,\"NORMA GED13 CPFL - TABELA 1D\",IF(L45=6,\"NORMA NTCD04 CERIM - TABELA 9 (TENSÃO 220V)\",IF(L45=7,\"NORMA NTCD04 CERIM - TABELA 9 (TENSÃO 380V)\",\"\")))))))","v":""},null,null,null,null,null,"PP/",null,null,null,null,null,null,null,null,null,null,null,null,null,null,null,null,null,null,null,null,null,null,null,null,null,null,null,null,3,null,23,{"$f":"IF(AND(CALC.D!$C$6<>\"\",CALC.D!$G$6<>\"\",CALC.D!$R$2<>\"\",CALC.D!$AB$20=2,CALC.D!$F$10<>\"\",CALC.D!$E$64<>\"\",CALC.D!$F$10=3,$AV$27=7,CALC.D!$G$59=$AY$26),\"USAR CAIXA TIPO II\",0)","v":0},{"$f":"IF(AND(CALC.D!$C$6<>\"\",CALC.D!$G$6<>\"\",CALC.D!$R$2<>\"\",CALC.D!$AB$20=2,CALC.D!$F$10<>\"\",CALC.D!$E$64<>\"\",CALC.D!$F$10=3,$AV$27=7,CALC.D!$G$59=$AZ$26),\"USAR CAIXA TIPO II\",0)","v":0},{"$f":"IF(AND(CALC.D!$C$6<>\"\",CALC.D!$G$6<>\"\",CALC.D!$R$2<>\"\",CALC.D!$AB$20=2,CALC.D!$F$10<>\"\",CALC.D!$E$64<>\"\",CALC.D!$F$10=3,$AV$27=7,CALC.D!$G$59=$BA$26),\"\",0)","v":0},{"$f":"IF(AND(CALC.D!$C$6<>\"\",CALC.D!$G$6<>\"\",CALC.D!$R$2<>\"\",CALC.D!$AB$20=2,CALC.D!$F$10<>\"\",CALC.D!$E$64<>\"\",CALC.D!$F$10=3,$AV$27=7,CALC.D!$G$59=$BB$26),\"\",0)","v":0},{"$f":"IF(AND(CALC.D!$C$6<>\"\",CALC.D!$G$6<>\"\",CALC.D!$R$2<>\"\",CALC.D!$AB$20=2,CALC.D!$F$10<>\"\",CALC.D!$E$64<>\"\",CALC.D!$F$10=3,$AV$27=7,CALC.D!$G$59=$BC$26),\"\",0)","v":0},{"$f":"IF(AND(CALC.D!$C$6<>\"\",CALC.D!$G$6<>\"\",CALC.D!$R$2<>\"\",CALC.D!$AB$20=2,CALC.D!$F$10<>\"\",CALC.D!$E$64<>\"\",CALC.D!$F$10=3,$AV$27=7,CALC.D!$G$59=$BD$26),\"\",0)","v":0},{"$f":"IF(AND(CALC.D!$C$6<>\"\",CALC.D!$G$6<>\"\",CALC.D!$R$2<>\"\",CALC.D!$AB$20=2,CALC.D!$F$10<>\"\",CALC.D!$E$64<>\"\",CALC.D!$F$10=3,$AV$27=7,CALC.D!$G$59=$BE$26),\"\",0)","v":0},{"$f":"IF(AND(CALC.D!$C$6<>\"\",CALC.D!$G$6<>\"\",CALC.D!$R$2<>\"\",CALC.D!$AB$20=2,CALC.D!$F$10<>\"\",CALC.D!$E$64<>\"\",CALC.D!$F$10=3,$AV$27=7,CALC.D!$G$59=$BF$26),\"\",0)","v":0},{"$f":"IF(AND(CALC.D!$C$6<>\"\",CALC.D!$G$6<>\"\",CALC.D!$R$2<>\"\",CALC.D!$AB$20=2,CALC.D!$F$10<>\"\",CALC.D!$E$64<>\"\",CALC.D!$F$10=3,$AV$27=7,CALC.D!$G$59=$BG$26),\"\",0)","v":0},{"$f":"IF(AND(CALC.D!$C$6<>\"\",CALC.D!$G$6<>\"\",CALC.D!$R$2<>\"\",CALC.D!$AB$20=2,CALC.D!$F$10<>\"\",CALC.D!$E$64<>\"\",CALC.D!$F$10=3,$AV$27=7,CALC.D!$G$59=$BH$26),\"\",0)","v":0},23,{"$f":"IF(AND(CALC.D!$C$6<>\"\",CALC.D!$G$6<>\"\",CALC.D!$R$2<>\"\",CALC.D!$AB$20=2,CALC.D!$F$10<>\"\",CALC.D!$E$64<>\"\",CALC.D!$F$10=3,$AV$27=7,CALC.D!$G$59=$AY$26),\"RESPONSABILIDADE TÉCNICA (ART/RRT/TRT) DA PARTE CIVIL\",0)","v":0},{"$f":"IF(AND(CALC.D!$C$6<>\"\",CALC.D!$G$6<>\"\",CALC.D!$R$2<>\"\",CALC.D!$AB$20=2,CALC.D!$F$10<>\"\",CALC.D!$E$64<>\"\",CALC.D!$F$10=3,$AV$27=7,CALC.D!$G$59=$AZ$26),\"USAR CAIXA TIPO II\",0)","v":0},{"$f":"IF(AND(CALC.D!$C$6<>\"\",CALC.D!$G$6<>\"\",CALC.D!$R$2<>\"\",CALC.D!$AB$20=2,CALC.D!$F$10<>\"\",CALC.D!$E$64<>\"\",CALC.D!$F$10=3,$AV$27=7,CALC.D!$G$59=$BL$26),\"\",0)","v":0},{"$f":"IF(AND(CALC.D!$C$6<>\"\",CALC.D!$G$6<>\"\",CALC.D!$R$2<>\"\",CALC.D!$AB$20=2,CALC.D!$F$10<>\"\",CALC.D!$E$64<>\"\",CALC.D!$F$10=3,$AV$27=7,CALC.D!$G$59=$BM$26),\"\",0)","v":0},{"$f":"IF(AND(CALC.D!$C$6<>\"\",CALC.D!$G$6<>\"\",CALC.D!$R$2<>\"\",CALC.D!$AB$20=2,CALC.D!$F$10<>\"\",CALC.D!$E$64<>\"\",CALC.D!$F$10=3,$AV$27=7,CALC.D!$G$59=$BN$26),\"\",0)","v":0},{"$f":"IF(AND(CALC.D!$C$6<>\"\",CALC.D!$G$6<>\"\",CALC.D!$R$2<>\"\",CALC.D!$AB$20=2,CALC.D!$F$10<>\"\",CALC.D!$E$64<>\"\",CALC.D!$F$10=3,$AV$27=7,CALC.D!$G$59=$BO$26),\"\",0)","v":0},{"$f":"IF(AND(CALC.D!$C$6<>\"\",CALC.D!$G$6<>\"\",CALC.D!$R$2<>\"\",CALC.D!$AB$20=2,CALC.D!$F$10<>\"\",CALC.D!$E$64<>\"\",CALC.D!$F$10=3,$AV$27=7,CALC.D!$G$59=$BP$26),\"\",0)","v":0},{"$f":"IF(AND(CALC.D!$C$6<>\"\",CALC.D!$G$6<>\"\",CALC.D!$R$2<>\"\",CALC.D!$AB$20=2,CALC.D!$F$10<>\"\",CALC.D!$E$64<>\"\",CALC.D!$F$10=3,$AV$27=7,CALC.D!$G$59=$BQ$26),\"\",0)","v":0}]
[null,null,null,"COD.",1,2,3,4,5,6,7,{"$f":"IF(AND(A44>0,B44>0,C44>0,D44>0),HLOOKUP(1,E44:K45,2,FALSE),\"\")","v":""},null,null,null,null,null,null,null,null,null,null,null,null,null,null,null,null,null,null,null,null,null,null,null,null,null,null,null,null,null,null,null,null,null,null,null,"4 ou mais",null,24,{"$f":"IF(AND(CALC.D!$C$6<>\"\",CALC.D!$G$6<>\"\",CALC.D!$R$2<>\"\",CALC.D!$AB$20=2,CALC.D!$F$10<>\"\",CALC.D!$E$64<>\"\",CALC.D!$F$10=\"4 ou mais\",$AV$27=6,CALC.D!$G$59=$AY$26),\"\",0)","v":0},{"$f":"IF(AND(CALC.D!$C$6<>\"\",CALC.D!$G$6<>\"\",CALC.D!$R$2<>\"\",CALC.D!$AB$20=2,CALC.D!$F$10<>\"\",CALC.D!$E$64<>\"\",CALC.D!$F$10=\"4 ou mais\",$AV$27=6,CALC.D!$G$59=$AZ$26),\"\",0)","v":0},{"$f":"IF(AND(CALC.D!$C$6<>\"\",CALC.D!$G$6<>\"\",CALC.D!$R$2<>\"\",CALC.D!$AB$20=2,CALC.D!$F$10<>\"\",CALC.D!$E$64<>\"\",CALC.D!$F$10=\"4 ou mais\",$AV$27=6,CALC.D!$G$59=$BA$26),\"\",0)","v":0},{"$f":"IF(AND(CALC.D!$C$6<>\"\",CALC.D!$G$6<>\"\",CALC.D!$R$2<>\"\",CALC.D!$AB$20=2,CALC.D!$F$10<>\"\",CALC.D!$E$64<>\"\",CALC.D!$F$10=\"4 ou mais\",$AV$27=6,CALC.D!$G$59=$BB$26),\"\",0)","v":0},{"$f":"IF(AND(CALC.D!$C$6<>\"\",CALC.D!$G$6<>\"\",CALC.D!$R$2<>\"\",CALC.D!$AB$20=2,CALC.D!$F$10<>\"\",CALC.D!$E$64<>\"\",CALC.D!$F$10=\"4 ou mais\",$AV$27=6,CALC.D!$G$59=$BC$26),\"\",0)","v":0},{"$f":"IF(AND(CALC.D!$C$6<>\"\",CALC.D!$G$6<>\"\",CALC.D!$R$2<>\"\",CALC.D!$AB$20=2,CALC.D!$F$10<>\"\",CALC.D!$E$64<>\"\",CALC.D!$F$10=\"4 ou mais\",$AV$27=6,CALC.D!$G$59=$BD$26),\"\",0)","v":0},{"$f":"IF(AND(CALC.D!$C$6<>\"\",CALC.D!$G$6<>\"\",CALC.D!$R$2<>\"\",CALC.D!$AB$20=2,CALC.D!$F$10<>\"\",CALC.D!$E$64<>\"\",CALC.D!$F$10=\"4 ou mais\",$AV$27=6,CALC.D!$G$59=$BE$26),\"\",0)","v":0},{"$f":"IF(AND(CALC.D!$C$6<>\"\",CALC.D!$G$6<>\"\",CALC.D!$R$2<>\"\",CALC.D!$AB$20=2,CALC.D!$F$10<>\"\",CALC.D!$E$64<>\"\",CALC.D!$F$10=\"4 ou mais\",$AV$27=6,CALC.D!$G$59=$BF$26),\"\",0)","v":0},{"$f":"IF(AND(CALC.D!$C$6<>\"\",CALC.D!$G$6<>\"\",CALC.D!$R$2<>\"\",CALC.D!$AB$20=2,CALC.D!$F$10<>\"\",CALC.D!$E$64<>\"\",CALC.D!$F$10=\"4 ou mais\",$AV$27=6,CALC.D!$G$59=$BG$26),\"\",0)","v":0},{"$f":"IF(AND(CALC.D!$C$6<>\"\",CALC.D!$G$6<>\"\",CALC.D!$R$2<>\"\",CALC.D!$AB$20=2,CALC.D!$F$10<>\"\",CALC.D!$E$64<>\"\",CALC.D!$F$10=\"4 ou mais\",$AV$27=6,CALC.D!$G$59=$BH$26),\"\",0)","v":0},24,{"$f":"IF(AND(CALC.D!$C$6<>\"\",CALC.D!$G$6<>\"\",CALC.D!$R$2<>\"\",CALC.D!$AB$20=2,CALC.D!$F$10<>\"\",CALC.D!$E$64<>\"\",CALC.D!$F$10=\"4 ou mais\",$AV$27=7,CALC.D!$G$59=$AY$26),\"ou Ligação Coletiva\",0)","v":0},{"$f":"IF(AND(CALC.D!$C$6<>\"\",CALC.D!$G$6<>\"\",CALC.D!$R$2<>\"\",CALC.D!$AB$20=2,CALC.D!$F$10<>\"\",CALC.D!$E$64<>\"\",CALC.D!$F$10=\"4 ou mais\",$AV$27=7,CALC.D!$G$59=$AZ$26),\"\",0)","v":0},{"$f":"IF(AND(CALC.D!$C$6<>\"\",CALC.D!$G$6<>\"\",CALC.D!$R$2<>\"\",CALC.D!$AB$20=2,CALC.D!$F$10<>\"\",CALC.D!$E$64<>\"\",CALC.D!$F$10=\"4 ou mais\",$AV$27=7,CALC.D!$G$59=$BL$26),\"\",0)","v":0},{"$f":"IF(AND(CALC.D!$C$6<>\"\",CALC.D!$G$6<>\"\",CALC.D!$R$2<>\"\",CALC.D!$AB$20=2,CALC.D!$F$10<>\"\",CALC.D!$E$64<>\"\",CALC.D!$F$10=\"4 ou mais\",$AV$27=7,CALC.D!$G$59=$BM$26),\"\",0)","v":0},{"$f":"IF(AND(CALC.D!$C$6<>\"\",CALC.D!$G$6<>\"\",CALC.D!$R$2<>\"\",CALC.D!$AB$20=2,CALC.D!$F$10<>\"\",CALC.D!$E$64<>\"\",CALC.D!$F$10=\"4 ou mais\",$AV$27=7,CALC.D!$G$59=$BN$26),\"\",0)","v":0},{"$f":"IF(AND(CALC.D!$C$6<>\"\",CALC.D!$G$6<>\"\",CALC.D!$R$2<>\"\",CALC.D!$AB$20=2,CALC.D!$F$10<>\"\",CALC.D!$E$64<>\"\",CALC.D!$F$10=\"4 ou mais\",$AV$27=7,CALC.D!$G$59=$BO$26),\"\",0)","v":0},{"$f":"IF(AND(CALC.D!$C$6<>\"\",CALC.D!$G$6<>\"\",CALC.D!$R$2<>\"\",CALC.D!$AB$20=2,CALC.D!$F$10<>\"\",CALC.D!$E$64<>\"\",CALC.D!$F$10=\"4 ou mais\",$AV$27=7,CALC.D!$G$59=$BP$26),\"\",0)","v":0},{"$f":"IF(AND(CALC.D!$C$6<>\"\",CALC.D!$G$6<>\"\",CALC.D!$R$2<>\"\",CALC.D!$AB$20=2,CALC.D!$F$10<>\"\",CALC.D!$E$64<>\"\",CALC.D!$F$10=\"4 ou mais\",$AV$27=7,CALC.D!$G$59=$BQ$26),\"\",0)","v":0}]
[null,null,null,null,null,null,null,null,null,null,null,null,null,null,null,null,null,null,null,null,null,null,null,null,null,null,null,null,null,null,null,null,null,null,null,null,null,null,null,null,null,null,null,null,null,null,"ALVENARIA/FACHADA",1,{"$f":"IF(CALC.D!$E$64=TABELAS!A67,VLOOKUP(CALC.D!$F$10,$AV$46:$AX$49,3,FALSE),0)","v":0},25,{"$f":"IF(AND(CALC.D!$C$6<>\"\",CALC.D!$G$6<>\"\",CALC.D!$R$2<>\"\",CALC.D!$AB$20=2,CALC.D!$F$10<>\"\",CALC.D!$E$64<>\"\",CALC.D!$F$10=1,$AV$27=8,CALC.D!$G$59=$AY$26),\"USAR CAIXA TIPO II\",0)","v":0},{"$f":"IF(AND(CALC.D!$C$6<>\"\",CALC.D!$G$6<>\"\",CALC.D!$R$2<>\"\",CALC.D!$AB$20=2,CALC.D!$F$10<>\"\",CALC.D!$E$64<>\"\",CALC.D!$F$10=1,$AV$27=8,CALC.D!$G$59=$AZ$26),\"USAR CAIXA TIPO II\",0)","v":0},{"$f":"IF(AND(CALC.D!$C$6<>\"\",CALC.D!$G$6<>\"\",CALC.D!$R$2<>\"\",CALC.D!$AB$20=2,CALC.D!$F$10<>\"\",CALC.D!$E$64<>\"\",CALC.D!$F$10=1,$AV$27=8,CALC.D!$G$59=$BA$26),\"USAR CAIXA TIPO II\",0)","v":0},{"$f":"IF(AND(CALC.D!$C$6<>\"\",CALC.D!$G$6<>\"\",CALC.D!$R$2<>\"\",CALC.D!$AB$20=2,CALC.D!$F$10<>\"\",CALC.D!$E$64<>\"\",CALC.D!$F$10=1,$AV$27=8,CALC.D!$G$59=$BB$26),\"USAR CAIXA TIPO II\",0)","v":0},{"$f":"IF(AND(CALC.D!$C$6<>\"\",CALC.D!$G$6<>\"\",CALC.D!$R$2<>\"\",CALC.D!$AB$20=2,CALC.D!$F$10<>\"\",CALC.D!$E$64<>\"\",CALC.D!$F$10=1,$AV$27=8,CALC.D!$G$59=$BC$26),\"USAR CAIXA TIPO III\",0)","v":0},{"$f":"IF(AND(CALC.D!$C$6<>\"\",CALC.D!$G$6<>\"\",CALC.D!$R$2<>\"\",CALC.D!$AB$20=2,CALC.D!$F$10<>\"\",CALC.D!$E$64<>\"\",CALC.D!$F$10=1,$AV$27=8,CALC.D!$G$59=$BD$26),\"USAR CAIXA TIPO III\",0)","v":0},{"$f":"IF(AND(CALC.D!$C$6<>\"\",CALC.D!$G$6<>\"\",CALC.D!$R$2<>\"\",CALC.D!$AB$20=2,CALC.D!$F$10<>\"\",CALC.D!$E$64<>\"\",CALC.D!$F$10=1,$AV$27=8,CALC.D!$G$59=$BE$26),\"USAR CAIXA TIPO III\",0)","v":0},{"$f":"IF(AND(CALC.D!$C$6<>\"\",CALC.D!$G$6<>\"\",CALC.D!$R$2<>\"\",CALC.D!$AB$20=2,CALC.D!$F$10<>\"\",CALC.D!$E$64<>\"\",CALC.D!$F$10=1,$AV$27=8,CALC.D!$G$59=$BF$26),\"USAR CAIXA TIPO H\",0)","v":0},{"$f":"IF(AND(CALC.D!$C$6<>\"\",CALC.D!$G$6<>\"\",CALC.D!$R$2<>\"\",CALC.D!$AB$20=2,CALC.D!$F$10<>\"\",CALC.D!$E$64<>\"\",CALC.D!$F$10=1,$AV$27=8,CALC.D!$G$59=$BG$26),\"USAR CAIXA TIPO H\",0)","v":0},{"$f":"IF(AND(CALC.D!$C$6<>\"\",CALC.D!$G$6<>\"\",CALC.D!$R$2<>\"\",CALC.D!$AB$20=2,CALC.D!$F$10<>\"\",CALC.D!$E$64<>\"\",CALC.D!$F$10=1,$AV$27=8,CALC.D!$G$59=$BH$26),\"USAR CAIXA TIPO H\",0)","v":0},25,{"$f":"IF(AND(CALC.D!$C$6<>\"\",CALC.D!$G$6<>\"\",CALC.D!$R$2<>\"\",CALC.D!$AB$20=2,CALC.D!$F$10<>\"\",CALC.D!$E$64<>\"\",CALC.D!$F$10=1,$AV$27=8,CALC.D!$G$59=$AY$26),\"USAR CAIXA TIPO II\",0)","v":0},{"$f":"IF(AND(CALC.D!$C$6<>\"\",CALC.D!$G$6<>\"\",CALC.D!$R$2<>\"\",CALC.D!$AB$20=2,CALC.D!$F$10<>\"\",CALC.D!$E$64<>\"\",CALC.D!$F$10=1,$AV$27=8,CALC.D!$G$59=$AZ$26),\"USAR CAIXA TIPO II\",0)","v":0},{"$f":"IF(AND(CALC.D!$C$6<>\"\",CALC.D!$G$6<>\"\",CALC.D!$R$2<>\"\",CALC.D!$AB$20=2,CALC.D!$F$10<>\"\",CALC.D!$E$64<>\"\",CALC.D!$F$10=1,$AV$27=8,CALC.D!$G$59=$BL$26),\"USAR CAIXA TIPO II\",0)","v":0},{"$f":"IF(AND(CALC.D!$C$6<>\"\",CALC.D!$G$6<>\"\",CALC.D!$R$2<>\"\",CALC.D!$AB$20=2,CALC.D!$F$10<>\"\",CALC.D!$E$64<>\"\",CALC.D!$F$10=1,$AV$27=8,CALC.D!$G$59=$BM$26),\"USAR CAIXA TIPO III\",0)","v":0},{"$f":"IF(AND(CALC.D!$C$6<>\"\",CALC.D!$G$6<>\"\",CALC.D!$R$2<>\"\",CALC.D!$AB$20=2,CALC.D!$F$10<>\"\",CALC.D!$E$64<>\"\",CALC.D!$F$10=1,$AV$27=8,CALC.D!$G$59=$BN$26),\"USAR CAIXA TIPO III\",0)","v":0},{"$f":"IF(AND(CALC.D!$C$6<>\"\",CALC.D!$G$6<>\"\",CALC.D!$R$2<>\"\",CALC.D!$AB$20=2,CALC.D!$F$10<>\"\",CALC.D!$E$64<>\"\",CALC.D!$F$10=1,$AV$27=8,CALC.D!$G$59=$BO$26),\"USAR CAIXA TIPO III\",0)","v":0},{"$f":"IF(AND(CALC.D!$C$6<>\"\",CALC.D!$G$6<>\"\",CALC.D!$R$2<>\"\",CALC.D!$AB$20=2,CALC.D!$F$10<>\"\",CALC.D!$E$64<>\"\",CALC.D!$F$10=1,$AV$27=8,CALC.D!$G$59=$BP$26),\"USAR CAIXA TIPO III\",0)","v":0},{"$f":"IF(AND(CALC.D!$C$6<>\"\",CALC.D!$G$6<>\"\",CALC.D!$R$2<>\"\",CALC.D!$AB$20=2,CALC.D!$F$10<>\"\",CALC.D!$E$64<>\"\",CALC.D!$F$10=1,$AV$27=8,CALC.D!$G$59=$BQ$26),\"USAR CAIXA TIPO H\",0)","v":0}]
["DOCUMENTO PARA RESPONSABILIDADE ELÉTRICA",null,null,null,null,null,null,null,null,null,null,null,null,null,null,null,null,null,null,null,null,null,null,null,null,null,null,null,null,null,null,null,null,null,null,null,null,null,null,null,null,null,null,null,null,null,null,2,null,26,{"$f":"IF(AND(CALC.D!$C$6<>\"\",CALC.D!$G$6<>\"\",CALC.D!$R$2<>\"\",CALC.D!$AB$20=2,CALC.D!$F$10<>\"\",CALC.D!$E$64<>\"\",CALC.D!$F$10=2,$AV$27=8,CALC.D!$G$59=$AY$26),\"USAR CAIXA TIPO II\",0)","v":0},{"$f":"IF(AND(CALC.D!$C$6<>\"\",CALC.D!$G$6<>\"\",CALC.D!$R$2<>\"\",CALC.D!$AB$20=2,CALC.D!$F$10<>\"\",CALC.D!$E$64<>\"\",CALC.D!$F$10=2,$AV$27=8,CALC.D!$G$59=$AZ$26),\"USAR CAIXA TIPO II\",0)","v":0},{"$f":"IF(AND(CALC.D!$C$6<>\"\",CALC.D!$G$6<>\"\",CALC.D!$R$2<>\"\",CALC.D!$AB$20=2,CALC.D!$F$10<>\"\",CALC.D!$E$64<>\"\",CALC.D!$F$10=2,$AV$27=8,CALC.D!$G$59=$BA$26),\"USAR CAIXA TIPO II\",0)","v":0},{"$f":"IF(AND(CALC.D!$C$6<>\"\",CALC.D!$G$6<>\"\",CALC.D!$R$2<>\"\",CALC.D!$AB$20=2,CALC.D!$F$10<>\"\",CALC.D!$E$64<>\"\",CALC.D!$F$10=2,$AV$27=8,CALC.D!$G$59=$BB$26),\"USAR CAIXA TIPO II\",0)","v":0},{"$f":"IF(AND(CALC.D!$C$6<>\"\",CALC.D!$G$6<>\"\",CALC.D!$R$2<>\"\",CALC.D!$AB$20=2,CALC.D!$F$10<>\"\",CALC.D!$E$64<>\"\",CALC.D!$F$10=2,$AV$27=8,CALC.D!$G$59=$BC$26),\"USAR CAIXA TIPO III\",0)","v":0},{"$f":"IF(AND(CALC.D!$C$6<>\"\",CALC.D!$G$6<>\"\",CALC.D!$R$2<>\"\",CALC.D!$AB$20=2,CALC.D!$F$10<>\"\",CALC.D!$E$64<>\"\",CALC.D!$F$10=2,$AV$27=8,CALC.D!$G$59=$BD$26),\"USAR CAIXA TIPO III\",0)","v":0},{"$f":"IF(AND(CALC.D!$C$6<>\"\",CALC.D!$G$6<>\"\",CALC.D!$R$2<>\"\",CALC.D!$AB$20=2,CALC.D!$F$10<>\"\",CALC.D!$E$64<>\"\",CALC.D!$F$10=2,$AV$27=8,CALC.D!$G$59=$BE$26),\"USAR CAIXA TIPO III\",0)","v":0},{"$f":"IF(AND(CALC.D!$C$6<>\"\",CALC.D!$G$6<>\"\",CALC.D!$R$2<>\"\",CALC.D!$AB$20=2,CALC.D!$F$10<>\"\",CALC.D!$E$64<>\"\",CALC.D!$F$10=2,$AV$27=8,CALC.D!$G$59=$BF$26),\"USAR CAIXA TIPO H\",0)","v":0},{"$f":"IF(AND(CALC.D!$C$6<>\"\",CALC.D!$G$6<>\"\",CALC.D!$R$2<>\"\",CALC.D!$AB$20=2,CALC.D!$F$10<>\"\",CALC.D!$E$64<>\"\",CALC.D!$F$10=2,$AV$27=8,CALC.D!$G$59=$BG$26),\"USAR CAIXA TIPO H\",0)","v":0},{"$f":"IF(AND(CALC.D!$C$6<>\"\",CALC.D!$G$6<>\"\",CALC.D!$R$2<>\"\",CALC.D!$AB$20=2,CALC.D!$F$10<>\"\",CALC.D!$E$64<>\"\",CALC.D!$F$10=2,$AV$27=8,CALC.D!$G$59=$BH$26),\"USAR CAIXA TIPO H\",0)","v":0},26,{"$f":"IF(AND(CALC.D!$C$6<>\"\",CALC.D!$G$6<>\"\",CALC.D!$R$2<>\"\",CALC.D!$AB$20=2,CALC.D!$F$10<>\"\",CALC.D!$E$64<>\"\",CALC.D!$F$10=2,$AV$27=8,CALC.D!$G$59=$AY$26),\"USAR CAIXA TIPO II\",0)","v":0},{"$f":"IF(AND(CALC.D!$C$6<>\"\",CALC.D!$G$6<>\"\",CALC.D!$R$2<>\"\",CALC.D!$AB$20=2,CALC.D!$F$10<>\"\",CALC.D!$E$64<>\"\",CALC.D!$F$10=2,$AV$27=8,CALC.D!$G$59=$AZ$26),\"USAR CAIXA TIPO II\",0)","v":0},{"$f":"IF(AND(CALC.D!$C$6<>\"\",CALC.D!$G$6<>\"\",CALC.D!$R$2<>\"\",CALC.D!$AB$20=2,CALC.D!$F$10<>\"\",CALC.D!$E$64<>\"\",CALC.D!$F$10=2,$AV$27=8,CALC.D!$G$59=$BL$26),\"USAR CAIXA TIPO II\",0)","v":0},{"$f":"IF(AND(CALC.D!$C$6<>\"\",CALC.D!$G$6<>\"\",CALC.D!$R$2<>\"\",CALC.D!$AB$20=2,CALC.D!$F$10<>\"\",CALC.D!$E$64<>\"\",CALC.D!$F$10=2,$AV$27=8,CALC.D!$G$59=$BM$26),\"USAR CAIXA TIPO III\",0)","v":0},{"$f":"IF(AND(CALC.D!$C$6<>\"\",CALC.D!$G$6<>\"\",CALC.D!$R$2<>\"\",CALC.D!$AB$20=2,CALC.D!$F$10<>\"\",CALC.D!$E$64<>\"\",CALC.D!$F$10=2,$AV$27=8,CALC.D!$G$59=$BN$26),\"USAR CAIXA TIPO III\",0)","v":0},{"$f":"IF(AND(CALC.D!$C$6<>\"\",CALC.D!$G$6<>\"\",CALC.D!$R$2<>\"\",CALC.D!$AB$20=2,CALC.D!$F$10<>\"\",CALC.D!$E$64<>\"\",CALC.D!$F$10=2,$AV$27=8,CALC.D!$G$59=$BO$26),\"USAR CAIXA TIPO III\",0)","v":0},{"$f":"IF(AND(CALC.D!$C$6<>\"\",CALC.D!$G$6<>\"\",CALC.D!$R$2<>\"\",CALC.D!$AB$20=2,CALC.D!$F$10<>\"\",CALC.D!$E$64<>\"\",CALC.D!$F$10=2,$AV$27=8,CALC.D!$G$59=$BP$26),\"USAR CAIXA TIPO III\",0)","v":0},{"$f":"IF(AND(CALC.D!$C$6<>\"\",CALC.D!$G$6<>\"\",CALC.D!$R$2<>\"\",CALC.D!$AB$20=2,CALC.D!$F$10<>\"\",CALC.D!$E$64<>\"\",CALC.D!$F$10=2,$AV$27=8,CALC.D!$G$59=$BQ$26),\"USAR CAIXA TIPO H\",0)","v":0}]
["NORMA","DEMANDA","CAT. ATENDto","CLASSE","DESTINAÇÃO","ÁREA CONSTRUIDA","NUMERO DE LIGAÇÕES","SIM","NÃO","RESULTADO CERIM",null,null,"RESULTADO CPFL",null,null,null,null,null,null,null,null,null,null,null,null,null,null,null,null,null,null,null,null,null,null,null,null,null,null,null,null,null,null,null,null,null,null,3,null,27,{"$f":"IF(AND(CALC.D!$C$6<>\"\",CALC.D!$G$6<>\"\",CALC.D!$R$2<>\"\",CALC.D!$AB$20=2,CALC.D!$F$10<>\"\",CALC.D!$E$64<>\"\",CALC.D!$F$10=3,$AV$27=8,CALC.D!$G$59=$AY$26),\"USAR CAIXA TIPO II\",0)","v":0},{"$f":"IF(AND(CALC.D!$C$6<>\"\",CALC.D!$G$6<>\"\",CALC.D!$R$2<>\"\",CALC.D!$AB$20=2,CALC.D!$F$10<>\"\",CALC.D!$E$64<>\"\",CALC.D!$F$10=3,$AV$27=8,CALC.D!$G$59=$AZ$26),\"USAR CAIXA TIPO II\",0)","v":0},{"$f":"IF(AND(CALC.D!$C$6<>\"\",CALC.D!$G$6<>\"\",CALC.D!$R$2<>\"\",CALC.D!$AB$20=2,CALC.D!$F$10<>\"\",CALC.D!$E$64<>\"\",CALC.D!$F$10=3,$AV$27=8,CALC.D!$G$59=$BA$26),\"\",0)","v":0},{"$f":"IF(AND(CALC.D!$C$6<>\"\",CALC.D!$G$6<>\"\",CALC.D!$R$2<>\"\",CALC.D!$AB$20=2,CALC.D!$F$10<>\"\",CALC.D!$E$64<>\"\",CALC.D!$F$10=3,$AV$27=8,CALC.D!$G$59=$BB$26),\"\",0)","v":0},{"$f":"IF(AND(CALC.D!$C$6<>\"\",CALC.D!$G$6<>\"\",CALC.D!$R$2<>\"\",CALC.D!$AB$20=2,CALC.D!$F$10<>\"\",CALC.D!$E$64<>\"\",CALC.D!$F$10=3,$AV$27=8,CALC.D!$G$59=$BC$26),\"\",0)","v":0},{"$f":"IF(AND(CALC.D!$C$6<>\"\",CALC.D!$G$6<>\"\",CALC.D!$R$2<>\"\",CALC.D!$AB$20=2,CALC.D!$F$10<>\"\",CALC.D!$E$64<>\"\",CALC.D!$F$10=3,$AV$27=8,CALC.D!$G$59=$BD$26),\"\",0)","v":0},{"$f":"IF(AND(CALC.D!$C$6<>\"\",CALC.D!$G$6<>\"\",CALC.D!$R$2<>\"\",CALC.D!$AB$20=2,CALC.D!$F$10<>\"\",CALC.D!$E$64<>\"\",CALC.D!$F$10=3,$AV$27=8,CALC.D!$G$59=$BE$26),\"\",0)","v":0},{"$f":"IF(AND(CALC.D!$C$6<>\"\",CALC.D!$G$6<>\"\",CALC.D!$R$2<>\"\",CALC.D!$AB$20=2,CALC.D!$F$10<>\"\",CALC.D!$E$64<>\"\",CALC.D!$F$10=3,$AV$27=8,CALC.D!$G$59=$BF$26),\"\",0)","v":0},{"$f":"IF(AND(CALC.D!$C$6<>\"\",CALC.D!$G$6<>\"\",CALC.D!$R$2<>\"\",CALC.D!$AB$20=2,CALC.D!$F$10<>\"\",CALC.D!$E$64<>\"\",CALC.D!$F$10=3,$AV$27=8,CALC.D!$G$59=$BG$26),\"\",0)","v":0},{"$f":"IF(AND(CALC.D!$C$6<>\"\",CALC.D!$G$6<>\"\",CALC.D!$R$2<>\"\",CALC.D!$AB$20=2,CALC.D!$F$10<>\"\",CALC.D!$E$64<>\"\",CALC.D!$F$10=3,$AV$27=8,CALC.D!$G$59=$BH$26),\"\",0)","v":0},27,{"$f":"IF(AND(CALC.D!$C$6<>\"\",CALC.D!$G$6<>\"\",CALC.D!$R$2<>\"\",CALC.D!$AB$20=2,CALC.D!$F$10<>\"\",CALC.D!$E$64<>\"\",CALC.D!$F$10=3,$AV$27=8,CALC.D!$G$59=$AY$26),\"USAR CAIXA TIPO II\",0)","v":0},{"$f":"IF(AND(CALC.D!$C$6<>\"\",CALC.D!$G$6<>\"\",CALC.D!$R$2<>\"\",CALC.D!$AB$20=2,CALC.D!$F$10<>\"\",CALC.D!$E$64<>\"\",CALC.D!$F$10=3,$AV$27=8,CALC.D!$G$59=$AZ$26),\"\",0)","v":0},{"$f":"IF(AND(CALC.D!$C$6<>\"\",CALC.D!$G$6<>\"\",CALC.D!$R$2<>\"\",CALC.D!$AB$20=2,CALC.D!$F$10<>\"\",CALC.D!$E$64<>\"\",CALC.D!$F$10=3,$AV$27=8,CALC.D!$G$59=$BL$26),\"\",0)","v":0},{"$f":"IF(AND(CALC.D!$C$6<>\"\",CALC.D!$G$6<>\"\",CALC.D!$R$2<>\"\",CALC.D!$AB$20=2,CALC.D!$F$10<>\"\",CALC.D!$E$64<>\"\",CALC.D!$F$10=3,$AV$27=8,CALC.D!$G$59=$BM$26),\"\",0)","v":0},{"$f":"IF(AND(CALC.D!$C$6<>\"\",CALC.D!$G$6<>\"\",CALC.D!$R$2<>\"\",CALC.D!$AB$20=2,CALC.D!$F$10<>\"\",CALC.D!$E$64<>\"\",CALC.D!$F$10=3,$AV$27=8,CALC.D!$G$59=$BN$26),\"\",0)","v":0},{"$f":"IF(AND(CALC.D!$C$6<>\"\",CALC.D!$G$6<>\"\",CALC.D!$R$2<>\"\",CALC.D!$AB$20=2,CALC.D!$F$10<>\"\",CALC.D!$E$64<>\"\",CALC.D!$F$10=3,$AV$27=8,CALC.D!$G$59=$BO$26),\"\",0)","v":0},{"$f":"IF(AND(CALC.D!$C$6<>\"\",CALC.D!$G$6<>\"\",CALC.D!$R$2<>\"\",CALC.D!$AB$20=2,CALC.D!$F$10<>\"\",CALC.D!$E$64<>\"\",CALC.D!$F$10=3,$AV$27=8,CALC.D!$G$59=$BP$26),\"\",0)","v":0},{"$f":"IF(AND(CALC.D!$C$6<>\"\",CALC.D!$G$6<>\"\",CALC.D!$R$2<>\"\",CALC.D!$AB$20=2,CALC.D!$F$10<>\"\",CALC.D!$E$64<>\"\",CALC.D!$F$10=3,$AV$27=8,CALC.D!$G$59=$BQ$26),\"\",0)","v":0}]
[{"$f":"CALC.D!AB20","v":2},{"$f":"IF(AND(CALC.D!B62<>\"\",OR(CALC.D!B62>=38,CALC.D!B62>=66)),2,1)","v":2},{"$f":"IFERROR(IF(CALC.D!G59<>\"\",IF(AND(A49=2,OR(L45=1,L45=3,L45=4,L45=5)),VLOOKUP(CALC.D!G59,TABELAS!E59:F68,2,FALSE),IF(AND(A49=2,L45=2),VLOOKUP(CALC.D!G59,TABELAS!G59:H66,2,FALSE),IF(AND(A49=1,L45=6),VLOOKUP(CALC.D!G59,TABELAS!I59:J68,2,FALSE),IF(AND(A49=1,L45=7),VLOOKUP(CALC.D!G59,TABELAS!K59:L63,2,FALSE)))))),\"ERRO\")","v":false},{"$f":"IF(CALC.D!AB19<>\"\",CALC.D!AB19,0)","v":0},{"$f":"IF(CALC.D!AB18<>\"\",CALC.D!AB18,0)","v":0},{"$f":"IF(CALC.D!T6<>\"\",IF(AND(CALC.D!C6=TABELAS!A41,CALC.D!T6>=200),2,1))","v":false},{"$f":"IF(CALC.D!F10<>\"\",CALC.D!F10,0)","v":0},{"$f":"IF(AND(CALC.D!G59<>\"\",CALC.D!E64<>\"\",CALC.D!AB20<>\"\"),IF(AND(A49=2,B44=1,OR(B49=2,E49=3,E49=6,E49=7,E49=10,E49=11,E49=12,F49=2,G49>=2,C49>=8)),1,IF(AND(A49=2,B44=2,OR(B49=2,E49=3,E49=6,E49=7,E49=10,E49=11,E49=12,F49=2,G49>=2,C49>=18)),1,IF(AND(A49=1,B44=1,OR(B49=2,E49=3,E49=6,E49=7,E49=10,E49=11,E49=12,F49=2,G49>=2,C49>=5)),1,IF(AND(A49=1,B44=2,OR(B49=2,E49=3,E49=6,E49=7,E49=10,E49=11,E49=12,F49=2,G49>=2,C49>=11)),1,0)))))","v":false},{"$f":"IF(AND(CALC.D!B15<>\"\",CALC.D!G59<>\"\",H49=0),1,0)","v":0},{"$f":"IF(AND(A49=1,H49=1,I49=0),\"CONFORME ITEM 7 DA NORMA NTCD 04 CERIM, É NECESSÁRIO APRESENTAÇÃO DE DOCUMENTO DE RESPONSABILIDADE TÉCNICA \",IF(AND(A49=1,I49=1,H49=0),\"NÃO É NECESSÁRIO APRESENTAÇÃO DESTE DOCUMENTO\",\"\"))","v":""},null,null,{"$f":"IF(AND(A49=2,H49=1,I49=0),\"CONFORME ITEM 5.4.4 DA NORMA GED 13 CPFL, É NECESSÁRIO APRESENTAR DOCUMENTO DE RESPONSABILIDADE TÉCNICA\",IF(AND(A49=2,I49=1,H49=0),\"NÃO É NECESSÁRIO APRESENTAÇÃO DESTE DOCUMENTO\",\"\"))","v":""},null,null,null,null,null,null,null,null,null,null,null,null,null,null,null,null,null,null,null,null,null,null,null,null,null,null,null,null,null,null,null,null,null,null,"4 ou mais",null,28,{"$f":"IF(AND(CALC.D!$C$6<>\"\",CALC.D!$G$6<>\"\",CALC.D!$R$2<>\"\",CALC.D!$AB$20=2,CALC.D!$F$10<>\"\",CALC.D!$E$64<>\"\",CALC.D!$F$10=\"4 ou mais\",$AV$27=7,CALC.D!$G$59=$AY$26),\"\",0)","v":0},{"$f":"IF(AND(CALC.D!$C$6<>\"\",CALC.D!$G$6<>\"\",CALC.D!$R$2<>\"\",CALC.D!$AB$20=2,CALC.D!$F$10<>\"\",CALC.D!$E$64<>\"\",CALC.D!$F$10=\"4 ou mais\",$AV$27=7,CALC.D!$G$59=$AZ$26),\"\",0)","v":0},{"$f":"IF(AND(CALC.D!$C$6<>\"\",CALC.D!$G$6<>\"\",CALC.D!$R$2<>\"\",CALC.D!$AB$20=2,CALC.D!$F$10<>\"\",CALC.D!$E$64<>\"\",CALC.D!$F$10=\"4 ou mais\",$AV$27=7,CALC.D!$G$59=$BA$26),\"\",0)","v":0},{"$f":"IF(AND(CALC.D!$C$6<>\"\",CALC.D!$G$6<>\"\",CALC.D!$R$2<>\"\",CALC.D!$AB$20=2,CALC.D!$F$10<>\"\",CALC.D!$E$64<>\"\",CALC.D!$F$10=\"4 ou mais\",$AV$27=7,CALC.D!$G$59=$BB$26),\"\",0)","v":0},{"$f":"IF(AND(CALC.D!$C$6<>\"\",CALC.D!$G$6<>\"\",CALC.D!$R$2<>\"\",CALC.D!$AB$20=2,CALC.D!$F$10<>\"\",CALC.D!$E$64<>\"\",CALC.D!$F$10=\"4 ou mais\",$AV$27=7,CALC.D!$G$59=$BC$26),\"\",0)","v":0},{"$f":"IF(AND(CALC.D!$C$6<>\"\",CALC.D!$G$6<>\"\",CALC.D!$R$2<>\"\",CALC.D!$AB$20=2,CALC.D!$F$10<>\"\",CALC.D!$E$64<>\"\",CALC.D!$F$10=\"4 ou mais\",$AV$27=7,CALC.D!$G$59=$BD$26),\"\",0)","v":0},{"$f":"IF(AND(CALC.D!$C$6<>\"\",CALC.D!$G$6<>\"\",CALC.D!$R$2<>\"\",CALC.D!$AB$20=2,CALC.D!$F$10<>\"\",CALC.D!$E$64<>\"\",CALC.D!$F$10=\"4 ou mais\",$AV$27=7,CALC.D!$G$59=$BE$26),\"\",0)","v":0},{"$f":"IF(AND(CALC.D!$C$6<>\"\",CALC.D!$G$6<>\"\",CALC.D!$R$2<>\"\",CALC.D!$AB$20=2,CALC.D!$F$10<>\"\",CALC.D!$E$64<>\"\",CALC.D!$F$10=\"4 ou mais\",$AV$27=7,CALC.D!$G$59=$BF$26),\"\",0)","v":0},{"$f":"IF(AND(CALC.D!$C$6<>\"\",CALC.D!$G$6<>\"\",CALC.D!$R$2<>\"\",CALC.D!$AB$20=2,CALC.D!$F$10<>\"\",CALC.D!$E$64<>\"\",CALC.D!$F$10=\"4 ou mais\",$AV$27=7,CALC.D!$G$59=$BG$26),\"\",0)","v":0},{"$f":"IF(AND(CALC.D!$C$6<>\"\",CALC.D!$G$6<>\"\",CALC.D!$R$2<>\"\",CALC.D!$AB$20=2,CALC.D!$F$10<>\"\",CALC.D!$E$64<>\"\",CALC.D!$F$10=\"4 ou mais\",$AV$27=7,CALC.D!$G$59=$BH$26),\"\",0)","v":0},28,{"$f":"IF(AND(CALC.D!$C$6<>\"\",CALC.D!$G$6<>\"\",CALC.D!$R$2<>\"\",CALC.D!$AB$20=2,CALC.D!$F$10<>\"\",CALC.D!$E$64<>\"\",CALC.D!$F$10=\"4 ou mais\",$AV$27=8,CALC.D!$G$59=$AY$26),\"\",0)","v":0},{"$f":"IF(AND(CALC.D!$C$6<>\"\",CALC.D!$G$6<>\"\",CALC.D!$R$2<>\"\",CALC.D!$AB$20=2,CALC.D!$F$10<>\"\",CALC.D!$E$64<>\"\",CALC.D!$F$10=\"4 ou mais\",$AV$27=8,CALC.D!$G$59=$AZ$26),\"\",0)","v":0},{"$f":"IF(AND(CALC.D!$C$6<>\"\",CALC.D!$G$6<>\"\",CALC.D!$R$2<>\"\",CALC.D!$AB$20=2,CALC.D!$F$10<>\"\",CALC.D!$E$64<>\"\",CALC.D!$F$10=\"4 ou mais\",$AV$27=8,CALC.D!$G$59=$BL$26),\"\",0)","v":0},{"$f":"IF(AND(CALC.D!$C$6<>\"\",CALC.D!$G$6<>\"\",CALC.D!$R$2<>\"\",CALC.D!$AB$20=2,CALC.D!$F$10<>\"\",CALC.D!$E$64<>\"\",CALC.D!$F$10=\"4 ou mais\",$AV$27=7,CALC.D!$G$59=$BM$26),\"\",0)","v":0},{"$f":"IF(AND(CALC.D!$C$6<>\"\",CALC.D!$G$6<>\"\",CALC.D!$R$2<>\"\",CALC.D!$AB$20=2,CALC.D!$F$10<>\"\",CALC.D!$E$64<>\"\",CALC.D!$F$10=\"4 ou mais\",$AV$27=8,CALC.D!$G$59=$BN$26),\"\",0)","v":0},{"$f":"IF(AND(CALC.D!$C$6<>\"\",CALC.D!$G$6<>\"\",CALC.D!$R$2<>\"\",CALC.D!$AB$20=2,CALC.D!$F$10<>\"\",CALC.D!$E$64<>\"\",CALC.D!$F$10=\"4 ou mais\",$AV$27=8,CALC.D!$G$59=$BO$26),\"\",0)","v":0},{"$f":"IF(AND(CALC.D!$C$6<>\"\",CALC.D!$G$6<>\"\",CALC.D!$R$2<>\"\",CALC.D!$AB$20=2,CALC.D!$F$10<>\"\",CALC.D!$E$64<>\"\",CALC.D!$F$10=\"4 ou mais\",$AV$27=8,CALC.D!$G$59=$BP$26),\"\",0)","v":0},{"$f":"IF(AND(CALC.D!$C$6<>\"\",CALC.D!$G$6<>\"\",CALC.D!$R$2<>\"\",CALC.D!$AB$20=2,CALC.D!$F$10<>\"\",CALC.D!$E$64<>\"\",CALC.D!$F$10=\"4 ou mais\",$AV$27=8,CALC.D!$G$59=$BQ$26),\"\",0)","v":0}]
[]
["DOCUMENTO PARA RESPONSABILIDADE CIVIL",null,null,null,null,null,null,null,null,null,null,null,null,null,null,null,null,null,null,null,null,null,null,null,null,null,null,null,"BACKUP"]
["NORMA",null,null,"ANCORAGEM",null,null,"RESULTADO CERIM",null,null,null,"RESULTADO CPFL",null,null,null,null,null,null,null,null,null,null,null,null,null,null,null,null,null,"Prezado Consumidor, o Padrão calculado segue os critérios da Tabela 9 da NTCD04 CERIM ATÉ a Categoria C6 (Tensão de Fornecimento em 127/220)"]
[{"$f":"CALC.D!AB20","v":2},null,null,{"$f":"IF(AND(CALC.D!AB20<>\"\",CALC.D!E64<>\"\"),CALC.D!AB8,\"\")","v":""},null,null,{"$f":"IF(AND(A53=1,OR(D53=3,D53=4)),\"CONFORME ANCORAGEM ESCOLHIDA, APRESENTAR DOCUMENTO DE RESPONSABILIDADE TÉCNICA CIVIL\",IF(A53=1,\"CONFORME ANCORAGEM ESCOLHIDA, NÃO É NECESSÁRIO ART (ENGENHEIRO) OU RRT (ARQUITETO)\",\"\"))","v":""},null,null,null,{"$f":"IF(AND(A53=2,OR(D53=5,D53=6,D53=7,D53=8)),\"CONFORME ANCORAGEM ESCOLHIDA, APRESENTAR DOCUMENTO DE RESPONSABILIDADE TÉCNICA CIVIL\",IF(A53=2,\"NÃO É NECESSÁRIO APRESENTAÇÃO DESTE DOCUMENTO\",\"\"))","v":"NÃO É NECESSÁRIO APRESENTAÇÃO DESTE DOCUMENTO"}]
[]
["INFORMATIVO PARA O NÚMERO DE LIGAÇÕES"]
["INFORMATIVO 01",null,null,null,null,"INFORMATIVO 02",null,null,null,null,"INFORMATIVO 03"]
[]
[]
[]
[]
[]
[]
[]
[]
[]
[]
[]
[]
[]
[]
[]
[]
[]
[]
[]
[]
["NORMA CERIM FECOERESP - TABELA 09 - DIMENSIONAMENTO DO PADRÃO DE ENTRADA"]
["CATEGORIA",null,null,"CARGA INSTALADA","DEMANDA","CLASSE DE TENSÃO",null,"LIMITAÇÃO DOS MOTORES",null,null,"RAMAL DE ENTRADA AÉREA DE COBRE (mm²) ISOLAÇÃO 750 V","PROTEÇÃO","ELETRODUTO",null,null,null,"ATERRAMENTO",null,"TIPO DE CAIXA","POSTE",null,null,null,"PONTALETE",null,null,"MOTORES",null,null,null,null,null,null,null,null,null,null,null,null,null,null,null,null,null,null,null,null,null,null,null,null,null,null,"FACE A",{"$f":"IF(AND(CALC.D!AB15=0,AV83<=AD82,CALC.D!E64=TABELAS!AB57),VLOOKUP(BD80,BE80:BO82,BE79,FALSE),IF(AND(CALC.D!AB15=0,AV83<=AD82,CALC.D!E64=TABELAS!AB60),VLOOKUP(BD89,BE89:BO91,BE79,FALSE),IF(AND(CALC.D!AB15=0,AV83<=AD82,CALC.D!E64=TABELAS!AB58),VLOOKUP(BD83,BE83:BO85,BE79,FALSE),IF(AND(CALC.D!AB15=0,AV83<=AD82,CALC.D!E64=TABELAS!AB59),VLOOKUP(BD86,BE86:BO88,BE79,FALSE),IF(AND(OR(CALC.D!AB15=1,AV83>AD82),CALC.D!E64=TABELAS!AB57),VLOOKUP(BD80,BP80:BU82,BE79,FALSE),IF(AND(OR(CALC.D!AB15=1,AV83>AD82),CALC.D!E64=TABELAS!AB60),VLOOKUP(BD89,BP89:BU91,BE79,FALSE),IF(AND(OR(CALC.D!AB15=1,AV83>AD82),CALC.D!E64=TABELAS!AB58),VLOOKUP(BD83,BP83:BU85,BE79,FALSE),IF(AND(OR(CALC.D!AB15=1,AV83>AD82),CALC.D!E64=TABELAS!AB59),VLOOKUP(BD86,BP86:BU88,BE79,FALSE),\"\"))))))))","v":""},null,null,"A1 MONOFÁSICO","A2 MONOFÁSICO","B1 BIFÁSICO","B2 BIFÁSICO","C1 TRIFÁSICO","C2 TRIFÁSICO","C3 TRIFÁSICO","C4 TRIFÁSICO","C5 TRIFÁSICO","C6 TRIFÁSICO",null,"C7 TRIFÁSICO","C8 TRIFÁSICO","C9 TRIFÁSICO","C10 TRIFÁSICO","C11 TRIFÁSICO"]
[null,null,null,null,null,null,null,null,null,null,null,null,"PVC (NBR 6150)",null,"AÇO GALVANIZADO (NBR 5664)",null,null,null,null,null,null,null,null,null,null,null,"Descrição",null,null,"FN","FF","FFFN",null,"TOTAL",null,"MOTORES",null,null,null,null,null,null,null,null,null,null,null,null,null,null,null,null,null,"LIGAÇÕES",{"$f":"IF(CALC.D!AB20=1,VLOOKUP(CALC.D!$E$64,TABELAS!AB56:AC61,2,FALSE),\"\")","v":""},"FACE A",{"$f":"HLOOKUP(CALC.D!$G$59,DIMENSIONAMENTO!BF78:BU79,2,FALSE)","v":{"$error":"#N/A"}},2,3,4,5,6,7,8,9,10,11,null,2,3,4,5,6]
[null,null,null,null,null,null,null,"FN","FF","FFFN",null,"DISJUNTOR (A)","POL.","DIÂMETRO NOMINAL (DN)","POL.","DIÂMETRO NOMINAL (DN)","CONDUTOR COBRE (mm²)","ELETRODUTO PVC (DN)",null,"AÇO SEÇÃO","TIPO CONCRETO (M X daN)",null,null,"AÇO SEÇÃO",null,null,null,null,null,"Potencia","Potencia","Potencia",null,null,null,"MONO","UNIT","QTDE","BIFASI","UNIT","QTDE","TRIF","UNIT","QTDE","POT. GERAL","CV",null,null,null,null,"MONO","BIFASI","TRIF","POSTE DUPLO T",1,{"$f":"IF(CALC.D!$E$64=TABELAS!AB57,VLOOKUP(CALC.D!$F$10,$BC$80:$BE$82,3,FALSE),0)","v":0},1,{"$f":"IF(AND(CALC.D!AB15=0,CALC.D!$C$6<>\"\",CALC.D!$G$6<>\"\",CALC.D!$R$2<>\"\",CALC.D!$AB$20=1,CALC.D!$F$10<>\"\",CALC.D!$E$64<>\"\"),IF(AND(BC79=1,CALC.D!$G$59=$BF$78,CALC.D!$F$10=1),TABELAS!$AL$57,0))","v":false},{"$f":"IF(AND(CALC.D!$C$6<>\"\",CALC.D!$G$6<>\"\",CALC.D!$R$2<>\"\",CALC.D!$AB$20=1,CALC.D!$F$10<>\"\",CALC.D!$E$64<>\"\"),IF(AND($BC$79=1,CALC.D!$G$59=$BG$78,CALC.D!$F$10=1),TABELAS!$AL$58,0))","v":false},{"$f":"IF(AND(CALC.D!$C$6<>\"\",CALC.D!$G$6<>\"\",CALC.D!$R$2<>\"\",CALC.D!$AB$20=1,CALC.D!$F$10<>\"\",CALC.D!$E$64<>\"\"),IF(AND($BC$79=1,CALC.D!$G$59=$BH$78,CALC.D!$F$10=1),TABELAS!AL59,0))","v":false},{"$f":"IF(AND(CALC.D!$C$6<>\"\",CALC.D!$G$6<>\"\",CALC.D!$R$2<>\"\",CALC.D!$AB$20=1,CALC.D!$F$10<>\"\",CALC.D!$E$64<>\"\"),IF(AND($BC$79=1,CALC.D!$G$59=$BI$78,CALC.D!$F$10=1),TABELAS!AL60,0))","v":false},{"$f":"IF(AND(CALC.D!$C$6<>\"\",CALC.D!$G$6<>\"\",CALC.D!$R$2<>\"\",CALC.D!$AB$20=1,CALC.D!$F$10<>\"\",CALC.D!$E$64<>\"\"),IF(AND($BC$79=1,CALC.D!$G$59=$BJ$78,CALC.D!$F$10=1),TABELAS!AL61,0))","v":false},{"$f":"IF(AND(CALC.D!$C$6<>\"\",CALC.D!$G$6<>\"\",CALC.D!$R$2<>\"\",CALC.D!$AB$20=1,CALC.D!$F$10<>\"\",CALC.D!$E$64<>\"\"),IF(AND($BC$79=1,CALC.D!$G$59=$BK$78,CALC.D!$F$10=1),TABELAS!AL62,0))","v":false},{"$f":"IF(AND(CALC.D!$C$6<>\"\",CALC.D!$G$6<>\"\",CALC.D!$R$2<>\"\",CALC.D!$AB$20=1,CALC.D!$F$10<>\"\",CALC.D!$E$64<>\"\"),IF(AND($BC$79=1,CALC.D!$G$59=$BL$78,CALC.D!$F$10=1),TABELAS!AL63,0))","v":false},{"$f":"IF(AND(CALC.D!$C$6<>\"\",CALC.D!$G$6<>\"\",CALC.D!$R$2<>\"\",CALC.D!$AB$20=1,CALC.D!$F$10<>\"\",CALC.D!$E$64<>\"\"),IF(AND($BC$79=1,CALC.D!$G$59=$BM$78,CALC.D!$F$10=1),TABELAS!AL64,0))","v":false},{"$f":"IF(AND(CALC.D!$C$6<>\"\",CALC.D!$G$6<>\"\",CALC.D!$R$2<>\"\",CALC.D!$AB$20=1,CALC.D!$F$10<>\"\",CALC.D!$E$64<>\"\"),IF(AND($BC$79=1,CALC.D!$G$59=$BN$78,CALC.D!$F$10=1),TABELAS!$AL65,0))","v":false},{"$f":"IF(AND(CALC.D!$C$6<>\"\",CALC.D!$G$6<>\"\",CALC.D!$R$2<>\"\",CALC.D!$AB$20=1,CALC.D!$F$10<>\"\",CALC.D!$E$64<>\"\"),IF(AND($BC$79=1,CALC.D!$G$59=$BO$78,CALC.D!$F$10=1),TABELAS!$AL66,0))","v":false},1,{"$f":"IF(AND(OR(CALC.D!AB15=1,AV83>AD82),CALC.D!$C$6<>\"\",CALC.D!$G$6<>\"\",CALC.D!$R$2<>\"\",CALC.D!$AB$20=1,CALC.D!$F$10<>\"\",CALC.D!$E$64<>\"\"),IF(AND($BC$79=1,CALC.D!$G$59=$BQ$78,CALC.D!$F$10=1),TABELAS!$AL$67,0))","v":false},{"$f":"IF(AND(OR(CALC.D!AB15=1,AV83>AD82),CALC.D!$C$6<>\"\",CALC.D!$G$6<>\"\",CALC.D!$R$2<>\"\",CALC.D!$AB$20=1,CALC.D!$F$10<>\"\",CALC.D!$E$64<>\"\"),IF(AND($BC$79=1,CALC.D!$G$59=$BR$78,CALC.D!$F$10=1),TABELAS!$AL$68,0))","v":false},{"$f":"IF(AND(OR(CALC.D!AB15=1,AV83>AD82),CALC.D!$C$6<>\"\",CALC.D!$G$6<>\"\",CALC.D!$R$2<>\"\",CALC.D!$AB$20=1,CALC.D!$F$10<>\"\",CALC.D!$E$64<>\"\"),IF(AND($BC$79=1,CALC.D!$G$59=$BS$78,CALC.D!$F$10=1),TABELAS!$AL$69,0))","v":false},{"$f":"IF(AND(OR(CALC.D!AB15=1,AV83>AD82),CALC.D!$C$6<>\"\",CALC.D!$G$6<>\"\",CALC.D!$R$2<>\"\",CALC.D!$AB$20=1,CALC.D!$F$10<>\"\",CALC.D!$E$64<>\"\"),IF(AND($BC$79=1,CALC.D!$G$59=$BT$78,CALC.D!$F$10=1),TABELAS!$AL$69,0))","v":false},{"$f":"IF(AND(OR(CALC.D!AB15=1,AV83>AD82),CALC.D!$C$6<>\"\",CALC.D!$G$6<>\"\",CALC.D!$R$2<>\"\",CALC.D!$AB$20=1,CALC.D!$F$10<>\"\",CALC.D!$E$64<>\"\"),IF(AND($BC$79=1,CALC.D!$G$59=$BU$78,CALC.D!$F$10=1),TABELAS!$AL$71,0))","v":false}]
[{"$f":"IF(AND(CALC.D!$B$60<=D81,$AS$86=0,$AT$84=0,$AS$84<=0,CALC.D!$AB$20=1),1,0)","v":0},{"$f":"A81","v":0},"A1 MONOFÁSICO",5,"-","115 MONOFÁSICO","127 MONOFÁSICO","-","-","-","10 mm²","DJ 50 A","3/4\"PVC - 1\"AÇO",25,"1\"",25,"10 mm²","25 mm²","II, IV, VI, E","CIRCULAR Ø EXT. 101,6 mm PAREDE 4,75 mm OU QUAD. EXT. 80 mm PAREDE 3,0 mm","7,5 X 90",null,null,"CIRCULAR Ø EXT. 101,6 mm PAREDE 4,75 mm OU QUAD. EXT. 80 mm PAREDE 3,0 mm",null,"10 mm² - Duplex","1CV",1,{"$f":"AD81","v":1050},1050,"x","X","1CV",{"$f":"IF(AND(CALC.D!$N$33<>\"\",CALC.D!$L$33<>\"\",CALCULO!$D$7=2,CALC.D!$T$33>0,CALC.D!$AB$20=1),CALC.D!$V$33/CALC.D!$T$33,0)","v":0},{"$f":"IF(AND(AH81>0,CALC.D!$AB$20=1),IF(AH81<=$W$4,$W$4,IF(AH81<=$W$5,$W$5,IF(AH81<=$W$6,$W$6,IF(AH81<=$W$7,$W$7,IF(AH81<=$W$8,$W$8,IF(AH81<=$X$9,$X$9,IF(AH81<=$X$11,$X$11,IF(AH81<=$Y$12,$Y$12,IF(AH81<=$Y$14,$Y$14,IF(AH81<=$Y$15,$Y$15,IF(AH81<=$Y$16,$Y$16))))))))))),0)","v":0},{"$f":"IF(AND(CALC.D!$L33<>\"\",CALC.D!$N33<>\"\",CALC.D!$T33<>\"\",CALC.D!$L33=\"MONOFÁSICO FN\",CALC.D!$AB$20=1),VLOOKUP(\"MONOFÁSICO FN\",CALC.D!$L33:$V33,11,FALSE),\"\")","v":""},{"$f":"IF(AND(AJ81<>\"\",AL81<>\"\"),AJ81/AL81,\"\")","v":""},{"$f":"IF(AND(AJ81<>\"\",CALC.D!$AB$20=1),CALC.D!T33,\"\")","v":""},{"$f":"IF(AND(CALC.D!$L33<>\"\",CALC.D!$N33<>\"\",CALC.D!$T33<>\"\",CALC.D!$L33=\"BIFÁSICO FFN\",CALC.D!$AB$20=1),VLOOKUP(\"BIFÁSICO FFN\",CALC.D!$L33:$V33,11,FALSE),\"\")","v":""},{"$f":"IF(AND(AM81<>\"\",AO81<>\"\"),AM81/AO81,\"\")","v":""},{"$f":"IF(AND(AM81<>\"\",CALC.D!$AB$20=1),CALC.D!T33,\"\")","v":""},{"$f":"IF(AND(CALC.D!$L33<>\"\",CALC.D!$N33<>\"\",CALC.D!$T33<>\"\",CALC.D!$L33=\"TRIFÁSICO FFFN\",CALC.D!$AB$20=1),VLOOKUP(\"TRIFÁSICO FFFN\",CALC.D!$L33:$V33,11,FALSE),\"\")","v":""},{"$f":"IF(AND(AP81<>\"\",AR81<>\"\"),AP81/AR81,\"\")","v":""},{"$f":"IF(AND(AP81<>\"\",CALC.D!$AB$20=1),CALC.D!T33,\"\")","v":""},"POTENCIA","CV","PESO","MAIOR MONO","MAIOR BIFASI","MAIOR TRIF",{"$f":"IF(AND(CALC.D!$L$33<>\"\",CALC.D!$L$33=\"MONOFÁSICO FN\",CALC.D!$AB$20=1),VLOOKUP(\"MONOFÁSICO FN\",CALC.D!$L$33:$V$33,11,FALSE),0)","v":0},{"$f":"IF(AND(CALC.D!$L$33<>\"\",CALC.D!$L$33=\"BIFÁSICO FFN\",CALC.D!$AB$20=1),VLOOKUP(\"BIFÁSICO FFN\",CALC.D!$L$33:$V$33,11,FALSE),0)","v":0},{"$f":"IF(AND(CALC.D!$L$33<>\"\",CALC.D!$L$33=\"TRIFÁSICO FFFN\",CALC.D!$AB$20=1),VLOOKUP(\"TRIFÁSICO FFFN\",CALC.D!$L$33:$V$33,11,FALSE),0)","v":0},null,2,null,2,{"$f":"IF(AND(CALC.D!$C$6<>\"\",CALC.D!$G$6<>\"\",CALC.D!$R$2<>\"\",CALC.D!$AB$20=1,CALC.D!$F$10<>\"\",CALC.D!$E$64<>\"\"),IF(AND(BC79=1,CALC.D!$G$59=$BF$78,CALC.D!$F$10=2),TABELAS!$AL$57,0))","v":false},{"$f":"IF(AND(CALC.D!$C$6<>\"\",CALC.D!$G$6<>\"\",CALC.D!$R$2<>\"\",CALC.D!$AB$20=1,CALC.D!$F$10<>\"\",CALC.D!$E$64<>\"\"),IF(AND($BC$79=1,CALC.D!$G$59=$BG$78,CALC.D!$F$10=2),TABELAS!$AL$58,0))","v":false},{"$f":"IF(AND(CALC.D!$C$6<>\"\",CALC.D!$G$6<>\"\",CALC.D!$R$2<>\"\",CALC.D!$AB$20=1,CALC.D!$F$10<>\"\",CALC.D!$E$64<>\"\"),IF(AND($BC$79=1,CALC.D!$G$59=$BH$78,CALC.D!$F$10=2),TABELAS!AL59,0))","v":false},{"$f":"IF(AND(CALC.D!$C$6<>\"\",CALC.D!$G$6<>\"\",CALC.D!$R$2<>\"\",CALC.D!$AB$20=1,CALC.D!$F$10<>\"\",CALC.D!$E$64<>\"\"),IF(AND($BC$79=1,CALC.D!$G$59=$BI$78,CALC.D!$F$10=2),TABELAS!AL60,0))","v":false},{"$f":"IF(AND(CALC.D!$C$6<>\"\",CALC.D!$G$6<>\"\",CALC.D!$R$2<>\"\",CALC.D!$AB$20=1,CALC.D!$F$10<>\"\",CALC.D!$E$64<>\"\"),IF(AND($BC$79=1,CALC.D!$G$59=$BJ$78,CALC.D!$F$10=2),TABELAS!AL61,0))","v":false},{"$f":"IF(AND(CALC.D!$C$6<>\"\",CALC.D!$G$6<>\"\",CALC.D!$R$2<>\"\",CALC.D!$AB$20=1,CALC.D!$F$10<>\"\",CALC.D!$E$64<>\"\"),IF(AND($BC$79=1,CALC.D!$G$59=$BK$78,CALC.D!$F$10=2),TABELAS!AL62,0))","v":false},{"$f":"IF(AND(CALC.D!$C$6<>\"\",CALC.D!$G$6<>\"\",CALC.D!$R$2<>\"\",CALC.D!$AB$20=1,CALC.D!$F$10<>\"\",CALC.D!$E$64<>\"\"),IF(AND($BC$79=1,CALC.D!$G$59=$BL$78,CALC.D!$F$10=2),TABELAS!AL63,0))","v":false},{"$f":"IF(AND(CALC.D!$C$6<>\"\",CALC.D!$G$6<>\"\",CALC.D!$R$2<>\"\",CALC.D!$AB$20=1,CALC.D!$F$10<>\"\",CALC.D!$E$64<>\"\"),IF(AND($BC$79=1,CALC.D!$G$59=$BM$78,CALC.D!$F$10=2),TABELAS!AL64,0))","v":false},{"$f":"IF(AND(CALC.D!$C$6<>\"\",CALC.D!$G$6<>\"\",CALC.D!$R$2<>\"\",CALC.D!$AB$20=1,CALC.D!$F$10<>\"\",CALC.D!$E$64<>\"\"),IF(AND($BC$79=1,CALC.D!$G$59=$BN$78,CALC.D!$F$10=2),TABELAS!$AL65,0))","v":false},{"$f":"IF(AND(CALC.D!$C$6<>\"\",CALC.D!$G$6<>\"\",CALC.D!$R$2<>\"\",CALC.D!$AB$20=1,CALC.D!$F$10<>\"\",CALC.D!$E$64<>\"\"),IF(AND($BC$79=1,CALC.D!$G$59=$BO$78,CALC.D!$F$10=2),TABELAS!$AL66,0))","v":false},2,{"$f":"IF(AND(OR(CALC.D!AB15=1,AV83>AD82),CALC.D!$C$6<>\"\",CALC.D!$G$6<>\"\",CALC.D!$R$2<>\"\",CALC.D!$AB$20=1,CALC.D!$F$10<>\"\",CALC.D!$E$64<>\"\"),IF(AND($BC$79=1,CALC.D!$G$59=$BQ$78,CALC.D!$F$10=2),TABELAS!$AL$67,0))","v":false},{"$f":"IF(AND(OR(CALC.D!AB15=1,AV83>AD82),CALC.D!$C$6<>\"\",CALC.D!$G$6<>\"\",CALC.D!$R$2<>\"\",CALC.D!$AB$20=1,CALC.D!$F$10<>\"\",CALC.D!$E$64<>\"\"),IF(AND($BC$79=1,CALC.D!$G$59=$BR$78,CALC.D!$F$10=2),TABELAS!$AL$68,0))","v":false},{"$f":"IF(AND(OR(CALC.D!AB15=1,AV83>AD82),CALC.D!$C$6<>\"\",CALC.D!$G$6<>\"\",CALC.D!$R$2<>\"\",CALC.D!$AB$20=1,CALC.D!$F$10<>\"\",CALC.D!$E$64<>\"\"),IF(AND($BC$79=1,CALC.D!$G$59=$BS$78,CALC.D!$F$10=2),TABELAS!$AL$69,0))","v":false},{"$f":"IF(AND(OR(CALC.D!AB15=1,AV83>AD82),CALC.D!$C$6<>\"\",CALC.D!$G$6<>\"\",CALC.D!$R$2<>\"\",CALC.D!$AB$20=1,CALC.D!$F$10<>\"\",CALC.D!$E$64<>\"\"),IF(AND($BC$79=1,CALC.D!$G$59=$BT$78,CALC.D!$F$10=2),TABELAS!$AL$69,0))","v":false},{"$f":"IF(AND(OR(CALC.D!AB15=1,AV83>AD82),CALC.D!$C$6<>\"\",CALC.D!$G$6<>\"\",CALC.D!$R$2<>\"\",CALC.D!$AB$20=1,CALC.D!$F$10<>\"\",CALC.D!$E$64<>\"\"),IF(AND($BC$79=1,CALC.D!$G$59=$BU$78,CALC.D!$F$10=2),TABELAS!$AL$71,0))","v":false}]
[{"$f":"IF(AND(CALC.D!$B$60<=D82,AV83<=AC81,$AS$86=0,$AT$84=0,CALC.D!$AB$20=1),1,0)","v":0},{"$f":"A82-A81","v":0},"A2 MONOFÁSICO",8,"-","115 MONOFÁSICO","127 MONOFÁSICO",1,"-","-","25 mm²","DJ 70 A","3/4\"PVC - 1\"AÇO",25,"1\"",25,"16 mm²","25 mm²","II, IV, VI, E","CIRCULAR Ø EXT. 101,6 mm PAREDE 4,75 mm OU QUAD. EXT. 80 mm PAREDE 3,0 mm","7,5 X 90",null,null,"CIRCULAR Ø EXT. 101,6 mm PAREDE 4,75 mm OU QUAD. EXT. 80 mm PAREDE 3,0 mm",null,"10 mm² - Triplex","2CV",2,{"$f":"AD82","v":1950},1950,1950,"X","2CV",{"$f":"IF(AND(CALC.D!$N$34<>\"\",CALC.D!$L$34<>\"\",CALCULO!$D$7=2,CALC.D!$T$34>0,CALC.D!$AB$20=1),CALC.D!$V$34/CALC.D!$T$34,0)","v":0},{"$f":"IF(AND(AH82>0,CALC.D!$AB$20=1),IF(AH82<=$W$4,$W$4,IF(AH82<=$W$5,$W$5,IF(AH82<=$W$6,$W$6,IF(AH82<=$W$7,$W$7,IF(AH82<=$W$8,$W$8,IF(AH82<=$X$9,$X$9,IF(AH82<=$X$11,$X$11,IF(AH82<=$Y$12,$Y$12,IF(AH82<=$Y$14,$Y$14,IF(AH82<=$Y$15,$Y$15,IF(AH82<=$Y$16,$Y$16))))))))))),0)","v":0},{"$f":"IF(AND(CALC.D!$L34<>\"\",CALC.D!$N34<>\"\",CALC.D!$T34<>\"\",CALC.D!$L34=\"MONOFÁSICO FN\",CALC.D!$AB$20=1),VLOOKUP(\"MONOFÁSICO FN\",CALC.D!$L34:$V34,11,FALSE),\"\")","v":""},{"$f":"IF(AND(AJ82<>\"\",AL82<>\"\"),AJ82/AL82,\"\")","v":""},{"$f":"IF(AND(AJ82<>\"\",CALC.D!$AB$20=1),CALC.D!T34,\"\")","v":""},{"$f":"IF(AND(CALC.D!$L34<>\"\",CALC.D!$N34<>\"\",CALC.D!$T34<>\"\",CALC.D!$L34=\"BIFÁSICO FFN\",CALC.D!$AB$20=1),VLOOKUP(\"BIFÁSICO FFN\",CALC.D!$L34:$V34,11,FALSE),\"\")","v":""},{"$f":"IF(AND(AM82<>\"\",AO82<>\"\"),AM82/AO82,\"\")","v":""},{"$f":"IF(AND(AM82<>\"\",CALC.D!$AB$20=1),CALC.D!T34,\"\")","v":""},{"$f":"IF(AND(CALC.D!$L34<>\"\",CALC.D!$N34<>\"\",CALC.D!$T34<>\"\",CALC.D!$L34=\"TRIFÁSICO FFFN\",CALC.D!$AB$20=1),VLOOKUP(\"TRIFÁSICO FFFN\",CALC.D!$L34:$V34,11,FALSE),\"\")","v":""},{"$f":"IF(AND(AP82<>\"\",AR82<>\"\"),AP82/AR82,\"\")","v":""},{"$f":"IF(AND(AP82<>\"\",CALC.D!$AB$20=1),CALC.D!T34,\"\")","v":""},{"$f":"LARGE(AV83:AX83,1)","v":0},{"$f":"IF(AS82>0,VLOOKUP(AS82,AC81:AG90,5,FALSE),0)","v":0},"PESO",null,null,null,{"$f":"IF(AND(CALC.D!$L$34<>\"\",CALC.D!$L$34=\"MONOFÁSICO FN\",CALC.D!$AB$20=1),VLOOKUP(\"MONOFÁSICO FN\",CALC.D!$L$34:$V$34,11,FALSE),0)","v":0},{"$f":"IF(AND(CALC.D!$L$34<>\"\",CALC.D!$L$34=\"BIFÁSICO FFN\",CALC.D!$AB$20=1),VLOOKUP(\"BIFÁSICO FFN\",CALC.D!$L$34:$V$34,11,FALSE),0)","v":0},{"$f":"IF(AND(CALC.D!$L$34<>\"\",CALC.D!$L$34=\"TRIFÁSICO FFFN\",CALC.D!$AB$20=1),VLOOKUP(\"TRIFÁSICO FFFN\",CALC.D!$L$34:$V$34,11,FALSE),0)","v":0},null,"3 ou mais",null,3,{"$f":"IF(AND(CALC.D!$C$6<>\"\",CALC.D!$G$6<>\"\",CALC.D!$R$2<>\"\",CALC.D!$AB$20=1,CALC.D!$F$10<>\"\",CALC.D!$E$64<>\"\"),IF(AND(BC79=1,CALC.D!$G$59=$BF$78,CALC.D!$F$10=\"3 ou mais\"),\"Consultar Normas de Ligação Agrupada\",0))","v":false},{"$f":"IF(AND(CALC.D!$C$6<>\"\",CALC.D!$G$6<>\"\",CALC.D!$R$2<>\"\",CALC.D!$AB$20=1,CALC.D!$F$10<>\"\",CALC.D!$E$64<>\"\"),IF(AND($BC$79=1,CALC.D!$G$59=$BG$78,CALC.D!$F$10=\"3 ou mais\"),\"Consultar Normas de Ligação Agrupada\",0))","v":false},{"$f":"IF(AND(CALC.D!$C$6<>\"\",CALC.D!$G$6<>\"\",CALC.D!$R$2<>\"\",CALC.D!$AB$20=1,CALC.D!$F$10<>\"\",CALC.D!$E$64<>\"\"),IF(AND($BC$79=1,CALC.D!$G$59=$BH$78,CALC.D!$F$10=\"3 ou mais\"),\"Consultar Normas de Ligação Agrupada\",0))","v":false},{"$f":"IF(AND(CALC.D!$C$6<>\"\",CALC.D!$G$6<>\"\",CALC.D!$R$2<>\"\",CALC.D!$AB$20=1,CALC.D!$F$10<>\"\",CALC.D!$E$64<>\"\"),IF(AND($BC$79=1,CALC.D!$G$59=$BI$78,CALC.D!$F$10=\"3 ou mais\"),\"Consultar Normas de Ligação Agrupada\",0))","v":false},{"$f":"IF(AND(CALC.D!$C$6<>\"\",CALC.D!$G$6<>\"\",CALC.D!$R$2<>\"\",CALC.D!$AB$20=1,CALC.D!$F$10<>\"\",CALC.D!$E$64<>\"\"),IF(AND($BC$79=1,CALC.D!$G$59=$BJ$78,CALC.D!$F$10=\"3 ou mais\"),\"Consultar Normas de Ligação Agrupada\",0))","v":false},{"$f":"IF(AND(CALC.D!$C$6<>\"\",CALC.D!$G$6<>\"\",CALC.D!$R$2<>\"\",CALC.D!$AB$20=1,CALC.D!$F$10<>\"\",CALC.D!$E$64<>\"\"),IF(AND($BC$79=1,CALC.D!$G$59=$BK$78,CALC.D!$F$10=\"3 ou mais\"),\"Consultar Normas de Ligação Agrupada\",0))","v":false},{"$f":"IF(AND(CALC.D!$C$6<>\"\",CALC.D!$G$6<>\"\",CALC.D!$R$2<>\"\",CALC.D!$AB$20=1,CALC.D!$F$10<>\"\",CALC.D!$E$64<>\"\"),IF(AND($BC$79=1,CALC.D!$G$59=$BL$78,CALC.D!$F$10=\"3 ou mais\"),\"Consultar Normas de Ligação Agrupada\",0))","v":false},{"$f":"IF(AND(CALC.D!$C$6<>\"\",CALC.D!$G$6<>\"\",CALC.D!$R$2<>\"\",CALC.D!$AB$20=1,CALC.D!$F$10<>\"\",CALC.D!$E$64<>\"\"),IF(AND($BC$79=1,CALC.D!$G$59=$BM$78,CALC.D!$F$10=\"3 ou mais\"),\"Consultar Normas de Ligação Agrupada\",0))","v":false},{"$f":"IF(AND(CALC.D!$C$6<>\"\",CALC.D!$G$6<>\"\",CALC.D!$R$2<>\"\",CALC.D!$AB$20=1,CALC.D!$F$10<>\"\",CALC.D!$E$64<>\"\"),IF(AND($BC$79=1,CALC.D!$G$59=$BN$78,CALC.D!$F$10=\"3 ou mais\"),\"Consultar Normas de Ligação Agrupada\",0))","v":false},{"$f":"IF(AND(CALC.D!$C$6<>\"\",CALC.D!$G$6<>\"\",CALC.D!$R$2<>\"\",CALC.D!$AB$20=1,CALC.D!$F$10<>\"\",CALC.D!$E$64<>\"\"),IF(AND($BC$79=1,CALC.D!$G$59=$BO$78,CALC.D!$F$10=\"3 ou mais\"),\"Consultar Normas de Ligação Agrupada\",0))","v":false},3,{"$f":"IF(AND(OR(CALC.D!AB15=1,AV83>AD82),CALC.D!$C$6<>\"\",CALC.D!$G$6<>\"\",CALC.D!$R$2<>\"\",CALC.D!$AB$20=1,CALC.D!$F$10<>\"\",CALC.D!$E$64<>\"\"),IF(AND($BC$79=1,CALC.D!$G$59=$BQ$78,CALC.D!$F$10=\"3 ou mais\"),\"Consultar Normas de Ligação Agrupada\",0))","v":false},{"$f":"IF(AND(OR(CALC.D!AB15=1,AV83>AD82),CALC.D!$C$6<>\"\",CALC.D!$G$6<>\"\",CALC.D!$R$2<>\"\",CALC.D!$AB$20=1,CALC.D!$F$10<>\"\",CALC.D!$E$64<>\"\"),IF(AND($BC$79=1,CALC.D!$G$59=$BR$78,CALC.D!$F$10=\"3 ou mais\"),\"Consultar Normas de Ligação Agrupada\",0))","v":false},{"$f":"IF(AND(OR(CALC.D!AB15=1,AV83>AD82),CALC.D!$C$6<>\"\",CALC.D!$G$6<>\"\",CALC.D!$R$2<>\"\",CALC.D!$AB$20=1,CALC.D!$F$10<>\"\",CALC.D!$E$64<>\"\"),IF(AND($BC$79=1,CALC.D!$G$59=$BS$78,CALC.D!$F$10=\"3 ou mais\"),\"Consultar Normas de Ligação Agrupada\",0))","v":false},{"$f":"IF(AND(OR(CALC.D!AB15=1,AV83>AD82),CALC.D!$C$6<>\"\",CALC.D!$G$6<>\"\",CALC.D!$R$2<>\"\",CALC.D!$AB$20=1,CALC.D!$F$10<>\"\",CALC.D!$E$64<>\"\"),IF(AND($BC$79=1,CALC.D!$G$59=$BT$78,CALC.D!$F$10=\"3 ou mais\"),\"Consultar Normas de Ligação Agrupada\",0))","v":false},{"$f":"IF(AND(OR(CALC.D!AB15=1,AV83>AD82),CALC.D!$C$6<>\"\",CALC.D!$G$6<>\"\",CALC.D!$R$2<>\"\",CALC.D!$AB$20=1,CALC.D!$F$10<>\"\",CALC.D!$E$64<>\"\"),IF(AND($BC$79=1,CALC.D!$G$59=$BU$78,CALC.D!$F$10=\"3 ou mais\"),\"Consultar Normas de Ligação Agrupada\",0))","v":false}]
[{"$f":"IF(AND(CALC.D!$B$60<=D83,$AV$83<=$AD$81,$AS$86=0,AW83<=AE82,CALC.D!$AB$20=1),1,0)","v":0},0,"B1 BIFÁSICO",12,"-","115/230 (BIFÁSICO OU TRIFÁSICO)","127/220 (BIFÁSICO OU TRIFÁSICO)",1,2,"-","16 mm²","DJ 60 A","1\"PVC - 1 1/4\"AÇO",32,"1 1/4\"",32,"16 mm²","25 mm²","II, IV, VI, E","CIRCULAR Ø EXT. 101,6 mm PAREDE 4,75 mm OU QUAD. EXT. 80 mm PAREDE 3,0 mm","7,5 X 90",null,null,"CIRCULAR Ø EXT. 101,6 mm PAREDE 4,75 mm OU QUAD. EXT. 80 mm PAREDE 3,0 mm",null,"16 mm² Triplex","3CV",3,{"$f":"AD83","v":2950},2950,2950,"X","3CV",{"$f":"IF(AND(CALC.D!$N$35<>\"\",CALC.D!$L$35<>\"\",CALCULO!$D$7=2,CALC.D!$T$35>0,CALC.D!$AB$20=1),CALC.D!$V$35/CALC.D!$T$35,0)","v":0},{"$f":"IF(AND(AH83>0,CALC.D!$AB$20=1),IF(AH83<=$W$4,$W$4,IF(AH83<=$W$5,$W$5,IF(AH83<=$W$6,$W$6,IF(AH83<=$W$7,$W$7,IF(AH83<=$W$8,$W$8,IF(AH83<=$X$9,$X$9,IF(AH83<=$X$11,$X$11,IF(AH83<=$Y$12,$Y$12,IF(AH83<=$Y$14,$Y$14,IF(AH83<=$Y$15,$Y$15,IF(AH83<=$Y$16,$Y$16))))))))))),0)","v":0},{"$f":"IF(AND(CALC.D!$L35<>\"\",CALC.D!$N35<>\"\",CALC.D!$T35<>\"\",CALC.D!$L35=\"MONOFÁSICO FN\",CALC.D!$AB$20=1),VLOOKUP(\"MONOFÁSICO FN\",CALC.D!$L35:$V35,11,FALSE),\"\")","v":""},"",{"$f":"IF(AND(AJ83<>\"\",CALC.D!$AB$20=1),CALC.D!T35,\"\")","v":""},{"$f":"IF(AND(CALC.D!$L35<>\"\",CALC.D!$N35<>\"\",CALC.D!$T35<>\"\",CALC.D!$L35=\"BIFÁSICO FFN\",CALC.D!$AB$20=1),VLOOKUP(\"BIFÁSICO FFN\",CALC.D!$L35:$V35,11,FALSE),\"\")","v":""},"",{"$f":"IF(AND(AM83<>\"\",CALC.D!$AB$20=1),CALC.D!T35,\"\")","v":""},{"$f":"IF(AND(CALC.D!$L35<>\"\",CALC.D!$N35<>\"\",CALC.D!$T35<>\"\",CALC.D!$L35=\"TRIFÁSICO FFFN\",CALC.D!$AB$20=1),VLOOKUP(\"TRIFÁSICO FFFN\",CALC.D!$L35:$V35,11,FALSE),\"\")","v":""},"",{"$f":"IF(AND(AP83<>\"\",CALC.D!$AB$20=1),CALC.D!T35,\"\")","v":""},"MONO","BIFI",{"$f":"IF(AS82>0,VLOOKUP(AT82,AA81:AB90,2,FALSE),0)","v":0},{"$f":"IF(AND(AS84>0,CALC.D!$AB$20=1,AY89=0),LARGE(AK81:AK87,1),0)","v":0},{"$f":"IF(AND(AT84>0,CALC.D!$AB$20=1,AZ89=0),LARGE(AN81:AN87,1),0)","v":0},{"$f":"IF(AND(AS86>0,CALC.D!$AB$20=1,BA89=0),LARGE(AQ81:AQ87,1),0)","v":0},{"$f":"IF(AND(CALC.D!$L$35<>\"\",CALC.D!$L$35=\"MONOFÁSICO FN\",CALC.D!$AB$20=1),VLOOKUP(\"MONOFÁSICO FN\",CALC.D!$L$35:$V$35,11,FALSE),0)","v":0},{"$f":"IF(AND(CALC.D!$L$35<>\"\",CALC.D!$L$35=\"BIFÁSICO FFN\",CALC.D!$AB$20=1),VLOOKUP(\"BIFÁSICO FFN\",CALC.D!$L$35:$V$35,11,FALSE),0)","v":0},{"$f":"IF(AND(CALC.D!$L$35<>\"\",CALC.D!$L$35=\"TRIFÁSICO FFFN\",CALC.D!$AB$20=1),VLOOKUP(\"TRIFÁSICO FFFN\",CALC.D!$L$35:$V$35,11,FALSE),0)","v":0},"PADRÃO COM PCI",1,{"$f":"IF(CALC.D!$E$64=TABELAS!AB58,VLOOKUP(CALC.D!$F$10,$BC$83:$BE$85,3,FALSE),0)","v":0},4,{"$f":"IF(AND(CALC.D!$C$6<>\"\",CALC.D!$G$6<>\"\",CALC.D!$R$2<>\"\",CALC.D!$AB$20=1,CALC.D!$F$10<>\"\",CALC.D!$E$64<>\"\",CALC.D!$F$10=1,BC79=2,CALC.D!$G$59=$BF$78),TABELAS!$AH$57,0)","v":0},{"$f":"IF(AND(CALC.D!$C$6<>\"\",CALC.D!$G$6<>\"\",CALC.D!$R$2<>\"\",CALC.D!$AB$20=1,CALC.D!$F$10<>\"\",CALC.D!$E$64<>\"\",CALC.D!$F$10=1,$BC$79=2,CALC.D!$G$59=$BG$78),TABELAS!$AH$58,0)","v":0},{"$f":"IF(AND(CALC.D!$C$6<>\"\",CALC.D!$G$6<>\"\",CALC.D!$R$2<>\"\",CALC.D!$AB$20=1,CALC.D!$F$10<>\"\",CALC.D!$E$64<>\"\",CALC.D!$F$10=1,$BC$79=2,CALC.D!$G$59=$BH$78),TABELAS!AH59,0)","v":0},{"$f":"IF(AND(CALC.D!$C$6<>\"\",CALC.D!$G$6<>\"\",CALC.D!$R$2<>\"\",CALC.D!$AB$20=1,CALC.D!$F$10<>\"\",CALC.D!$E$64<>\"\",CALC.D!$F$10=1,$BC$79=2,CALC.D!$G$59=$BI$78),TABELAS!AH60,0)","v":0},{"$f":"IF(AND(CALC.D!$C$6<>\"\",CALC.D!$G$6<>\"\",CALC.D!$R$2<>\"\",CALC.D!$AB$20=1,CALC.D!$F$10<>\"\",CALC.D!$E$64<>\"\",CALC.D!$F$10=1,$BC$79=2,CALC.D!$G$59=$BJ$78),TABELAS!AH61,0)","v":0},{"$f":"IF(AND(CALC.D!$C$6<>\"\",CALC.D!$G$6<>\"\",CALC.D!$R$2<>\"\",CALC.D!$AB$20=1,CALC.D!$F$10<>\"\",CALC.D!$E$64<>\"\",CALC.D!$F$10=1,$BC$79=2,CALC.D!$G$59=$BK$78),TABELAS!AH62,0)","v":0},{"$f":"IF(AND(CALC.D!$C$6<>\"\",CALC.D!$G$6<>\"\",CALC.D!$R$2<>\"\",CALC.D!$AB$20=1,CALC.D!$F$10<>\"\",CALC.D!$E$64<>\"\",CALC.D!$F$10=1,$BC$79=2,CALC.D!$G$59=$BL$78),TABELAS!AH63,0)","v":0},{"$f":"IF(AND(CALC.D!$C$6<>\"\",CALC.D!$G$6<>\"\",CALC.D!$R$2<>\"\",CALC.D!$AB$20=1,CALC.D!$F$10<>\"\",CALC.D!$E$64<>\"\",CALC.D!$F$10=1,$BC$79=2,CALC.D!$G$59=$BM$78),TABELAS!AH64,0)","v":0},{"$f":"IF(AND(CALC.D!$C$6<>\"\",CALC.D!$G$6<>\"\",CALC.D!$R$2<>\"\",CALC.D!$AB$20=1,CALC.D!$F$10<>\"\",CALC.D!$E$64<>\"\",CALC.D!$F$10=1,$BC$79=2,CALC.D!$G$59=$BN$78),TABELAS!$AH65,0)","v":0},{"$f":"IF(AND(CALC.D!$C$6<>\"\",CALC.D!$G$6<>\"\",CALC.D!$R$2<>\"\",CALC.D!$AB$20=1,CALC.D!$F$10<>\"\",CALC.D!$E$64<>\"\",CALC.D!$F$10=1,$BC$79=2,CALC.D!$G$59=$BO$78),TABELAS!$AH66,0)","v":0},4,{"$f":"IF(AND(OR(CALC.D!AB15=1,AV83>AD82),CALC.D!$C$6<>\"\",CALC.D!$G$6<>\"\",CALC.D!$R$2<>\"\",CALC.D!$AB$20=1,CALC.D!$F$10<>\"\",CALC.D!$E$64<>\"\",CALC.D!$F$10=1,$BC$79=2,CALC.D!$G$59=$BQ$78),TABELAS!$AH$67,0)","v":0},{"$f":"IF(AND(OR(CALC.D!AB15=1,AV83>AD82),CALC.D!$C$6<>\"\",CALC.D!$G$6<>\"\",CALC.D!$R$2<>\"\",CALC.D!$AB$20=1,CALC.D!$F$10<>\"\",CALC.D!$E$64<>\"\",CALC.D!$F$10=1,$BC$79=2,CALC.D!$G$59=$BR$78),TABELAS!$AH$68,0)","v":0},{"$f":"IF(AND(OR(CALC.D!AB15=1,AV83>AD82),CALC.D!$C$6<>\"\",CALC.D!$G$6<>\"\",CALC.D!$R$2<>\"\",CALC.D!$AB$20=1,CALC.D!$F$10<>\"\",CALC.D!$E$64<>\"\",CALC.D!$F$10=1,$BC$79=2,CALC.D!$G$59=$BS$78),TABELAS!$AH$69,0)","v":0},{"$f":"IF(AND(OR(CALC.D!AB15=1,AV83>AD82),CALC.D!$C$6<>\"\",CALC.D!$G$6<>\"\",CALC.D!$R$2<>\"\",CALC.D!$AB$20=1,CALC.D!$F$10<>\"\",CALC.D!$E$64<>\"\",CALC.D!$F$10=1,$BC$79=2,CALC.D!$G$59=$BT$78),TABELAS!$AH$70,0)","v":0},{"$f":"IF(AND(OR(CALC.D!AB15=1,AV83>AD82),CALC.D!$C$6<>\"\",CALC.D!$G$6<>\"\",CALC.D!$R$2<>\"\",CALC.D!$AB$20=1,CALC.D!$F$10<>\"\",CALC.D!$E$64<>\"\",CALC.D!$F$10=1,$BC$79=2,CALC.D!$G$59=$BU$78),TABELAS!$AH$71,0)","v":0}]
[{"$f":"IF(AND(CALC.D!$B$60<=D84,$AV$83<=$AD$81,$AS$86=0,$AW$83<=AE83,CALC.D!$AB$20=1),1,0)","v":0},0,"B2 BIFÁSICO",18,"-","115/230 (BIFÁSICO OU TRIFÁSICO)","127/220 (BIFÁSICO OU TRIFÁSICO)",1,3,"-","25 mm²","DJ 80 A","1 1/4\"PVC - 1 1/2\"AÇO",40,"1 1/2\"",40,"16 mm²","25 mm²","III, V, VI, E","CIRCULAR Ø EXT. 101,6 mm PAREDE 4,75 mm OU QUAD. EXT. 80 mm PAREDE 3,0 mm","7,5 X 90",null,null,"CIRCULAR Ø EXT. 101,6 mm PAREDE 4,75 mm OU QUAD. EXT. 80 mm PAREDE 3,0 mm",null,"25 mm² - Triplex","5CV",4,{"$f":"AE84","v":3720},3720,3720,"X","5CV",{"$f":"IF(AND(CALC.D!$N$36<>\"\",CALC.D!$L$36<>\"\",CALCULO!$D$7=2,CALC.D!$T$36>0,CALC.D!$AB$20=1),CALC.D!$V$36/CALC.D!$T$36,0)","v":0},{"$f":"IF(AND(AH84>0,CALC.D!$AB$20=1),IF(AH84<=$W$4,$W$4,IF(AH84<=$W$5,$W$5,IF(AH84<=$W$6,$W$6,IF(AH84<=$W$7,$W$7,IF(AH84<=$W$8,$W$8,IF(AH84<=$X$9,$X$9,IF(AH84<=$X$11,$X$11,IF(AH84<=$Y$12,$Y$12,IF(AH84<=$Y$14,$Y$14,IF(AH84<=$Y$15,$Y$15,IF(AH84<=$Y$16,$Y$16))))))))))),0)","v":0},{"$f":"IF(AND(CALC.D!$L36<>\"\",CALC.D!$N36<>\"\",CALC.D!$T36<>\"\",CALC.D!$L36=\"MONOFÁSICO FN\",CALC.D!$AB$20=1),VLOOKUP(\"MONOFÁSICO FN\",CALC.D!$L36:$V36,11,FALSE),\"\")","v":""},"",{"$f":"IF(AND(AJ84<>\"\",CALC.D!$AB$20=1),CALC.D!T36,\"\")","v":""},{"$f":"IF(AND(CALC.D!$L36<>\"\",CALC.D!$N36<>\"\",CALC.D!$T36<>\"\",CALC.D!$L36=\"BIFÁSICO FFN\",CALC.D!$AB$20=1),VLOOKUP(\"BIFÁSICO FFN\",CALC.D!$L36:$V36,11,FALSE),\"\")","v":""},"",{"$f":"IF(AND(AM84<>\"\",CALC.D!$AB$20=1),CALC.D!T36,\"\")","v":""},{"$f":"IF(AND(CALC.D!$L36<>\"\",CALC.D!$N36<>\"\",CALC.D!$T36<>\"\",CALC.D!$L36=\"TRIFÁSICO FFFN\",CALC.D!$AB$20=1),VLOOKUP(\"TRIFÁSICO FFFN\",CALC.D!$L36:$V36,11,FALSE),\"\")","v":""},"",{"$f":"IF(AND(AP84<>\"\",CALC.D!$AB$20=1),CALC.D!T36,\"\")","v":""},{"$f":"COUNTIF(CALC.D!$L$33:$L$39,\"MONOFÁSICO FN\")","v":0},{"$f":"COUNTIF(CALC.D!$L$33:$L$39,\"BIFÁSICO FFN\")","v":0},null,null,null,null,{"$f":"IF(AND(CALC.D!$L$36<>\"\",CALC.D!$L$36=\"MONOFÁSICO FN\",CALC.D!$AB$20=1),VLOOKUP(\"MONOFÁSICO FN\",CALC.D!$L$36:$V$36,11,FALSE),0)","v":0},{"$f":"IF(AND(CALC.D!$L$36<>\"\",CALC.D!$L$36=\"BIFÁSICO FFN\",CALC.D!$AB$20=1),VLOOKUP(\"BIFÁSICO FFN\",CALC.D!$L$36:$V$36,11,FALSE),0)","v":0},{"$f":"IF(AND(CALC.D!$L$36<>\"\",CALC.D!$L$36=\"TRIFÁSICO FFFN\",CALC.D!$AB$20=1),VLOOKUP(\"TRIFÁSICO FFFN\",CALC.D!$L$36:$V$36,11,FALSE),0)","v":0},null,2,null,5,{"$f":"IF(AND(CALC.D!$C$6<>\"\",CALC.D!$G$6<>\"\",CALC.D!$R$2<>\"\",CALC.D!$AB$20=1,CALC.D!$F$10<>\"\",CALC.D!$E$64<>\"\",CALC.D!$F$10=2,BC79=2,CALC.D!$G$59=$BF$78),TABELAS!AH57,0)","v":0},{"$f":"IF(AND(CALC.D!$C$6<>\"\",CALC.D!$G$6<>\"\",CALC.D!$R$2<>\"\",CALC.D!$AB$20=1,CALC.D!$F$10<>\"\",CALC.D!$E$64<>\"\",CALC.D!$F$10=2,$BC$79=2,CALC.D!$G$59=$BG$78),TABELAS!AH58,0)","v":0},{"$f":"IF(AND(CALC.D!$C$6<>\"\",CALC.D!$G$6<>\"\",CALC.D!$R$2<>\"\",CALC.D!$AB$20=1,CALC.D!$F$10<>\"\",CALC.D!$E$64<>\"\",CALC.D!$F$10=2,$BC$79=2,CALC.D!$G$59=$BH$78),TABELAS!AH59,0)","v":0},{"$f":"IF(AND(CALC.D!$C$6<>\"\",CALC.D!$G$6<>\"\",CALC.D!$R$2<>\"\",CALC.D!$AB$20=1,CALC.D!$F$10<>\"\",CALC.D!$E$64<>\"\",CALC.D!$F$10=2,$BC$79=2,CALC.D!$G$59=$BI$78),TABELAS!AH60,0)","v":0},{"$f":"IF(AND(CALC.D!$C$6<>\"\",CALC.D!$G$6<>\"\",CALC.D!$R$2<>\"\",CALC.D!$AB$20=1,CALC.D!$F$10<>\"\",CALC.D!$E$64<>\"\",CALC.D!$F$10=2,$BC$79=2,CALC.D!$G$59=$BJ$78),TABELAS!AH61,0)","v":0},{"$f":"IF(AND(CALC.D!$C$6<>\"\",CALC.D!$G$6<>\"\",CALC.D!$R$2<>\"\",CALC.D!$AB$20=1,CALC.D!$F$10<>\"\",CALC.D!$E$64<>\"\",CALC.D!$F$10=2,$BC$79=2,CALC.D!$G$59=$BK$78),TABELAS!AH62,0)","v":0},{"$f":"IF(AND(CALC.D!$C$6<>\"\",CALC.D!$G$6<>\"\",CALC.D!$R$2<>\"\",CALC.D!$AB$20=1,CALC.D!$F$10<>\"\",CALC.D!$E$64<>\"\",CALC.D!$F$10=2,$BC$79=2,CALC.D!$G$59=$BL$78),TABELAS!AH63,0)","v":0},{"$f":"IF(AND(CALC.D!$C$6<>\"\",CALC.D!$G$6<>\"\",CALC.D!$R$2<>\"\",CALC.D!$AB$20=1,CALC.D!$F$10<>\"\",CALC.D!$E$64<>\"\",CALC.D!$F$10=2,$BC$79=2,CALC.D!$G$59=$BM$78),TABELAS!AH64,0)","v":0},{"$f":"IF(AND(CALC.D!$C$6<>\"\",CALC.D!$G$6<>\"\",CALC.D!$R$2<>\"\",CALC.D!$AB$20=1,CALC.D!$F$10<>\"\",CALC.D!$E$64<>\"\",CALC.D!$F$10=2,$BC$79=2,CALC.D!$G$59=$BN$78),TABELAS!$AH65,0)","v":0},{"$f":"IF(AND(CALC.D!$C$6<>\"\",CALC.D!$G$6<>\"\",CALC.D!$R$2<>\"\",CALC.D!$AB$20=1,CALC.D!$F$10<>\"\",CALC.D!$E$64<>\"\",CALC.D!$F$10=2,$BC$79=2,CALC.D!$G$59=$BO$78),TABELAS!$AH66,0)","v":0},5,{"$f":"IF(AND(OR(CALC.D!AB15=1,AV83>AD82),CALC.D!$C$6<>\"\",CALC.D!$G$6<>\"\",CALC.D!$R$2<>\"\",CALC.D!$AB$20=1,CALC.D!$F$10<>\"\",CALC.D!$E$64<>\"\",CALC.D!$F$10=2,$BC$79=2,CALC.D!$G$59=$BQ$78),TABELAS!$AH$67,0)","v":0},{"$f":"IF(AND(OR(CALC.D!AB15=1,AV83>AD82),CALC.D!$C$6<>\"\",CALC.D!$G$6<>\"\",CALC.D!$R$2<>\"\",CALC.D!$AB$20=1,CALC.D!$F$10<>\"\",CALC.D!$E$64<>\"\",CALC.D!$F$10=2,$BC$79=2,CALC.D!$G$59=$BR$78),TABELAS!$AH$68,0)","v":0},{"$f":"IF(AND(OR(CALC.D!AB15=1,AV83>AD82),CALC.D!$C$6<>\"\",CALC.D!$G$6<>\"\",CALC.D!$R$2<>\"\",CALC.D!$AB$20=1,CALC.D!$F$10<>\"\",CALC.D!$E$64<>\"\",CALC.D!$F$10=2,$BC$79=2,CALC.D!$G$59=$BS$78),TABELAS!$AH$69,0)","v":0},{"$f":"IF(AND(OR(CALC.D!AB15=1,AV83>AD82),CALC.D!$C$6<>\"\",CALC.D!$G$6<>\"\",CALC.D!$R$2<>\"\",CALC.D!$AB$20=1,CALC.D!$F$10<>\"\",CALC.D!$E$64<>\"\",CALC.D!$F$10=2,$BC$79=2,CALC.D!$G$59=$BT$78),TABELAS!$AH$70,0)","v":0},{"$f":"IF(AND(OR(CALC.D!AB15=1,AV83>AD82),CALC.D!$C$6<>\"\",CALC.D!$G$6<>\"\",CALC.D!$R$2<>\"\",CALC.D!$AB$20=1,CALC.D!$F$10<>\"\",CALC.D!$E$64<>\"\",CALC.D!$F$10=2,$BC$79=2,CALC.D!$G$59=$BU$78),TABELAS!$AH$71,0)","v":0}]
[{"$f":"IF(AND(CALC.D!$B$60<=D85,OR(CALC.D!$B$62<=E85,CALC.D!$B$62=\"\"),$AV$83<=$AD$81,$AX$83<=$AF$85,$AW$83<=$AE$83,CALC.D!$AB$20=1),1,0)","v":0},0,"C1 TRIFÁSICO",75,22,"127/220 (BIFÁSICO OU TRIFÁSICO)",null,1,3,7.5,"16 mm²","DJ 60 A","1 1/4\"PVC - 1 1/2\"AÇO",40,"1 1/2\"",40,"16 mm²","25 mm²","III, V, VI, E",null,"7,5 X 200",null,null,null,null,"10 mm² - Quadruplex","7 1/2CV",5,{"$f":"AE85","v":6570},"X",6570,6570,"7 1/2CV",{"$f":"IF(AND(CALC.D!$N$37<>\"\",CALC.D!$L$37<>\"\",CALCULO!$D$7=2,CALC.D!$T$37>0,CALC.D!$AB$20=1),CALC.D!$V$37/CALC.D!$T$37,0)","v":0},{"$f":"IF(AND(AH85>0,CALC.D!$AB$20=1),IF(AH85<=$W$4,$W$4,IF(AH85<=$W$5,$W$5,IF(AH85<=$W$6,$W$6,IF(AH85<=$W$7,$W$7,IF(AH85<=$W$8,$W$8,IF(AH85<=$X$9,$X$9,IF(AH85<=$X$11,$X$11,IF(AH85<=$Y$12,$Y$12,IF(AH85<=$Y$14,$Y$14,IF(AH85<=$Y$15,$Y$15,IF(AH85<=$Y$16,$Y$16))))))))))),0)","v":0},{"$f":"IF(AND(CALC.D!$L37<>\"\",CALC.D!$N37<>\"\",CALC.D!$T37<>\"\",CALC.D!$L37=\"MONOFÁSICO FN\",CALC.D!$AB$20=1),VLOOKUP(\"MONOFÁSICO FN\",CALC.D!$L37:$V37,11,FALSE),\"\")","v":""},"",{"$f":"IF(AND(AJ85<>\"\",CALC.D!$AB$20=1),CALC.D!T37,\"\")","v":""},{"$f":"IF(AND(CALC.D!$L37<>\"\",CALC.D!$N37<>\"\",CALC.D!$T37<>\"\",CALC.D!$L37=\"BIFÁSICO FFN\",CALC.D!$AB$20=1),VLOOKUP(\"BIFÁSICO FFN\",CALC.D!$L37:$V37,11,FALSE),\"\")","v":""},"",{"$f":"IF(AND(AM85<>\"\",CALC.D!$AB$20=1),CALC.D!T37,\"\")","v":""},{"$f":"IF(AND(CALC.D!$L37<>\"\",CALC.D!$N37<>\"\",CALC.D!$T37<>\"\",CALC.D!$L37=\"TRIFÁSICO FFFN\",CALC.D!$AB$20=1),VLOOKUP(\"TRIFÁSICO FFFN\",CALC.D!$L37:$V37,11,FALSE),\"\")","v":""},"",{"$f":"IF(AND(AP85<>\"\",CALC.D!$AB$20=1),CALC.D!T37,\"\")","v":""},"TRIF",null,null,null,null,null,{"$f":"IF(AND(CALC.D!$L$37<>\"\",CALC.D!$L$37=\"MONOFÁSICO FN\",CALC.D!$AB$20=1),VLOOKUP(\"MONOFÁSICO FN\",CALC.D!$L$37:$V$37,11,FALSE),0)","v":0},{"$f":"IF(AND(CALC.D!$L$37<>\"\",CALC.D!$L$37=\"BIFÁSICO FFN\",CALC.D!$AB$20=1),VLOOKUP(\"BIFÁSICO FFN\",CALC.D!$L$37:$V$37,11,FALSE),0)","v":0},{"$f":"IF(AND(CALC.D!$L$37<>\"\",CALC.D!$L$37=\"TRIFÁSICO FFFN\",CALC.D!$AB$20=1),VLOOKUP(\"TRIFÁSICO FFFN\",CALC.D!$L$37:$V$37,11,FALSE),0)","v":0},null,"3 ou mais",null,6,{"$f":"IF(AND(CALC.D!$C$6<>\"\",CALC.D!$G$6<>\"\",CALC.D!$R$2<>\"\",CALC.D!$AB$20=1,CALC.D!$F$10<>\"\",CALC.D!$E$64<>\"\",CALC.D!$F$10=\"3 ou mais\",BC79=2,CALC.D!$G$59=$BF$78),\"Consultar Normas de Ligação Agrupada\",0)","v":0},{"$f":"IF(AND(CALC.D!$C$6<>\"\",CALC.D!$G$6<>\"\",CALC.D!$R$2<>\"\",CALC.D!$AB$20=1,CALC.D!$F$10<>\"\",CALC.D!$E$64<>\"\",CALC.D!$F$10=\"3 ou mais\",$BC$79=2,CALC.D!$G$59=$BG$78),\"Consultar Normas de Ligação Agrupada\",0)","v":0},{"$f":"IF(AND(CALC.D!$C$6<>\"\",CALC.D!$G$6<>\"\",CALC.D!$R$2<>\"\",CALC.D!$AB$20=1,CALC.D!$F$10<>\"\",CALC.D!$E$64<>\"\",CALC.D!$F$10=\"3 ou mais\",$BC$79=2,CALC.D!$G$59=$BH$78),\"Consultar Normas de Ligação Agrupada\",0)","v":0},{"$f":"IF(AND(CALC.D!$C$6<>\"\",CALC.D!$G$6<>\"\",CALC.D!$R$2<>\"\",CALC.D!$AB$20=1,CALC.D!$F$10<>\"\",CALC.D!$E$64<>\"\",CALC.D!$F$10=\"3 ou mais\",$BC$79=2,CALC.D!$G$59=$BI$78),\"Consultar Normas de Ligação Agrupada\",0)","v":0},{"$f":"IF(AND(CALC.D!$C$6<>\"\",CALC.D!$G$6<>\"\",CALC.D!$R$2<>\"\",CALC.D!$AB$20=1,CALC.D!$F$10<>\"\",CALC.D!$E$64<>\"\",CALC.D!$F$10=\"3 ou mais\",$BC$79=2,CALC.D!$G$59=$BJ$78),\"Consultar Normas de Ligação Agrupada\",0)","v":0},{"$f":"IF(AND(CALC.D!$C$6<>\"\",CALC.D!$G$6<>\"\",CALC.D!$R$2<>\"\",CALC.D!$AB$20=1,CALC.D!$F$10<>\"\",CALC.D!$E$64<>\"\",CALC.D!$F$10=\"3 ou mais\",$BC$79=2,CALC.D!$G$59=$BK$78),\"Consultar Normas de Ligação Agrupada\",0)","v":0},{"$f":"IF(AND(CALC.D!$C$6<>\"\",CALC.D!$G$6<>\"\",CALC.D!$R$2<>\"\",CALC.D!$AB$20=1,CALC.D!$F$10<>\"\",CALC.D!$E$64<>\"\",CALC.D!$F$10=\"3 ou mais\",$BC$79=2,CALC.D!$G$59=$BL$78),\"Consultar Normas de Ligação Agrupada\",0)","v":0},{"$f":"IF(AND(CALC.D!$C$6<>\"\",CALC.D!$G$6<>\"\",CALC.D!$R$2<>\"\",CALC.D!$AB$20=1,CALC.D!$F$10<>\"\",CALC.D!$E$64<>\"\",CALC.D!$F$10=\"3 ou mais\",$BC$79=2,CALC.D!$G$59=$BM$78),\"Consultar Normas de Ligação Agrupada\",0)","v":0},{"$f":"IF(AND(CALC.D!$C$6<>\"\",CALC.D!$G$6<>\"\",CALC.D!$R$2<>\"\",CALC.D!$AB$20=1,CALC.D!$F$10<>\"\",CALC.D!$E$64<>\"\",CALC.D!$F$10=\"3 ou mais\",$BC$79=2,CALC.D!$G$59=$BN$78),\"Consultar Normas de Ligação Agrupada\",0)","v":0},{"$f":"IF(AND(CALC.D!$C$6<>\"\",CALC.D!$G$6<>\"\",CALC.D!$R$2<>\"\",CALC.D!$AB$20=1,CALC.D!$F$10<>\"\",CALC.D!$E$64<>\"\",CALC.D!$F$10=\"3 ou mais\",$BC$79=2,CALC.D!$G$59=$BO$78),\"Consultar Normas de Ligação Agrupada\",0)","v":0},6,{"$f":"IF(AND(OR(CALC.D!AB15=1,AV83>AD82),CALC.D!$C$6<>\"\",CALC.D!$G$6<>\"\",CALC.D!$R$2<>\"\",CALC.D!$AB$20=1,CALC.D!$F$10<>\"\",CALC.D!$E$64<>\"\",CALC.D!$F$10=\"3 ou mais\",$BC$79=2,CALC.D!$G$59=$BQ$78),\"Consultar Normas de Ligação Agrupada\",0)","v":0},{"$f":"IF(AND(OR(CALC.D!AB15=1,AV83>AD82),CALC.D!$C$6<>\"\",CALC.D!$G$6<>\"\",CALC.D!$R$2<>\"\",CALC.D!$AB$20=1,CALC.D!$F$10<>\"\",CALC.D!$E$64<>\"\",CALC.D!$F$10=\"3 ou mais\",$BC$79=2,CALC.D!$G$59=$BR$78),\"Consultar Normas de Ligação Agrupada\",0)","v":0},{"$f":"IF(AND(OR(CALC.D!AB15=1,AV83>AD82),CALC.D!$C$6<>\"\",CALC.D!$G$6<>\"\",CALC.D!$R$2<>\"\",CALC.D!$AB$20=1,CALC.D!$F$10<>\"\",CALC.D!$E$64<>\"\",CALC.D!$F$10=\"3 ou mais\",$BC$79=2,CALC.D!$G$59=$BS$78),\"Consultar Normas de Ligação Agrupada\",0)","v":0},{"$f":"IF(AND(OR(CALC.D!AB15=1,AV83>AD82),CALC.D!$C$6<>\"\",CALC.D!$G$6<>\"\",CALC.D!$R$2<>\"\",CALC.D!$AB$20=1,CALC.D!$F$10<>\"\",CALC.D!$E$64<>\"\",CALC.D!$F$10=\"3 ou mais\",$BC$79=2,CALC.D!$G$59=$BT$78),\"Consultar Normas de Ligação Agrupada\",0)","v":0},{"$f":"IF(AND(OR(CALC.D!AB15=1,AV83>AD82),CALC.D!$C$6<>\"\",CALC.D!$G$6<>\"\",CALC.D!$R$2<>\"\",CALC.D!$AB$20=1,CALC.D!$F$10<>\"\",CALC.D!$E$64<>\"\",CALC.D!$F$10=\"3 ou mais\",$BC$79=2,CALC.D!$G$59=$BU$78),\"Consultar Normas de Ligação Agrupada\",0)","v":0}]
[{"$f":"IF(AND(CALC.D!$B$60<=D86,OR(CALC.D!$B$62<=E86,CALC.D!$B$62=\"\"),$AV$83<=$AD$82,$AX$83<=$AF$86,$AW$83<=$AE$84,CALC.D!$AB$20=1),1,0)","v":0},0,"C2 TRIFÁSICO",75,26,"127/220 (BIFÁSICO OU TRIFÁSICO)",null,2,5,10,"25 mm²","DJ 70 A","1 1/4\"PVC - 2\"AÇO",50,"2\"",50,"16 mm²","25 mm²","III, V, VI, E",null,"7,5 X 200",null,null,null,null,"16 mm² - Quadruplex","10CV",6,{"$f":"AF86","v":8890},"X","X",8890,"10CV",{"$f":"IF(AND(CALC.D!$N$38<>\"\",CALC.D!$L$38<>\"\",CALCULO!$D$7=2,CALC.D!$T$38>0,CALC.D!$AB$20=1),CALC.D!$V$38/CALC.D!$T$38,0)","v":0},{"$f":"IF(AND(AH86>0,CALC.D!$AB$20=1),IF(AH86<=$W$4,$W$4,IF(AH86<=$W$5,$W$5,IF(AH86<=$W$6,$W$6,IF(AH86<=$W$7,$W$7,IF(AH86<=$W$8,$W$8,IF(AH86<=$X$9,$X$9,IF(AH86<=$X$11,$X$11,IF(AH86<=$Y$12,$Y$12,IF(AH86<=$Y$14,$Y$14,IF(AH86<=$Y$15,$Y$15,IF(AH86<=$Y$16,$Y$16))))))))))),0)","v":0},{"$f":"IF(AND(CALC.D!$L38<>\"\",CALC.D!$N38<>\"\",CALC.D!$T38<>\"\",CALC.D!$L38=\"MONOFÁSICO FN\",CALC.D!$AB$20=1),VLOOKUP(\"MONOFÁSICO FN\",CALC.D!$L38:$V38,11,FALSE),\"\")","v":""},"",{"$f":"IF(AND(AJ86<>\"\",CALC.D!$AB$20=1),CALC.D!T38,\"\")","v":""},{"$f":"IF(AND(CALC.D!$L38<>\"\",CALC.D!$N38<>\"\",CALC.D!$T38<>\"\",CALC.D!$L38=\"BIFÁSICO FFN\",CALC.D!$AB$20=1),VLOOKUP(\"BIFÁSICO FFN\",CALC.D!$L38:$V38,11,FALSE),\"\")","v":""},"",{"$f":"IF(AND(AM86<>\"\",CALC.D!$AB$20=1),CALC.D!T38,\"\")","v":""},{"$f":"IF(AND(CALC.D!$L38<>\"\",CALC.D!$N38<>\"\",CALC.D!$T38<>\"\",CALC.D!$L38=\"TRIFÁSICO FFFN\",CALC.D!$AB$20=1),VLOOKUP(\"TRIFÁSICO FFFN\",CALC.D!$L38:$V38,11,FALSE),\"\")","v":""},"",{"$f":"IF(AND(AP86<>\"\",CALC.D!$AB$20=1),CALC.D!T38,\"\")","v":""},{"$f":"COUNTIF(CALC.D!$L$33:$L$39,\"TRIFÁSICO FFFN\")","v":0},null,null,null,null,null,{"$f":"IF(AND(CALC.D!$L$38<>\"\",CALC.D!$L$38=\"MONOFÁSICO FN\",CALC.D!$AB$20=1),VLOOKUP(\"MONOFÁSICO FN\",CALC.D!$L$38:$V$38,11,FALSE),0)","v":0},{"$f":"IF(AND(CALC.D!$L$38<>\"\",CALC.D!$L$38=\"BIFÁSICO FFN\",CALC.D!$AB$20=1),VLOOKUP(\"BIFÁSICO FFN\",CALC.D!$L$38:$V$38,11,FALSE),0)","v":0},{"$f":"IF(AND(CALC.D!$L$38<>\"\",CALC.D!$L$38=\"TRIFÁSICO FFFN\",CALC.D!$AB$20=1),VLOOKUP(\"TRIFÁSICO FFFN\",CALC.D!$L$38:$V$38,11,FALSE),0)","v":0},"CONCRETO ARMADO",1,{"$f":"IF(CALC.D!$E$64=TABELAS!AB59,VLOOKUP(CALC.D!$F$10,$BC$86:$BE$88,3,FALSE),0)","v":0},7,{"$f":"IF(AND(CALC.D!$C$6<>\"\",CALC.D!$G$6<>\"\",CALC.D!$R$2<>\"\",CALC.D!$AB$20=1,CALC.D!$F$10<>\"\",CALC.D!$E$64<>\"\",CALC.D!$F$10=1,BC79=3,CALC.D!$G$59=$BF$78),\"CONFORME TABELA DA NORMA \",0)","v":0},{"$f":"IF(AND(CALC.D!$C$6<>\"\",CALC.D!$G$6<>\"\",CALC.D!$R$2<>\"\",CALC.D!$AB$20=1,CALC.D!$F$10<>\"\",CALC.D!$E$64<>\"\",CALC.D!$F$10=1,$BC$79=3,CALC.D!$G$59=$BG$78),\"CONFORME TABELA DA NORMA \",0)","v":0},{"$f":"IF(AND(CALC.D!$C$6<>\"\",CALC.D!$G$6<>\"\",CALC.D!$R$2<>\"\",CALC.D!$AB$20=1,CALC.D!$F$10<>\"\",CALC.D!$E$64<>\"\",CALC.D!$F$10=1,$BC$79=3,CALC.D!$G$59=$BH$78),\"CONFORME TABELA DA NORMA \",0)","v":0},{"$f":"IF(AND(CALC.D!$C$6<>\"\",CALC.D!$G$6<>\"\",CALC.D!$R$2<>\"\",CALC.D!$AB$20=1,CALC.D!$F$10<>\"\",CALC.D!$E$64<>\"\",CALC.D!$F$10=1,$BC$79=3,CALC.D!$G$59=$BI$78),\"CONFORME TABELA DA NORMA \",0)","v":0},{"$f":"IF(AND(CALC.D!$C$6<>\"\",CALC.D!$G$6<>\"\",CALC.D!$R$2<>\"\",CALC.D!$AB$20=1,CALC.D!$F$10<>\"\",CALC.D!$E$64<>\"\",CALC.D!$F$10=1,$BC$79=3,CALC.D!$G$59=$BJ$78),\"CONFORME TABELA DA NORMA \",0)","v":0},{"$f":"IF(AND(CALC.D!$C$6<>\"\",CALC.D!$G$6<>\"\",CALC.D!$R$2<>\"\",CALC.D!$AB$20=1,CALC.D!$F$10<>\"\",CALC.D!$E$64<>\"\",CALC.D!$F$10=1,$BC$79=3,CALC.D!$G$59=$BK$78),\"CONFORME TABELA DA NORMA \",0)","v":0},{"$f":"IF(AND(CALC.D!$C$6<>\"\",CALC.D!$G$6<>\"\",CALC.D!$R$2<>\"\",CALC.D!$AB$20=1,CALC.D!$F$10<>\"\",CALC.D!$E$64<>\"\",CALC.D!$F$10=1,$BC$79=3,CALC.D!$G$59=$BL$78),\"CONFORME TABELA DA NORMA \",0)","v":0},{"$f":"IF(AND(CALC.D!$C$6<>\"\",CALC.D!$G$6<>\"\",CALC.D!$R$2<>\"\",CALC.D!$AB$20=1,CALC.D!$F$10<>\"\",CALC.D!$E$64<>\"\",CALC.D!$F$10=1,$BC$79=3,CALC.D!$G$59=$BM$78),\"CONFORME TABELA DA NORMA \",0)","v":0},{"$f":"IF(AND(CALC.D!$C$6<>\"\",CALC.D!$G$6<>\"\",CALC.D!$R$2<>\"\",CALC.D!$AB$20=1,CALC.D!$F$10<>\"\",CALC.D!$E$64<>\"\",CALC.D!$F$10=1,$BC$79=3,CALC.D!$G$59=$BN$78),\"Usar Poste Padrão ou Consultar Engenheiro\",0)","v":0},{"$f":"IF(AND(CALC.D!$C$6<>\"\",CALC.D!$G$6<>\"\",CALC.D!$R$2<>\"\",CALC.D!$AB$20=1,CALC.D!$F$10<>\"\",CALC.D!$E$64<>\"\",CALC.D!$F$10=1,$BC$79=3,CALC.D!$G$59=$BO$78),\"Usar Poste Padrão ou Consultar Engenheiro\",0)","v":0},7,{"$f":"IF(AND(OR(CALC.D!AB15=1,AV83>AD82),CALC.D!$C$6<>\"\",CALC.D!$G$6<>\"\",CALC.D!$R$2<>\"\",CALC.D!$AB$20=1,CALC.D!$F$10<>\"\",CALC.D!$E$64<>\"\",CALC.D!$F$10=1,$BC$79=3,CALC.D!$G$59=$BQ$78),\"CONFORME TABELA DA NORMA \",0)","v":0},{"$f":"IF(AND(OR(CALC.D!AB15=1,AV83>AD82),CALC.D!$C$6<>\"\",CALC.D!$G$6<>\"\",CALC.D!$R$2<>\"\",CALC.D!$AB$20=1,CALC.D!$F$10<>\"\",CALC.D!$E$64<>\"\",CALC.D!$F$10=1,$BC$79=3,CALC.D!$G$59=$BR$78),\"CONFORME TABELA DA NORMA \",0)","v":0},{"$f":"IF(AND(OR(CALC.D!AB15=1,AV83>AD82),CALC.D!$C$6<>\"\",CALC.D!$G$6<>\"\",CALC.D!$R$2<>\"\",CALC.D!$AB$20=1,CALC.D!$F$10<>\"\",CALC.D!$E$64<>\"\",CALC.D!$F$10=1,$BC$79=3,CALC.D!$G$59=$BS$78),\"CONFORME TABELA DA NORMA \",0)","v":0},{"$f":"IF(AND(OR(CALC.D!AB15=1,AV83>AD82),CALC.D!$C$6<>\"\",CALC.D!$G$6<>\"\",CALC.D!$R$2<>\"\",CALC.D!$AB$20=1,CALC.D!$F$10<>\"\",CALC.D!$E$64<>\"\",CALC.D!$F$10=1,$BC$79=3,CALC.D!$G$59=$BT$78),\"CONFORME TABELA DA NORMA \",0)","v":0},{"$f":"IF(AND(OR(CALC.D!AB15=1,AV83>AD82),CALC.D!$C$6<>\"\",CALC.D!$G$6<>\"\",CALC.D!$R$2<>\"\",CALC.D!$AB$20=1,CALC.D!$F$10<>\"\",CALC.D!$E$64<>\"\",CALC.D!$F$10=1,$BC$79=3,CALC.D!$G$59=$BU$78),\"Usar Poste Padrão ou Consultar Normas\",0)","v":0}]
[{"$f":"IF(AND(CALC.D!$B$60<=D87,OR(CALC.D!$B$62<=E87,CALC.D!$B$62=\"\"),$AV$83<=$AD$82,$AX$83<=$AF$87,$AW$83<=$AE$84,CALC.D!$AB$20=1),1,0)","v":0},0,"C3 TRIFÁSICO",75,37,"127/220 (BIFÁSICO OU TRIFÁSICO)",null,2,5,15,"35 mm²","DJ 100 A","2\"PVC - 2 1/2\"AÇO",60,"2 1/2\"",65,"16 mm²","25 mm²","III, V, VI, E",null,"7,5 X 200",null,null,null,null,"25 mm² - Quadruplex","15CV",7,{"$f":"AF87","v":12820},"X","X",12820,"15CV",{"$f":"IF(AND(CALC.D!$N$39<>\"\",CALC.D!$L$39<>\"\",CALCULO!$D$7=2,CALC.D!$T$39>0,CALC.D!$AB$20=1),CALC.D!$V$39/CALC.D!$T$39,0)","v":0},{"$f":"IF(AND(AH87>0,CALC.D!$AB$20=1),IF(AH87<=$W$4,$W$4,IF(AH87<=$W$5,$W$5,IF(AH87<=$W$6,$W$6,IF(AH87<=$W$7,$W$7,IF(AH87<=$W$8,$W$8,IF(AH87<=$X$9,$X$9,IF(AH87<=$X$11,$X$11,IF(AH87<=$Y$12,$Y$12,IF(AH87<=$Y$14,$Y$14,IF(AH87<=$Y$15,$Y$15,IF(AH87<=$Y$16,$Y$16))))))))))),0)","v":0},{"$f":"IF(AND(CALC.D!$L39<>\"\",CALC.D!$N39<>\"\",CALC.D!$T39<>\"\",CALC.D!$L39=\"MONOFÁSICO FN\",CALC.D!$AB$20=1),VLOOKUP(\"MONOFÁSICO FN\",CALC.D!$L39:$V39,11,FALSE),\"\")","v":""},"",{"$f":"IF(AND(AJ87<>\"\",CALC.D!$AB$20=1),CALC.D!T39,\"\")","v":""},{"$f":"IF(AND(CALC.D!$L39<>\"\",CALC.D!$N39<>\"\",CALC.D!$T39<>\"\",CALC.D!$L39=\"BIFÁSICO FFN\",CALC.D!$AB$20=1),VLOOKUP(\"BIFÁSICO FFN\",CALC.D!$L39:$V39,11,FALSE),\"\")","v":""},"",{"$f":"IF(AND(AM87<>\"\",CALC.D!$AB$20=1),CALC.D!T39,\"\")","v":""},{"$f":"IF(AND(CALC.D!$L39<>\"\",CALC.D!$N39<>\"\",CALC.D!$T39<>\"\",CALC.D!$L39=\"TRIFÁSICO FFFN\",CALC.D!$AB$20=1),VLOOKUP(\"TRIFÁSICO FFFN\",CALC.D!$L39:$V39,11,FALSE),\"\")","v":""},"",{"$f":"IF(AND(AP87<>\"\",CALC.D!$AB$20=1),CALC.D!T39,\"\")","v":""},null,null,null,null,null,null,{"$f":"IF(AND(CALC.D!$L$39<>\"\",CALC.D!$L$39=\"MONOFÁSICO FN\",CALC.D!$AB$20=1),VLOOKUP(\"MONOFÁSICO FN\",CALC.D!$L$39:$V$39,11,FALSE),0)","v":0},{"$f":"IF(AND(CALC.D!$L$39<>\"\",CALC.D!$L$39=\"BIFÁSICO FFN\",CALC.D!$AB$20=1),VLOOKUP(\"BIFÁSICO FFN\",CALC.D!$L$39:$V$39,11,FALSE),0)","v":0},{"$f":"IF(AND(CALC.D!$L$39<>\"\",CALC.D!$L$39=\"TRIFÁSICO FFFN\",CALC.D!$AB$20=1),VLOOKUP(\"TRIFÁSICO FFFN\",CALC.D!$L$39:$V$39,11,FALSE),0)","v":0},null,2,null,8,{"$f":"IF(AND(CALC.D!$C$6<>\"\",CALC.D!$G$6<>\"\",CALC.D!$R$2<>\"\",CALC.D!$AB$20=1,CALC.D!$F$10<>\"\",CALC.D!$E$64<>\"\",CALC.D!$F$10=2,BC79=3,CALC.D!$G$59=$BF$78),\"CONFORME TABELA DA NORMA \",0)","v":0},{"$f":"IF(AND(CALC.D!$C$6<>\"\",CALC.D!$G$6<>\"\",CALC.D!$R$2<>\"\",CALC.D!$AB$20=1,CALC.D!$F$10<>\"\",CALC.D!$E$64<>\"\",CALC.D!$F$10=2,$BC$79=3,CALC.D!$G$59=$BG$78),\"CONFORME TABELA DA NORMA \",0)","v":0},{"$f":"IF(AND(CALC.D!$C$6<>\"\",CALC.D!$G$6<>\"\",CALC.D!$R$2<>\"\",CALC.D!$AB$20=1,CALC.D!$F$10<>\"\",CALC.D!$E$64<>\"\",CALC.D!$F$10=2,$BC$79=3,CALC.D!$G$59=$BH$78),\"CONFORME TABELA DA NORMA \",0)","v":0},{"$f":"IF(AND(CALC.D!$C$6<>\"\",CALC.D!$G$6<>\"\",CALC.D!$R$2<>\"\",CALC.D!$AB$20=1,CALC.D!$F$10<>\"\",CALC.D!$E$64<>\"\",CALC.D!$F$10=2,$BC$79=3,CALC.D!$G$59=$BI$78),\"CONFORME TABELA DA NORMA \",0)","v":0},{"$f":"IF(AND(CALC.D!$C$6<>\"\",CALC.D!$G$6<>\"\",CALC.D!$R$2<>\"\",CALC.D!$AB$20=1,CALC.D!$F$10<>\"\",CALC.D!$E$64<>\"\",CALC.D!$F$10=2,$BC$79=3,CALC.D!$G$59=$BJ$78),\"CONFORME TABELA DA NORMA \",0)","v":0},{"$f":"IF(AND(CALC.D!$C$6<>\"\",CALC.D!$G$6<>\"\",CALC.D!$R$2<>\"\",CALC.D!$AB$20=1,CALC.D!$F$10<>\"\",CALC.D!$E$64<>\"\",CALC.D!$F$10=2,$BC$79=3,CALC.D!$G$59=$BK$78),\"CONFORME TABELA DA NORMA \",0)","v":0},{"$f":"IF(AND(CALC.D!$C$6<>\"\",CALC.D!$G$6<>\"\",CALC.D!$R$2<>\"\",CALC.D!$AB$20=1,CALC.D!$F$10<>\"\",CALC.D!$E$64<>\"\",CALC.D!$F$10=2,$BC$79=3,CALC.D!$G$59=$BL$78),\"CONFORME TABELA DA NORMA \",0)","v":0},{"$f":"IF(AND(CALC.D!$C$6<>\"\",CALC.D!$G$6<>\"\",CALC.D!$R$2<>\"\",CALC.D!$AB$20=1,CALC.D!$F$10<>\"\",CALC.D!$E$64<>\"\",CALC.D!$F$10=2,$BC$79=3,CALC.D!$G$59=$BM$78),\"CONFORME TABELA DA NORMA \",0)","v":0},{"$f":"IF(AND(CALC.D!$C$6<>\"\",CALC.D!$G$6<>\"\",CALC.D!$R$2<>\"\",CALC.D!$AB$20=1,CALC.D!$F$10<>\"\",CALC.D!$E$64<>\"\",CALC.D!$F$10=2,$BC$79=3,CALC.D!$G$59=$BN$78),\"Usar Poste Padrão ou Consultar Engenheiro\",0)","v":0},{"$f":"IF(AND(CALC.D!$C$6<>\"\",CALC.D!$G$6<>\"\",CALC.D!$R$2<>\"\",CALC.D!$AB$20=1,CALC.D!$F$10<>\"\",CALC.D!$E$64<>\"\",CALC.D!$F$10=2,$BC$79=3,CALC.D!$G$59=$BO$78),\"Usar Poste Padrão ou Consultar Engenheiro\",0)","v":0},8,{"$f":"IF(AND(OR(CALC.D!AB15=1,AV83>AD82),CALC.D!$C$6<>\"\",CALC.D!$G$6<>\"\",CALC.D!$R$2<>\"\",CALC.D!$AB$20=1,CALC.D!$F$10<>\"\",CALC.D!$E$64<>\"\",CALC.D!$F$10=2,$BC$79=3,CALC.D!$G$59=$BQ$78),\"CONFORME TABELA DA NORMA \",0)","v":0},{"$f":"IF(AND(OR(CALC.D!AB15=1,AV83>AD82),CALC.D!$C$6<>\"\",CALC.D!$G$6<>\"\",CALC.D!$R$2<>\"\",CALC.D!$AB$20=1,CALC.D!$F$10<>\"\",CALC.D!$E$64<>\"\",CALC.D!$F$10=2,$BC$79=3,CALC.D!$G$59=$BR$78),\"CONFORME TABELA DA NORMA \",0)","v":0},{"$f":"IF(AND(OR(CALC.D!AB15=1,AV83>AD82),CALC.D!$C$6<>\"\",CALC.D!$G$6<>\"\",CALC.D!$R$2<>\"\",CALC.D!$AB$20=1,CALC.D!$F$10<>\"\",CALC.D!$E$64<>\"\",CALC.D!$F$10=2,$BC$79=3,CALC.D!$G$59=$BS$78),\"CONFORME TABELA DA NORMA \",0)","v":0},{"$f":"IF(AND(OR(CALC.D!AB15=1,AV83>AD82),CALC.D!$C$6<>\"\",CALC.D!$G$6<>\"\",CALC.D!$R$2<>\"\",CALC.D!$AB$20=1,CALC.D!$F$10<>\"\",CALC.D!$E$64<>\"\",CALC.D!$F$10=2,$BC$79=3,CALC.D!$G$59=$BT$78),\"CONFORME TABELA DA NORMA \",0)","v":0},{"$f":"IF(AND(OR(CALC.D!AB15=1,AV83>AD82),CALC.D!$C$6<>\"\",CALC.D!$G$6<>\"\",CALC.D!$R$2<>\"\",CALC.D!$AB$20=1,CALC.D!$F$10<>\"\",CALC.D!$E$64<>\"\",CALC.D!$F$10=2,$BC$79=3,CALC.D!$G$59=$BU$78),\"Usar Poste Padrão ou Consultar Normas\",0)","v":0}]
[{"$f":"IF(AND(CALC.D!$B$60<=D88,OR(CALC.D!$B$62<=E88,CALC.D!$B$62=\"\"),$AV$83<=$AD$82,$AX$83<=$AF$88,$AW$83<=$AE$84,CALC.D!$AB$20=1),1,0)","v":0},0,"C4 TRIFÁSICO",75,47,"127/220 (BIFÁSICO OU TRIFÁSICO)",null,2,5,20,"50 mm²","DJ 125 A","2 1/2\"PVC - 3\"AÇO",75,"3\"",80,"25 mm²","25 mm²","L + T",null,"7,5 X 300",null,null,null,null,"35 mm² - Quadruplex","20CV",8,{"$f":"AF88","v":17010},"X","X",17010,"20CV","TOTAL",null,{"$f":"IF(AV83>0,VLOOKUP(AV83,AJ81:AL87,2,FALSE),\"\")","v":""},null,null,{"$f":"IF(AW83>0,VLOOKUP(AW83,AN81:AO87,2,FALSE),\"\")","v":""},null,null,{"$f":"IF(AX83>0,VLOOKUP(AX83,AQ81:AR87,2,FALSE),\"\")","v":""},null,null,null,null,null,null,null,null,{"$f":"IF(AND(CALC.D!$L$18<>\"\",CALC.D!$L$18=\"MONOFÁSICO FN\",CALC.D!$AB$20=1),VLOOKUP(\"MONOFÁSICO FN\",CALC.D!$L$18:$V$18,11,FALSE),0)","v":0},{"$f":"IF(AND(CALC.D!$L$18<>\"\",CALC.D!$L$18=\"BIFÁSICO FFN\",CALC.D!$AB$20=1),VLOOKUP(\"BIFÁSICO FFN\",CALC.D!$L$18:$V$18,11,FALSE),0)","v":0},{"$f":"IF(AND(CALC.D!$L$18<>\"\",CALC.D!$L$18=\"TRIFÁSICO FFFN\",CALC.D!$AB$20=1),VLOOKUP(\"TRIFÁSICO FFFN\",CALC.D!$L$18:$V$18,11,FALSE),0)","v":0},null,"3 ou mais",null,9,{"$f":"IF(AND(CALC.D!$C$6<>\"\",CALC.D!$G$6<>\"\",CALC.D!$R$2<>\"\",CALC.D!$AB$20=1,CALC.D!$F$10<>\"\",CALC.D!$E$64<>\"\",CALC.D!$F$10=\"3 ou mais\",BC79=3,CALC.D!$G$59=$BF$78),\"Consultar Normas de Ligação Agrupada\",0)","v":0},{"$f":"IF(AND(CALC.D!$C$6<>\"\",CALC.D!$G$6<>\"\",CALC.D!$R$2<>\"\",CALC.D!$AB$20=1,CALC.D!$F$10<>\"\",CALC.D!$E$64<>\"\",CALC.D!$F$10=\"3 ou mais\",$BC$79=3,CALC.D!$G$59=$BG$78),\"Consultar Normas de Ligação Agrupada\",0)","v":0},{"$f":"IF(AND(CALC.D!$C$6<>\"\",CALC.D!$G$6<>\"\",CALC.D!$R$2<>\"\",CALC.D!$AB$20=1,CALC.D!$F$10<>\"\",CALC.D!$E$64<>\"\",CALC.D!$F$10=\"3 ou mais\",$BC$79=3,CALC.D!$G$59=$BA$2),\"Consultar Normas de Ligação Agrupada\",0)","v":0},{"$f":"IF(AND(CALC.D!$C$6<>\"\",CALC.D!$G$6<>\"\",CALC.D!$R$2<>\"\",CALC.D!$AB$20=1,CALC.D!$F$10<>\"\",CALC.D!$E$64<>\"\",CALC.D!$F$10=\"3 ou mais\",$BC$79=3,CALC.D!$G$59=$BI$78),\"Consultar Normas de Ligação Agrupada\",0)","v":0},{"$f":"IF(AND(CALC.D!$C$6<>\"\",CALC.D!$G$6<>\"\",CALC.D!$R$2<>\"\",CALC.D!$AB$20=1,CALC.D!$F$10<>\"\",CALC.D!$E$64<>\"\",CALC.D!$F$10=\"3 ou mais\",$BC$79=3,CALC.D!$G$59=$BJ$78),\"Consultar Normas de Ligação Agrupada\",0)","v":0},{"$f":"IF(AND(CALC.D!$C$6<>\"\",CALC.D!$G$6<>\"\",CALC.D!$R$2<>\"\",CALC.D!$AB$20=1,CALC.D!$F$10<>\"\",CALC.D!$E$64<>\"\",CALC.D!$F$10=\"3 ou mais\",$BC$79=3,CALC.D!$G$59=$BK$78),\"Consultar Normas de Ligação Agrupada\",0)","v":0},{"$f":"IF(AND(CALC.D!$C$6<>\"\",CALC.D!$G$6<>\"\",CALC.D!$R$2<>\"\",CALC.D!$AB$20=1,CALC.D!$F$10<>\"\",CALC.D!$E$64<>\"\",CALC.D!$F$10=\"3 ou mais\",$BC$79=3,CALC.D!$G$59=$BL$78),\"Consultar Normas de Ligação Agrupada\",0)","v":0},{"$f":"IF(AND(CALC.D!$C$6<>\"\",CALC.D!$G$6<>\"\",CALC.D!$R$2<>\"\",CALC.D!$AB$20=1,CALC.D!$F$10<>\"\",CALC.D!$E$64<>\"\",CALC.D!$F$10=\"3 ou mais\",$BC$79=3,CALC.D!$G$59=$BM$78),\"Consultar Normas de Ligação Agrupada\",0)","v":0},{"$f":"IF(AND(CALC.D!$C$6<>\"\",CALC.D!$G$6<>\"\",CALC.D!$R$2<>\"\",CALC.D!$AB$20=1,CALC.D!$F$10<>\"\",CALC.D!$E$64<>\"\",CALC.D!$F$10=\"3 ou mais\",$BC$79=3,CALC.D!$G$59=$BN$78),\"Consultar Normas de Ligação Agrupada\",0)","v":0},{"$f":"IF(AND(CALC.D!$C$6<>\"\",CALC.D!$G$6<>\"\",CALC.D!$R$2<>\"\",CALC.D!$AB$20=1,CALC.D!$F$10<>\"\",CALC.D!$E$64<>\"\",CALC.D!$F$10=\"3 ou mais\",$BC$79=3,CALC.D!$G$59=$BO$78),\"Consultar Normas de Ligação Agrupada\",0)","v":0},9,{"$f":"IF(AND(CALC.D!$C$6<>\"\",CALC.D!$G$6<>\"\",CALC.D!$R$2<>\"\",CALC.D!$AB$20=1,CALC.D!$F$10<>\"\",CALC.D!$E$64<>\"\",CALC.D!$F$10=\"3 ou mais\",$BC$79=3,CALC.D!$G$59=$BQ$78),\"Consultar Normas de Ligação Agrupada\",0)","v":0},{"$f":"IF(AND(CALC.D!$C$6<>\"\",CALC.D!$G$6<>\"\",CALC.D!$R$2<>\"\",CALC.D!$AB$20=1,CALC.D!$F$10<>\"\",CALC.D!$E$64<>\"\",CALC.D!$F$10=\"3 ou mais\",$BC$79=3,CALC.D!$G$59=$BR$78),\"Consultar Normas de Ligação Agrupada\",0)","v":0},{"$f":"IF(AND(OR(CALC.D!AB15=1,AV83>AD82),CALC.D!$C$6<>\"\",CALC.D!$G$6<>\"\",CALC.D!$R$2<>\"\",CALC.D!$AB$20=1,CALC.D!$F$10<>\"\",CALC.D!$E$64<>\"\",CALC.D!$F$10=\"3 ou mais\",$BC$79=3,CALC.D!$G$59=$BS$78),\"Consultar Normas de Ligação Agrupada\",0)","v":0},{"$f":"IF(AND(OR(CALC.D!AB15=1,AV83>AD82),CALC.D!$C$6<>\"\",CALC.D!$G$6<>\"\",CALC.D!$R$2<>\"\",CALC.D!$AB$20=1,CALC.D!$F$10<>\"\",CALC.D!$E$64<>\"\",CALC.D!$F$10=\"3 ou mais\",$BC$79=3,CALC.D!$G$59=$BT$78),\"Consultar Normas de Ligação Agrupada\",0)","v":0},{"$f":"IF(AND(CALC.D!$C$6<>\"\",CALC.D!$G$6<>\"\",CALC.D!$R$2<>\"\",CALC.D!$AB$20=1,CALC.D!$F$10<>\"\",CALC.D!$E$64<>\"\",CALC.D!$F$10=\"3 ou mais\",$BC$79=3,CALC.D!$G$59=$BU$78),\"Consultar Normas de Ligação Agrupada\",0)","v":0}]
[{"$f":"IF(AND(CALC.D!$B$60<=D89,OR(CALC.D!$B$62<=E89,CALC.D!$B$62=\"\"),$AV$83<=$AD$82,$AX$83<=$AF$89,$AW$83<=$AE$85,CALC.D!$AB$20=1),1,0)","v":0},0,"C5 TRIFÁSICO",75,56,"127/220 (BIFÁSICO OU TRIFÁSICO)",null,2,7.5,25,"70 mm²","DJ 150 A","2 1/2\"PVC - 3\"AÇO",75,"3\"",80,"35 mm²","25 mm²","L + T",null,"7,5 X 300",null,null,null,null,"50 mm² - Quadruplex","25CV",9,{"$f":"AF89","v":20920},"X","X",20920,"25CV",null,null,null,null,null,null,null,null,null,null,null,null,null,null,null,null,null,{"$f":"COUNTIF(AY81:AY88,\"\")","v":0},{"$f":"COUNTIF(AZ81:AZ88,\"\")","v":0},0,"FACHADA DA EDIFICAÇÃO",1,{"$f":"IF(CALC.D!$E$64=TABELAS!AB60,VLOOKUP(CALC.D!$F$10,$BC$89:$BE$91,3,FALSE),0)","v":0},10,{"$f":"IF(AND(CALC.D!$C$6<>\"\",CALC.D!$G$6<>\"\",CALC.D!$R$2<>\"\",CALC.D!$AB$20=1,CALC.D!$F$10<>\"\",CALC.D!$E$64<>\"\",CALC.D!$F$10=1,BC79=4,CALC.D!$G$59=$BF$78),\"CONFORME TABELA DA NORMA \",0)","v":0},{"$f":"IF(AND(CALC.D!$C$6<>\"\",CALC.D!$G$6<>\"\",CALC.D!$R$2<>\"\",CALC.D!$AB$20=1,CALC.D!$F$10<>\"\",CALC.D!$E$64<>\"\",CALC.D!$F$10=1,$BC$79=4,CALC.D!$G$59=$BG$78),\"CONFORME TABELA DA NORMA \",0)","v":0},{"$f":"IF(AND(CALC.D!$C$6<>\"\",CALC.D!$G$6<>\"\",CALC.D!$R$2<>\"\",CALC.D!$AB$20=1,CALC.D!$F$10<>\"\",CALC.D!$E$64<>\"\",CALC.D!$F$10=1,$BC$79=4,CALC.D!$G$59=$BA$2),\"CONFORME TABELA DA NORMA \",0)","v":0},{"$f":"IF(AND(CALC.D!$C$6<>\"\",CALC.D!$G$6<>\"\",CALC.D!$R$2<>\"\",CALC.D!$AB$20=1,CALC.D!$F$10<>\"\",CALC.D!$E$64<>\"\",CALC.D!$F$10=1,$BC$79=4,CALC.D!$G$59=$BI$78),\"CONFORME TABELA DA NORMA \",0)","v":0},{"$f":"IF(AND(CALC.D!$C$6<>\"\",CALC.D!$G$6<>\"\",CALC.D!$R$2<>\"\",CALC.D!$AB$20=1,CALC.D!$F$10<>\"\",CALC.D!$E$64<>\"\",CALC.D!$F$10=1,$BC$79=4,CALC.D!$G$59=$BJ$78),\"CONFORME TABELA DA NORMA \",0)","v":0},{"$f":"IF(AND(CALC.D!$C$6<>\"\",CALC.D!$G$6<>\"\",CALC.D!$R$2<>\"\",CALC.D!$AB$20=1,CALC.D!$F$10<>\"\",CALC.D!$E$64<>\"\",CALC.D!$F$10=1,$BC$79=4,CALC.D!$G$59=$BK$78),\"CONFORME TABELA DA NORMA \",0)","v":0},{"$f":"IF(AND(CALC.D!$C$6<>\"\",CALC.D!$G$6<>\"\",CALC.D!$R$2<>\"\",CALC.D!$AB$20=1,CALC.D!$F$10<>\"\",CALC.D!$E$64<>\"\",CALC.D!$F$10=1,$BC$79=4,CALC.D!$G$59=$BL$78),\"CONFORME TABELA DA NORMA \",0)","v":0},{"$f":"IF(AND(CALC.D!$C$6<>\"\",CALC.D!$G$6<>\"\",CALC.D!$R$2<>\"\",CALC.D!$AB$20=1,CALC.D!$F$10<>\"\",CALC.D!$E$64<>\"\",CALC.D!$F$10=1,$BC$79=4,CALC.D!$G$59=$BM$78),\"CONFORME TABELA DA NORMA  \",0)","v":0},{"$f":"IF(AND(CALC.D!$C$6<>\"\",CALC.D!$G$6<>\"\",CALC.D!$R$2<>\"\",CALC.D!$AB$20=1,CALC.D!$F$10<>\"\",CALC.D!$E$64<>\"\",CALC.D!$F$10=1,$BC$79=4,CALC.D!$G$59=$BN$78),\"CONFORME TABELA DA NORMA \",0)","v":0},{"$f":"IF(AND(CALC.D!$C$6<>\"\",CALC.D!$G$6<>\"\",CALC.D!$R$2<>\"\",CALC.D!$AB$20=1,CALC.D!$F$10<>\"\",CALC.D!$E$64<>\"\",CALC.D!$F$10=1,$BC$79=4,CALC.D!$G$59=$BO$78),\"CONFORME TABELA DA NORMA \",0)","v":0},10,{"$f":"IF(AND(OR(CALC.D!AB15=1,AV83>AD82),CALC.D!$C$6<>\"\",CALC.D!$G$6<>\"\",CALC.D!$R$2<>\"\",CALC.D!$AB$20=1,CALC.D!$F$10<>\"\",CALC.D!$E$64<>\"\",CALC.D!$F$10=1,$BC$79=4,CALC.D!$G$59=$BQ$78),\"CONFORME TABELA DA NORMA \",0)","v":0},{"$f":"IF(AND(OR(CALC.D!AB15=1,AV83>AD82),CALC.D!$C$6<>\"\",CALC.D!$G$6<>\"\",CALC.D!$R$2<>\"\",CALC.D!$AB$20=1,CALC.D!$F$10<>\"\",CALC.D!$E$64<>\"\",CALC.D!$F$10=1,$BC$79=4,CALC.D!$G$59=$BR$78),\"CONFORME TABELA DA NORMA \",0)","v":0},{"$f":"IF(AND(OR(CALC.D!AB15=1,AV83>AD82),CALC.D!$C$6<>\"\",CALC.D!$G$6<>\"\",CALC.D!$R$2<>\"\",CALC.D!$AB$20=1,CALC.D!$F$10<>\"\",CALC.D!$E$64<>\"\",CALC.D!$F$10=1,$BC$79=4,CALC.D!$G$59=$BS$78),\"CONFORME TABELA DA NORMA \",0)","v":0},{"$f":"IF(AND(OR(CALC.D!AB15=1,AV83>AD82),CALC.D!$C$6<>\"\",CALC.D!$G$6<>\"\",CALC.D!$R$2<>\"\",CALC.D!$AB$20=1,CALC.D!$F$10<>\"\",CALC.D!$E$64<>\"\",CALC.D!$F$10=1,$BC$79=4,CALC.D!$G$59=$BT$78),\"CONFORME TABELA DA NORMA \",0)","v":0},{"$f":"IF(AND(OR(CALC.D!AB15=1,AV83>AD82),CALC.D!$C$6<>\"\",CALC.D!$G$6<>\"\",CALC.D!$R$2<>\"\",CALC.D!$AB$20=1,CALC.D!$F$10<>\"\",CALC.D!$E$64<>\"\",CALC.D!$F$10=1,$BC$79=4,CALC.D!$G$59=$BU$78),\"CONFORME TABELA DA NORMA \",0)","v":0}]
[{"$f":"IF(AND(CALC.D!$B$60<=D90,OR(CALC.D!$B$62<=E90,CALC.D!$B$62=\"\"),$AV$83<=$AD$82,$AX$83<=$AF$90,$AW$83<=$AE$85,CALC.D!$AB$20=1),1,0)","v":0},0,"C6 TRIFÁSICO",75,75,"127/220 (BIFÁSICO OU TRIFÁSICO)",null,2,7.5,30,"95 mm²","DJ 200 A","3\"PVC - 4\"AÇO",85,"4\"",100,"50 mm²","25 mm²","L + T",null,"7,5 X 300",null,null,null,null,"70 mm² - Quadruplex","30CV",10,{"$f":"AF90","v":25030},"X","X",25030,"30CV",null,null,null,null,null,null,null,null,null,null,null,null,null,null,null,null,null,null,null,null,null,2,null,11,{"$f":"IF(AND(CALC.D!$C$6<>\"\",CALC.D!$G$6<>\"\",CALC.D!$R$2<>\"\",CALC.D!$AB$20=1,CALC.D!$F$10<>\"\",CALC.D!$E$64<>\"\",CALC.D!$F$10=2,BC79=4,CALC.D!$G$59=$BF$78),\"CONFORME TABELA DA NORMA \",0)","v":0},{"$f":"IF(AND(CALC.D!$C$6<>\"\",CALC.D!$G$6<>\"\",CALC.D!$R$2<>\"\",CALC.D!$AB$20=1,CALC.D!$F$10<>\"\",CALC.D!$E$64<>\"\",CALC.D!$F$10=2,$BC$79=4,CALC.D!$G$59=$BG$78),\"CONFORME TABELA DA NORMA \",0)","v":0},{"$f":"IF(AND(CALC.D!$C$6<>\"\",CALC.D!$G$6<>\"\",CALC.D!$R$2<>\"\",CALC.D!$AB$20=1,CALC.D!$F$10<>\"\",CALC.D!$E$64<>\"\",CALC.D!$F$10=2,$BC$79=4,CALC.D!$G$59=$BA$2),\"CONFORME TABELA DA NORMA \",0)","v":0},{"$f":"IF(AND(CALC.D!$C$6<>\"\",CALC.D!$G$6<>\"\",CALC.D!$R$2<>\"\",CALC.D!$AB$20=1,CALC.D!$F$10<>\"\",CALC.D!$E$64<>\"\",CALC.D!$F$10=2,$BC$79=4,CALC.D!$G$59=$BI$78),\"CONFORME TABELA DA NORMA \",0)","v":0},{"$f":"IF(AND(CALC.D!$C$6<>\"\",CALC.D!$G$6<>\"\",CALC.D!$R$2<>\"\",CALC.D!$AB$20=1,CALC.D!$F$10<>\"\",CALC.D!$E$64<>\"\",CALC.D!$F$10=2,$BC$79=4,CALC.D!$G$59=$BJ$78),\"CONFORME TABELA DA NORMA \",0)","v":0},{"$f":"IF(AND(CALC.D!$C$6<>\"\",CALC.D!$G$6<>\"\",CALC.D!$R$2<>\"\",CALC.D!$AB$20=1,CALC.D!$F$10<>\"\",CALC.D!$E$64<>\"\",CALC.D!$F$10=2,$BC$79=4,CALC.D!$G$59=$BK$78),\"CONFORME TABELA DA NORMA \",0)","v":0},{"$f":"IF(AND(CALC.D!$C$6<>\"\",CALC.D!$G$6<>\"\",CALC.D!$R$2<>\"\",CALC.D!$AB$20=1,CALC.D!$F$10<>\"\",CALC.D!$E$64<>\"\",CALC.D!$F$10=2,$BC$79=4,CALC.D!$G$59=$BL$78),\"CONFORME TABELA DA NORMA \",0)","v":0},{"$f":"IF(AND(CALC.D!$C$6<>\"\",CALC.D!$G$6<>\"\",CALC.D!$R$2<>\"\",CALC.D!$AB$20=1,CALC.D!$F$10<>\"\",CALC.D!$E$64<>\"\",CALC.D!$F$10=2,$BC$79=4,CALC.D!$G$59=$BM$78),\"CONFORME TABELA DA NORMA \",0)","v":0},{"$f":"IF(AND(CALC.D!$C$6<>\"\",CALC.D!$G$6<>\"\",CALC.D!$R$2<>\"\",CALC.D!$AB$20=1,CALC.D!$F$10<>\"\",CALC.D!$E$64<>\"\",CALC.D!$F$10=2,$BC$79=4,CALC.D!$G$59=$BN$78),\"CONFORME TABELA DA NORMA \",0)","v":0},{"$f":"IF(AND(CALC.D!$C$6<>\"\",CALC.D!$G$6<>\"\",CALC.D!$R$2<>\"\",CALC.D!$AB$20=1,CALC.D!$F$10<>\"\",CALC.D!$E$64<>\"\",CALC.D!$F$10=2,$BC$79=4,CALC.D!$G$59=$BO$78),\"CONFORME TABELA DA NORMA \",0)","v":0},11,{"$f":"IF(AND(OR(CALC.D!AB15=1,AV83>AD82),CALC.D!$C$6<>\"\",CALC.D!$G$6<>\"\",CALC.D!$R$2<>\"\",CALC.D!$AB$20=1,CALC.D!$F$10<>\"\",CALC.D!$E$64<>\"\",CALC.D!$F$10=2,$BC$79=4,CALC.D!$G$59=$BQ$78),\"CONFORME TABELA DA NORMA \",0)","v":0},{"$f":"IF(AND(OR(CALC.D!AB15=1,AV83>AD82),CALC.D!$C$6<>\"\",CALC.D!$G$6<>\"\",CALC.D!$R$2<>\"\",CALC.D!$AB$20=1,CALC.D!$F$10<>\"\",CALC.D!$E$64<>\"\",CALC.D!$F$10=2,$BC$79=4,CALC.D!$G$59=$BR$78),\"CONFORME TABELA DA NORMA \",0)","v":0},{"$f":"IF(AND(CALC.D!$C$6<>\"\",CALC.D!$G$6<>\"\",CALC.D!$R$2<>\"\",CALC.D!$AB$20=1,CALC.D!$F$10<>\"\",CALC.D!$E$64<>\"\",CALC.D!$F$10=2,$BC$79=4,CALC.D!$G$59=$BS$78),\"CONFORME TABELA DA NORMA \",0)","v":0},{"$f":"IF(AND(OR(CALC.D!AB15=1,AV83>AD82),CALC.D!$C$6<>\"\",CALC.D!$G$6<>\"\",CALC.D!$R$2<>\"\",CALC.D!$AB$20=1,CALC.D!$F$10<>\"\",CALC.D!$E$64<>\"\",CALC.D!$F$10=2,$BC$79=4,CALC.D!$G$59=$BT$78),\"CONFORME TABELA DA NORMA \",0)","v":0},{"$f":"IF(AND(OR(CALC.D!AB15=1,AV83>AD82),CALC.D!$C$6<>\"\",CALC.D!$G$6<>\"\",CALC.D!$R$2<>\"\",CALC.D!$AB$20=1,CALC.D!$F$10<>\"\",CALC.D!$E$64<>\"\",CALC.D!$F$10=2,$BC$79=4,CALC.D!$G$59=$BU$78),\"CONFORME TABELA DA NORMA \",0)","v":0}]
[{"$f":"IF(AND(CALC.D!$B$60<=D91,OR(CALC.D!$B$62<=E91,CALC.D!$B$62=\"\"),$AV$83<=$AD$83,$AX$83<=$AF$85,CALC.D!$AB$20=1),1,0)","v":0},{"$f":"A91","v":0},"C7 TRIFÁSICO",75,29,"220/380 (BIFÁSICOS OU TRIFÁSICOS)",null,3,"-",7.5,"10 mm²","DJ 50 A","1 1/4\"PVC-1 1/2\"AÇO",40,"1 1/2\"",40,"10 mm²","25 mm²","III, V, VI, E",null,"7,5 X 200",null,null,null,null,"DEFINIDO PELA CERIM",null,null,null,null,null,null,null,null,null,null,null,null,null,null,null,null,null,null,null,null,null,null,null,null,null,null,null,null,"3 ou mais",null,12,{"$f":"IF(AND(CALC.D!$C$6<>\"\",CALC.D!$G$6<>\"\",CALC.D!$R$2<>\"\",CALC.D!$AB$20=1,CALC.D!$F$10<>\"\",CALC.D!$E$64<>\"\",CALC.D!$F$10=\"3 ou mais\",BC79=4,CALC.D!$G$59=$BF$78),\"Consultar Normas de Ligação Agrupada\",0)","v":0},{"$f":"IF(AND(CALC.D!$C$6<>\"\",CALC.D!$G$6<>\"\",CALC.D!$R$2<>\"\",CALC.D!$AB$20=1,CALC.D!$F$10<>\"\",CALC.D!$E$64<>\"\",CALC.D!$F$10=\"3 ou mais\",$BC$79=4,CALC.D!$G$59=$BG$78),\"Consultar Normas de Ligação Agrupada\",0)","v":0},{"$f":"IF(AND(CALC.D!$C$6<>\"\",CALC.D!$G$6<>\"\",CALC.D!$R$2<>\"\",CALC.D!$AB$20=1,CALC.D!$F$10<>\"\",CALC.D!$E$64<>\"\",CALC.D!$F$10=\"3 ou mais\",$BC$79=4,CALC.D!$G$59=$BA$2),\"Consultar Normas de Ligação Agrupada\",0)","v":0},{"$f":"IF(AND(CALC.D!$C$6<>\"\",CALC.D!$G$6<>\"\",CALC.D!$R$2<>\"\",CALC.D!$AB$20=1,CALC.D!$F$10<>\"\",CALC.D!$E$64<>\"\",CALC.D!$F$10=\"3 ou mais\",$BC$79=4,CALC.D!$G$59=$BI$78),\"Consultar Normas de Ligação Agrupada\",0)","v":0},{"$f":"IF(AND(CALC.D!$C$6<>\"\",CALC.D!$G$6<>\"\",CALC.D!$R$2<>\"\",CALC.D!$AB$20=1,CALC.D!$F$10<>\"\",CALC.D!$E$64<>\"\",CALC.D!$F$10=\"3 ou mais\",$BC$79=4,CALC.D!$G$59=$BJ$78),\"Consultar Normas de Ligação Agrupada\",0)","v":0},{"$f":"IF(AND(CALC.D!$C$6<>\"\",CALC.D!$G$6<>\"\",CALC.D!$R$2<>\"\",CALC.D!$AB$20=1,CALC.D!$F$10<>\"\",CALC.D!$E$64<>\"\",CALC.D!$F$10=\"3 ou mais\",$BC$79=4,CALC.D!$G$59=$BK$78),\"Consultar Normas de Ligação Agrupada\",0)","v":0},{"$f":"IF(AND(CALC.D!$C$6<>\"\",CALC.D!$G$6<>\"\",CALC.D!$R$2<>\"\",CALC.D!$AB$20=1,CALC.D!$F$10<>\"\",CALC.D!$E$64<>\"\",CALC.D!$F$10=\"3 ou mais\",$BC$79=4,CALC.D!$G$59=$BL$78),\"Consultar Normas de Ligação Agrupada\",0)","v":0},{"$f":"IF(AND(CALC.D!$C$6<>\"\",CALC.D!$G$6<>\"\",CALC.D!$R$2<>\"\",CALC.D!$AB$20=1,CALC.D!$F$10<>\"\",CALC.D!$E$64<>\"\",CALC.D!$F$10=\"3 ou mais\",$BC$79=4,CALC.D!$G$59=$BM$78),\"Consultar Normas de Ligação Agrupada\",0)","v":0},{"$f":"IF(AND(CALC.D!$C$6<>\"\",CALC.D!$G$6<>\"\",CALC.D!$R$2<>\"\",CALC.D!$AB$20=1,CALC.D!$F$10<>\"\",CALC.D!$E$64<>\"\",CALC.D!$F$10=\"3 ou mais\",$BC$79=4,CALC.D!$G$59=$BN$78),\"Consultar Normas de Ligação Agrupada\",0)","v":0},{"$f":"IF(AND(CALC.D!$C$6<>\"\",CALC.D!$G$6<>\"\",CALC.D!$R$2<>\"\",CALC.D!$AB$20=1,CALC.D!$F$10<>\"\",CALC.D!$E$64<>\"\",CALC.D!$F$10=\"3 ou mais\",$BC$79=4,CALC.D!$G$59=$BO$78),\"Consultar Normas de Ligação Agrupada\",0)","v":0},12,{"$f":"IF(AND(OR(CALC.D!AB15=1,AV83>AD82),CALC.D!$C$6<>\"\",CALC.D!$G$6<>\"\",CALC.D!$R$2<>\"\",CALC.D!$AB$20=1,CALC.D!$F$10<>\"\",CALC.D!$E$64<>\"\",CALC.D!$F$10=\"3 ou mais\",$BC$79=4,CALC.D!$G$59=$BQ$78),\"Consultar Normas de Ligação Agrupada\",0)","v":0},{"$f":"IF(AND(OR(CALC.D!AB15=1,AV83>AD82),CALC.D!$C$6<>\"\",CALC.D!$G$6<>\"\",CALC.D!$R$2<>\"\",CALC.D!$AB$20=1,CALC.D!$F$10<>\"\",CALC.D!$E$64<>\"\",CALC.D!$F$10=\"3 ou mais\",$BC$79=4,CALC.D!$G$59=$BR$78),\"Consultar Normas de Ligação Agrupada\",0)","v":0},{"$f":"IF(AND(OR(CALC.D!AB15=1,AV83>AD82),CALC.D!$C$6<>\"\",CALC.D!$G$6<>\"\",CALC.D!$R$2<>\"\",CALC.D!$AB$20=1,CALC.D!$F$10<>\"\",CALC.D!$E$64<>\"\",CALC.D!$F$10=\"3 ou mais\",$BC$79=4,CALC.D!$G$59=$BS$78),\"Consultar Normas de Ligação Agrupada\",0)","v":0},{"$f":"IF(AND(OR(CALC.D!AB15=1,AV83>AD82),CALC.D!$C$6<>\"\",CALC.D!$G$6<>\"\",CALC.D!$R$2<>\"\",CALC.D!$AB$20=1,CALC.D!$F$10<>\"\",CALC.D!$E$64<>\"\",CALC.D!$F$10=\"3 ou mais\",$BC$79=4,CALC.D!$G$59=$BT$78),\"Consultar Normas de Ligação Agrupada\",0)","v":0},{"$f":"IF(AND(OR(CALC.D!AB15=1,AV83>AD82),CALC.D!$C$6<>\"\",CALC.D!$G$6<>\"\",CALC.D!$R$2<>\"\",CALC.D!$AB$20=1,CALC.D!$F$10<>\"\",CALC.D!$E$64<>\"\",CALC.D!$F$10=\"3 ou mais\",$BC$79=4,CALC.D!$G$59=$BU$78),\"Consultar Normas de Ligação Agrupada\",0)","v":0}]
[{"$f":"IF(AND(CALC.D!$B$60<=D92,OR(CALC.D!$B$62<=E92,CALC.D!$B$62=\"\"),$AV$83<=$AD$83,$AX$83<=$AF$86,CALC.D!$AB$20=1),1,0)","v":0},0,"C8 TRIFÁSICO",75,39,"220/380 (BIFÁSICOS OU TRIFÁSICOS)",null,3,"-",10,"16 mm²","DJ 60 A","1 1/4\"",40,"1 1/2\"",40,"16 mm²","25 mm²","III, V, VI, E",null,"7,5 X 200",null,null,null,null,"DEFINIDO PELA CERIM",null,null,null,null,null,null,null,null,null,null,null,null,null,null,null,null,null,null,null,null,null,null,null,null,null,null,null,"FACE B",{"$f":"IF(AND(CALC.D!AB15=0,AV83<=AD82,CALC.D!E64=TABELAS!AB57),VLOOKUP(BD94,BE94:BO96,BE93,FALSE),IF(AND(CALC.D!AB15=0,AV83<=AD82,CALC.D!E64=TABELAS!AB58),VLOOKUP(BD97,BE97:BO99,BE93,FALSE),IF(AND(CALC.D!AB15=0,AV83<=AD82,CALC.D!E64=TABELAS!AB59),VLOOKUP(BD100,BE100:BO102,BE93,FALSE),IF(AND(CALC.D!AB15=0,AV83<=AD82,CALC.D!E64=TABELAS!AB60),VLOOKUP(BD103,BE103:BO105,BE93,FALSE),IF(AND(OR(CALC.D!AB15=1,AV83>AD82),CALC.D!E64=TABELAS!AB57),VLOOKUP(BD94,BP94:BU96,BE93,FALSE),IF(AND(OR(CALC.D!AB15=1,AV83>AD82),CALC.D!E64=TABELAS!AB58),VLOOKUP(BD97,BP97:BU99,BE93,FALSE),IF(AND(OR(CALC.D!AB15=1,AV83>AD82),CALC.D!E64=TABELAS!AB59),VLOOKUP(BD100,BP100:BU102,BE93,FALSE),IF(AND(OR(CALC.D!AB15=1,AV83>AD82),CALC.D!E64=TABELAS!AB60),VLOOKUP(BD103,BP103:BU105,BE93,FALSE),\"\"))))))))","v":""},null,null,"A1 MONOFÁSICO","A2 MONOFÁSICO","B1 BIFÁSICO","B2 BIFÁSICO","C1 TRIFÁSICO","C2 TRIFÁSICO","C3 TRIFÁSICO","C4 TRIFÁSICO","C5 TRIFÁSICO","C6 TRIFÁSICO",null,"C7 TRIFÁSICO","C8 TRIFÁSICO","C9 TRIFÁSICO","C10 TRIFÁSICO","C11 TRIFÁSICO"]
[{"$f":"IF(AND(CALC.D!$B$60<=D93,OR(CALC.D!$B$62<=E93,CALC.D!$B$62=\"\"),$AV$83<=$AD$83,$AX$83<=$AF$87,CALC.D!$AB$20=1),1,0)","v":0},0,"C9 TRIFÁSICO",75,45,"220/380 (BIFÁSICOS OU TRIFÁSICOS)",null,3,"-",15,"25 mm²","DJ 70 A","1 1/4\"",50,"2\"",50,"16 mm²","25 mm²","III, V, VI, E",null,"7,5 X 200",null,null,null,null,"DEFINIDO PELA CERIM",null,null,null,null,null,null,null,null,null,null,null,null,null,null,null,null,null,null,null,null,null,null,null,null,null,null,null,"LIGAÇÕES",{"$f":"IF(A49=1,VLOOKUP(CALC.D!$E$64,TABELAS!AB56:AC61,2,FALSE),\"\")","v":""},"FACE B",{"$f":"HLOOKUP(CALC.D!$G$59,DIMENSIONAMENTO!BF92:BU93,2,FALSE)","v":{"$error":"#N/A"}},2,3,4,5,6,7,8,9,10,11,null,2,3,4,5,6]
[{"$f":"IF(AND(CALC.D!$B$60<=D94,OR(CALC.D!$B$62<=E94,CALC.D!$B$62=\"\"),$AV$83<=$AD$84,$AX$83<=$AF$88,CALC.D!$AB$20=1),1,0)","v":0},0,"C10 TRIFÁSICO",75,65,"220/380 (BIFÁSICOS OU TRIFÁSICOS)",null,5,"-",20,"35 mm²","DJ 100 A","2\"",60,"2 1/2\"",65,"16 mm²","25 mm²","III, V, VI, E",null,"7,5 X 200",null,null,null,null,"DEFINIDO PELA CERIM",null,null,null,null,null,null,null,null,null,null,null,null,null,null,null,null,null,null,null,null,null,null,null,null,null,null,null,"POSTE DUPLO T",1,{"$f":"IF(CALC.D!$E$64=TABELAS!AB57,VLOOKUP(CALC.D!$F$10,$BC$94:$BE$96,3,FALSE),0)","v":0},1,{"$f":"IF(AND(CALC.D!AB15=0,CALC.D!$C$6<>\"\",CALC.D!$G$6<>\"\",CALC.D!$R$2<>\"\",CALC.D!$AB$20=1,CALC.D!$F$10<>\"\",CALC.D!$E$64<>\"\"),IF(AND(BC93=1,CALC.D!$G$59=$BF$92,CALC.D!$F$10=1),\"USAR CAIXA TIPO II, IV, VI OU E\",0))","v":false},{"$f":"IF(AND(CALC.D!AB15=0,CALC.D!$C$6<>\"\",CALC.D!$G$6<>\"\",CALC.D!$R$2<>\"\",CALC.D!$AB$20=1,CALC.D!$F$10<>\"\",CALC.D!$E$64<>\"\"),IF(AND(BC93=1,CALC.D!$G$59=$BG$92,CALC.D!$F$10=1),\"USAR CAIXA TIPO II, IV, VI OU E\",0))","v":false},{"$f":"IF(AND(CALC.D!AB15=0,CALC.D!$C$6<>\"\",CALC.D!$G$6<>\"\",CALC.D!$R$2<>\"\",CALC.D!$AB$20=1,CALC.D!$F$10<>\"\",CALC.D!$E$64<>\"\"),IF(AND($BC$93=1,CALC.D!$G$59=$BH$92,CALC.D!$F$10=1),\"USAR CAIXA TIPO II, IV, VI OU E\",0))","v":false},{"$f":"IF(AND(CALC.D!AB15=0,CALC.D!$C$6<>\"\",CALC.D!$G$6<>\"\",CALC.D!$R$2<>\"\",CALC.D!$AB$20=1,CALC.D!$F$10<>\"\",CALC.D!$E$64<>\"\"),IF(AND($BC$93=1,CALC.D!$G$59=$BI$92,CALC.D!$F$10=1),\"USAR CAIXA TIPO II, IV, VI OU E\",0))","v":false},{"$f":"IF(AND(CALC.D!AB15=0,CALC.D!$C$6<>\"\",CALC.D!$G$6<>\"\",CALC.D!$R$2<>\"\",CALC.D!$AB$20=1,CALC.D!$F$10<>\"\",CALC.D!$E$64<>\"\"),IF(AND($BC$93=1,CALC.D!$G$59=$BJ$92,CALC.D!$F$10=1),\"USAR CAIXA TIPO III, V, VI OU E\",0))","v":false},{"$f":"IF(AND(CALC.D!AB15=0,CALC.D!$C$6<>\"\",CALC.D!$G$6<>\"\",CALC.D!$R$2<>\"\",CALC.D!$AB$20=1,CALC.D!$F$10<>\"\",CALC.D!$E$64<>\"\"),IF(AND($BC$93=1,CALC.D!$G$59=$BK$92,CALC.D!$F$10=1),\"USAR CAIXA TIPO III, V, VI OU E\",0))","v":false},{"$f":"IF(AND(CALC.D!AB15=0,CALC.D!$C$6<>\"\",CALC.D!$G$6<>\"\",CALC.D!$R$2<>\"\",CALC.D!$AB$20=1,CALC.D!$F$10<>\"\",CALC.D!$E$64<>\"\"),IF(AND($BC$93=1,CALC.D!$G$59=$BL$92,CALC.D!$F$10=1),\"USAR CAIXA TIPO III, V, VI OU E\",0))","v":false},{"$f":"IF(AND(CALC.D!AB15=0,CALC.D!$C$6<>\"\",CALC.D!$G$6<>\"\",CALC.D!$R$2<>\"\",CALC.D!$AB$20=1,CALC.D!$F$10<>\"\",CALC.D!$E$64<>\"\"),IF(AND($BC$93=1,CALC.D!$G$59=$BM$92,CALC.D!$F$10=1),\"USAR CAIXA L+T\",0))","v":false},{"$f":"IF(AND(CALC.D!AB15=0,CALC.D!$C$6<>\"\",CALC.D!$G$6<>\"\",CALC.D!$R$2<>\"\",CALC.D!$AB$20=1,CALC.D!$F$10<>\"\",CALC.D!$E$64<>\"\"),IF(AND($BC$93=1,CALC.D!$G$59=$BN$92,CALC.D!$F$10=1),\"USAR CAIXA L + T\",0))","v":false},{"$f":"IF(AND(CALC.D!AB15=0,CALC.D!$C$6<>\"\",CALC.D!$G$6<>\"\",CALC.D!$R$2<>\"\",CALC.D!$AB$20=1,CALC.D!$F$10<>\"\",CALC.D!$E$64<>\"\"),IF(AND($BC$93=1,CALC.D!$G$59=$BO$92,CALC.D!$F$10=1),\"USAR CAIXA L + T\",0))","v":false},1,{"$f":"IF(AND(OR(CALC.D!AB15=1,AV83>AD82),CALC.D!$C$6<>\"\",CALC.D!$G$6<>\"\",CALC.D!$R$2<>\"\",CALC.D!$AB$20=1,CALC.D!$F$10<>\"\",CALC.D!$E$64<>\"\"),IF(AND($BC$93=1,CALC.D!$G$59=$BQ$92,CALC.D!$F$10=1),\"USAR CAIXA TIPO III, V, VI OU E\",0))","v":false},{"$f":"IF(AND(OR(CALC.D!AB15=1,AV83>AD82),CALC.D!$C$6<>\"\",CALC.D!$G$6<>\"\",CALC.D!$R$2<>\"\",CALC.D!$AB$20=1,CALC.D!$F$10<>\"\",CALC.D!$E$64<>\"\"),IF(AND($BC$93=1,CALC.D!$G$59=$BR$92,CALC.D!$F$10=1),\"USAR CAIXA TIPO III, V, VI OU E\",0))","v":false},{"$f":"IF(AND(OR(CALC.D!AB15=1,AV83>AD82),CALC.D!$C$6<>\"\",CALC.D!$G$6<>\"\",CALC.D!$R$2<>\"\",CALC.D!$AB$20=1,CALC.D!$F$10<>\"\",CALC.D!$E$64<>\"\"),IF(AND($BC$93=1,CALC.D!$G$59=$BS$92,CALC.D!$F$10=1),\"USAR CAIXA TIPO III, V, VI OU E\",0))","v":false},{"$f":"IF(AND(OR(CALC.D!AB15=1,AV83>AD82),CALC.D!$C$6<>\"\",CALC.D!$G$6<>\"\",CALC.D!$R$2<>\"\",CALC.D!$AB$20=1,CALC.D!$F$10<>\"\",CALC.D!$E$64<>\"\"),IF(AND($BC$93=1,CALC.D!$G$59=$BT$92,CALC.D!$F$10=1),\"USAR CAIXA TIPO III, V, VI OU E\",0))","v":false},{"$f":"IF(AND(OR(CALC.D!AB15=1,AV83>AD82),CALC.D!$C$6<>\"\",CALC.D!$G$6<>\"\",CALC.D!$R$2<>\"\",CALC.D!$AB$20=1,CALC.D!$F$10<>\"\",CALC.D!$E$64<>\"\"),IF(AND($BC$93=1,CALC.D!$G$59=$BU$92,CALC.D!$F$10=1),\"USAR CAIXA TIPO L + T\",0))","v":false}]
[{"$f":"IF(AND(CALC.D!$B$60<=D95,OR(CALC.D!$B$62<=E95,CALC.D!$B$62=\"\"),$AV$83<=$AD$84,$AX$83<=$AF$90,CALC.D!$AB$20=1),1,0)","v":0},0,"C11 TRIFÁSICO",75,75,"220/380 (BIFÁSICOS OU TRIFÁSICOS)",null,5,"-",30,"50 mm²","DJ 125 A","2 1/2\"",75,"3\"",80,"25 mm²","25 mm²","L + T",null,"7,5 X 300",null,null,null,null,"DEFINIDO PELA CERIM",null,null,null,null,null,null,null,null,null,null,null,null,null,null,null,null,null,null,null,null,null,null,null,null,null,null,null,null,2,null,2,{"$f":"IF(AND(CALC.D!AB15=0,CALC.D!$C$6<>\"\",CALC.D!$G$6<>\"\",CALC.D!$R$2<>\"\",CALC.D!$AB$20=1,CALC.D!$F$10<>\"\",CALC.D!$E$64<>\"\"),IF(AND(BC93=1,CALC.D!$G$59=$BF$92,CALC.D!$F$10=2),\"USAR CAIXA TIPO II, IV, VI OU E\",0))","v":false},{"$f":"IF(AND(CALC.D!AB15=0,CALC.D!$C$6<>\"\",CALC.D!$G$6<>\"\",CALC.D!$R$2<>\"\",CALC.D!$AB$20=1,CALC.D!$F$10<>\"\",CALC.D!$E$64<>\"\"),IF(AND(BC93=1,CALC.D!$G$59=$BG$92,CALC.D!$F$10=2),\"USAR CAIXA TIPO II, IV, VI OU E\",0))","v":false},{"$f":"IF(AND(CALC.D!AB15=0,CALC.D!$C$6<>\"\",CALC.D!$G$6<>\"\",CALC.D!$R$2<>\"\",CALC.D!$AB$20=1,CALC.D!$F$10<>\"\",CALC.D!$E$64<>\"\"),IF(AND($BC$93=1,CALC.D!$G$59=$BH$92,CALC.D!$F$10=2),\"USAR CAIXA TIPO II, IV, VI OU E\",0))","v":false},{"$f":"IF(AND(CALC.D!AB15=0,CALC.D!$C$6<>\"\",CALC.D!$G$6<>\"\",CALC.D!$R$2<>\"\",CALC.D!$AB$20=1,CALC.D!$F$10<>\"\",CALC.D!$E$64<>\"\"),IF(AND($BC$93=1,CALC.D!$G$59=$BI$92,CALC.D!$F$10=2),\"USAR CAIXA TIPO II, IV, VI OU E\",0))","v":false},{"$f":"IF(AND(CALC.D!AB15=0,CALC.D!$C$6<>\"\",CALC.D!$G$6<>\"\",CALC.D!$R$2<>\"\",CALC.D!$AB$20=1,CALC.D!$F$10<>\"\",CALC.D!$E$64<>\"\"),IF(AND($BC$93=1,CALC.D!$G$59=$BJ$92,CALC.D!$F$10=2),\"USAR CAIXA TIPO III, V, VI OU E\",0))","v":false},{"$f":"IF(AND(CALC.D!AB15=0,CALC.D!$C$6<>\"\",CALC.D!$G$6<>\"\",CALC.D!$R$2<>\"\",CALC.D!$AB$20=1,CALC.D!$F$10<>\"\",CALC.D!$E$64<>\"\"),IF(AND($BC$93=1,CALC.D!$G$59=$BK$92,CALC.D!$F$10=2),\"USAR CAIXA TIPO III, V, VI OU E\",0))","v":false},{"$f":"IF(AND(CALC.D!AB15=0,CALC.D!$C$6<>\"\",CALC.D!$G$6<>\"\",CALC.D!$R$2<>\"\",CALC.D!$AB$20=1,CALC.D!$F$10<>\"\",CALC.D!$E$64<>\"\"),IF(AND($BC$93=1,CALC.D!$G$59=$BL$92,CALC.D!$F$10=2),\"USAR CAIXA TIPO III, V, VI OU E\",0))","v":false},{"$f":"IF(AND(CALC.D!AB15=0,CALC.D!$C$6<>\"\",CALC.D!$G$6<>\"\",CALC.D!$R$2<>\"\",CALC.D!$AB$20=1,CALC.D!$F$10<>\"\",CALC.D!$E$64<>\"\"),IF(AND($BC$93=1,CALC.D!$G$59=$BM$92,CALC.D!$F$10=2),\"USAR CAIXA L+T\",0))","v":false},{"$f":"IF(AND(CALC.D!AB15=0,CALC.D!$C$6<>\"\",CALC.D!$G$6<>\"\",CALC.D!$R$2<>\"\",CALC.D!$AB$20=1,CALC.D!$F$10<>\"\",CALC.D!$E$64<>\"\"),IF(AND($BC$93=1,CALC.D!$G$59=$BN$92,CALC.D!$F$10=2),\"USAR CAIXA L + T\",0))","v":false},{"$f":"IF(AND(CALC.D!AB15=0,CALC.D!$C$6<>\"\",CALC.D!$G$6<>\"\",CALC.D!$R$2<>\"\",CALC.D!$AB$20=1,CALC.D!$F$10<>\"\",CALC.D!$E$64<>\"\"),IF(AND($BC$93=1,CALC.D!$G$59=$BO$92,CALC.D!$F$10=2),\"USAR CAIXA L + T\",0))","v":false},2,{"$f":"IF(AND(OR(CALC.D!AB15=1,AV83>AD82),CALC.D!$C$6<>\"\",CALC.D!$G$6<>\"\",CALC.D!$R$2<>\"\",CALC.D!$AB$20=1,CALC.D!$F$10<>\"\",CALC.D!$E$64<>\"\"),IF(AND($BC$93=1,CALC.D!$G$59=$BQ$92,CALC.D!$F$10=2),\"USAR CAIXA TIPO III, V, VI OU E\",0))","v":false},{"$f":"IF(AND(OR(CALC.D!AB15=1,AV83>AD82),CALC.D!$C$6<>\"\",CALC.D!$G$6<>\"\",CALC.D!$R$2<>\"\",CALC.D!$AB$20=1,CALC.D!$F$10<>\"\",CALC.D!$E$64<>\"\"),IF(AND($BC$93=1,CALC.D!$G$59=$BR$92,CALC.D!$F$10=2),\"USAR CAIXA TIPO III, V, VI OU E\",0))","v":false},{"$f":"IF(AND(OR(CALC.D!AB15=1,AV83>AD82),CALC.D!$C$6<>\"\",CALC.D!$G$6<>\"\",CALC.D!$R$2<>\"\",CALC.D!$AB$20=1,CALC.D!$F$10<>\"\",CALC.D!$E$64<>\"\"),IF(AND($BC$93=1,CALC.D!$G$59=$BS$92,CALC.D!$F$10=2),\"USAR CAIXA TIPO III, V, VI OU E\",0))","v":false},{"$f":"IF(AND(OR(CALC.D!AB15=1,AV83>AD82),CALC.D!$C$6<>\"\",CALC.D!$G$6<>\"\",CALC.D!$R$2<>\"\",CALC.D!$AB$20=1,CALC.D!$F$10<>\"\",CALC.D!$E$64<>\"\"),IF(AND($BC$93=1,CALC.D!$G$59=$BT$92,CALC.D!$F$10=2),\"USAR CAIXA TIPO III, V, VI OU E\",0))","v":false},{"$f":"IF(AND(OR(CALC.D!AB15=1,AV83>AD82),CALC.D!$C$6<>\"\",CALC.D!$G$6<>\"\",CALC.D!$R$2<>\"\",CALC.D!$AB$20=1,CALC.D!$F$10<>\"\",CALC.D!$E$64<>\"\"),IF(AND($BC$93=1,CALC.D!$G$59=$BU$92,CALC.D!$F$10=2),\"USAR CAIXA TIPO L + T\",0))","v":false}]
[null,null,null,null,null,null,null,null,null,null,null,null,null,null,null,null,null,null,null,null,null,null,null,null,null,null,null,null,null,null,null,null,null,null,null,null,null,null,null,null,null,null,null,null,null,null,null,null,null,null,null,null,null,null,"3 ou mais",null,3,{"$f":"IF(AND(CALC.D!AB15=0,CALC.D!$C$6<>\"\",CALC.D!$G$6<>\"\",CALC.D!$R$2<>\"\",CALC.D!$AB$20=1,CALC.D!$F$10<>\"\",CALC.D!$E$64<>\"\"),IF(AND(BC93=1,CALC.D!$G$59=$BF$92,CALC.D!$F$10=\"3 ou mais\"),\"ou Ligação Coletiva\",0))","v":false},{"$f":"IF(AND(CALC.D!AB15=0,CALC.D!$C$6<>\"\",CALC.D!$G$6<>\"\",CALC.D!$R$2<>\"\",CALC.D!$AB$20=1,CALC.D!$F$10<>\"\",CALC.D!$E$64<>\"\"),IF(AND(BC93=1,CALC.D!$G$59=$BG$92,CALC.D!$F$10=\"3 ou mais\"),\"ou Ligação Coletiva\",0))","v":false},{"$f":"IF(AND(CALC.D!AB15=0,CALC.D!$C$6<>\"\",CALC.D!$G$6<>\"\",CALC.D!$R$2<>\"\",CALC.D!$AB$20=1,CALC.D!$F$10<>\"\",CALC.D!$E$64<>\"\"),IF(AND($BC$93=1,CALC.D!$G$59=$BH$92,CALC.D!$F$10=\"3 ou mais\"),\"ou Ligação Coletiva\",0))","v":false},{"$f":"IF(AND(CALC.D!AB15=0,CALC.D!$C$6<>\"\",CALC.D!$G$6<>\"\",CALC.D!$R$2<>\"\",CALC.D!$AB$20=1,CALC.D!$F$10<>\"\",CALC.D!$E$64<>\"\"),IF(AND($BC$93=1,CALC.D!$G$59=$BI$92,CALC.D!$F$10=\"3 ou mais\"),\"ou Ligação Coletiva\",0))","v":false},{"$f":"IF(AND(CALC.D!AB15=0,CALC.D!$C$6<>\"\",CALC.D!$G$6<>\"\",CALC.D!$R$2<>\"\",CALC.D!$AB$20=1,CALC.D!$F$10<>\"\",CALC.D!$E$64<>\"\"),IF(AND($BC$93=1,CALC.D!$G$59=$BJ$92,CALC.D!$F$10=\"3 ou mais\"),\"ou Ligação Coletiva\",0))","v":false},{"$f":"IF(AND(CALC.D!AB15=0,CALC.D!$C$6<>\"\",CALC.D!$G$6<>\"\",CALC.D!$R$2<>\"\",CALC.D!$AB$20=1,CALC.D!$F$10<>\"\",CALC.D!$E$64<>\"\"),IF(AND($BC$93=1,CALC.D!$G$59=$BK$92,CALC.D!$F$10=\"3 ou mais\"),\"ou Ligação Coletiva\",0))","v":false},{"$f":"IF(AND(CALC.D!AB15=0,CALC.D!$C$6<>\"\",CALC.D!$G$6<>\"\",CALC.D!$R$2<>\"\",CALC.D!$AB$20=1,CALC.D!$F$10<>\"\",CALC.D!$E$64<>\"\"),IF(AND($BC$93=1,CALC.D!$G$59=$BL$92,CALC.D!$F$10=\"3 ou mais\"),\"ou Ligação Coletiva\",0))","v":false},{"$f":"IF(AND(CALC.D!AB15=0,CALC.D!$C$6<>\"\",CALC.D!$G$6<>\"\",CALC.D!$R$2<>\"\",CALC.D!$AB$20=1,CALC.D!$F$10<>\"\",CALC.D!$E$64<>\"\"),IF(AND($BC$93=1,CALC.D!$G$59=$BM$92,CALC.D!$F$10=\"3 ou mais\"),\"ou Ligação Coletiva\",0))","v":false},{"$f":"IF(AND(CALC.D!AB15=0,CALC.D!$C$6<>\"\",CALC.D!$G$6<>\"\",CALC.D!$R$2<>\"\",CALC.D!$AB$20=1,CALC.D!$F$10<>\"\",CALC.D!$E$64<>\"\"),IF(AND($BC$93=1,CALC.D!$G$59=$BN$92,CALC.D!$F$10=\"3 ou mais\"),\"ou Ligação Coletiva\",0))","v":false},{"$f":"IF(AND(CALC.D!AB15=0,CALC.D!$C$6<>\"\",CALC.D!$G$6<>\"\",CALC.D!$R$2<>\"\",CALC.D!$AB$20=1,CALC.D!$F$10<>\"\",CALC.D!$E$64<>\"\"),IF(AND($BC$93=1,CALC.D!$G$59=$BO$92,CALC.D!$F$10=\"3 ou mais\"),\"ou Ligação Coletiva\",0))","v":false},3,{"$f":"IF(AND(OR(CALC.D!AB15=1,AV83>AD82),CALC.D!$C$6<>\"\",CALC.D!$G$6<>\"\",CALC.D!$R$2<>\"\",CALC.D!$AB$20=1,CALC.D!$F$10<>\"\",CALC.D!$E$64<>\"\"),IF(AND($BC$93=1,CALC.D!$G$59=$BQ$92,CALC.D!$F$10=\"3 ou mais\"),\"ou Ligação Coletiva\",0))","v":false},{"$f":"IF(AND(OR(CALC.D!AB15=1,AV83>AD82),CALC.D!$C$6<>\"\",CALC.D!$G$6<>\"\",CALC.D!$R$2<>\"\",CALC.D!$AB$20=1,CALC.D!$F$10<>\"\",CALC.D!$E$64<>\"\"),IF(AND($BC$93=1,CALC.D!$G$59=$BR$92,CALC.D!$F$10=\"3 ou mais\"),\"ou Ligação Coletiva\",0))","v":false},{"$f":"IF(AND(OR(CALC.D!AB15=1,AV83>AD82),CALC.D!$C$6<>\"\",CALC.D!$G$6<>\"\",CALC.D!$R$2<>\"\",CALC.D!$AB$20=1,CALC.D!$F$10<>\"\",CALC.D!$E$64<>\"\"),IF(AND($BC$93=1,CALC.D!$G$59=$BS$92,CALC.D!$F$10=\"3 ou mais\"),\"ou Ligação Coletiva\",0))","v":false},{"$f":"IF(AND(OR(CALC.D!AB15=1,AV83>AD82),CALC.D!$C$6<>\"\",CALC.D!$G$6<>\"\",CALC.D!$R$2<>\"\",CALC.D!$AB$20=1,CALC.D!$F$10<>\"\",CALC.D!$E$64<>\"\"),IF(AND($BC$93=1,CALC.D!$G$59=$BT$92,CALC.D!$F$10=\"3 ou mais\"),\"ou Ligação Coletiva\",0))","v":false},{"$f":"IF(AND(OR(CALC.D!AB15=1,AV83>AD82),CALC.D!$C$6<>\"\",CALC.D!$G$6<>\"\",CALC.D!$R$2<>\"\",CALC.D!$AB$20=1,CALC.D!$F$10<>\"\",CALC.D!$E$64<>\"\"),IF(AND($BC$93=1,CALC.D!$G$59=$BU$92,CALC.D!$F$10=\"3 ou mais\"),\"ou Ligação Coletiva\",0))","v":false}]
[null,null,null,null,null,null,null,null,null,null,null,null,null,null,null,null,null,null,null,null,null,null,null,null,null,null,null,null,null,null,null,null,null,null,null,null,null,null,null,null,null,null,null,null,null,null,null,null,null,null,null,null,null,"PADRÃO COM PCI",1,{"$f":"IF(CALC.D!$E$64=TABELAS!AB58,VLOOKUP(CALC.D!$F$10,$BC$97:$BE$99,3,FALSE),0)","v":0},4,{"$f":"IF(AND(CALC.D!AB15=0,CALC.D!$C$6<>\"\",CALC.D!$G$6<>\"\",CALC.D!$R$2<>\"\",CALC.D!$AB$20=1,CALC.D!$F$10<>\"\",CALC.D!$E$64<>\"\",CALC.D!$F$10=1,BC93=2,CALC.D!$G$59=$BF$92),TABELAS!$AJ$57,0)","v":0},{"$f":"IF(AND(CALC.D!AB15=0,CALC.D!$C$6<>\"\",CALC.D!$G$6<>\"\",CALC.D!$R$2<>\"\",CALC.D!$AB$20=1,CALC.D!$F$10<>\"\",CALC.D!$E$64<>\"\",CALC.D!$F$10=1,BC93=2,CALC.D!$G$59=$BG$92),TABELAS!$AJ$58,0)","v":0},{"$f":"IF(AND(CALC.D!AB15=0,CALC.D!$C$6<>\"\",CALC.D!$G$6<>\"\",CALC.D!$R$2<>\"\",CALC.D!$AB$20=1,CALC.D!$F$10<>\"\",CALC.D!$E$64<>\"\",CALC.D!$F$10=1,$BC$93=2,CALC.D!$G$59=$BH$92),TABELAS!$AJ$59,0)","v":0},{"$f":"IF(AND(CALC.D!AB15=0,CALC.D!$C$6<>\"\",CALC.D!$G$6<>\"\",CALC.D!$R$2<>\"\",CALC.D!$AB$20=1,CALC.D!$F$10<>\"\",CALC.D!$E$64<>\"\",CALC.D!$F$10=1,$BC$93=2,CALC.D!$G$59=$BI$92),TABELAS!$AJ$60,0)","v":0},{"$f":"IF(AND(CALC.D!AB15=0,CALC.D!$C$6<>\"\",CALC.D!$G$6<>\"\",CALC.D!$R$2<>\"\",CALC.D!$AB$20=1,CALC.D!$F$10<>\"\",CALC.D!$E$64<>\"\",CALC.D!$F$10=1,$BC$93=2,CALC.D!$G$59=$BJ$92),TABELAS!$AJ$61,0)","v":0},{"$f":"IF(AND(CALC.D!AB15=0,CALC.D!$C$6<>\"\",CALC.D!$G$6<>\"\",CALC.D!$R$2<>\"\",CALC.D!$AB$20=1,CALC.D!$F$10<>\"\",CALC.D!$E$64<>\"\",CALC.D!$F$10=1,$BC$93=2,CALC.D!$G$59=$BK$92),TABELAS!$AJ$62,0)","v":0},{"$f":"IF(AND(CALC.D!AB15=0,CALC.D!$C$6<>\"\",CALC.D!$G$6<>\"\",CALC.D!$R$2<>\"\",CALC.D!$AB$20=1,CALC.D!$F$10<>\"\",CALC.D!$E$64<>\"\",CALC.D!$F$10=1,$BC$93=2,CALC.D!$G$59=$BL$92),TABELAS!$AJ$63,0)","v":0},{"$f":"IF(AND(CALC.D!AB15=0,CALC.D!$C$6<>\"\",CALC.D!$G$6<>\"\",CALC.D!$R$2<>\"\",CALC.D!$AB$20=1,CALC.D!$F$10<>\"\",CALC.D!$E$64<>\"\",CALC.D!$F$10=1,$BC$93=2,CALC.D!$G$59=$BM$92),TABELAS!$AJ$64,0)","v":0},{"$f":"IF(AND(CALC.D!AB15=0,CALC.D!$C$6<>\"\",CALC.D!$G$6<>\"\",CALC.D!$R$2<>\"\",CALC.D!$AB$20=1,CALC.D!$F$10<>\"\",CALC.D!$E$64<>\"\",CALC.D!$F$10=1,$BC$93=2,CALC.D!$G$59=$BN$92),TABELAS!$AJ$65,0)","v":0},{"$f":"IF(AND(CALC.D!AB15=0,CALC.D!$C$6<>\"\",CALC.D!$G$6<>\"\",CALC.D!$R$2<>\"\",CALC.D!$AB$20=1,CALC.D!$F$10<>\"\",CALC.D!$E$64<>\"\",CALC.D!$F$10=1,$BC$93=2,CALC.D!$G$59=$BO$92),TABELAS!$AJ$66,0)","v":0},4,{"$f":"IF(AND(OR(CALC.D!AB15=1,AV83>AD82),CALC.D!$C$6<>\"\",CALC.D!$G$6<>\"\",CALC.D!$R$2<>\"\",CALC.D!$AB$20=1,CALC.D!$F$10<>\"\",CALC.D!$E$64<>\"\",CALC.D!$F$10=1,$BC$93=2,CALC.D!$G$59=$BQ$92),TABELAS!$AJ$67,0)","v":0},{"$f":"IF(AND(OR(CALC.D!AB15=1,AV83>AD82),CALC.D!$C$6<>\"\",CALC.D!$G$6<>\"\",CALC.D!$R$2<>\"\",CALC.D!$AB$20=1,CALC.D!$F$10<>\"\",CALC.D!$E$64<>\"\",CALC.D!$F$10=1,$BC$93=2,CALC.D!$G$59=$BR$92),TABELAS!$AJ$68,0)","v":0},{"$f":"IF(AND(OR(CALC.D!AB15=1,AV83>AD82),CALC.D!$C$6<>\"\",CALC.D!$G$6<>\"\",CALC.D!$R$2<>\"\",CALC.D!$AB$20=1,CALC.D!$F$10<>\"\",CALC.D!$E$64<>\"\",CALC.D!$F$10=1,$BC$93=2,CALC.D!$G$59=$BS$92),TABELAS!$AJ$69,0)","v":0},{"$f":"IF(AND(OR(CALC.D!AB15=1,AV83>AD82),CALC.D!$C$6<>\"\",CALC.D!$G$6<>\"\",CALC.D!$R$2<>\"\",CALC.D!$AB$20=1,CALC.D!$F$10<>\"\",CALC.D!$E$64<>\"\",CALC.D!$F$10=1,$BC$93=2,CALC.D!$G$59=$BT$92),TABELAS!$AJ$70,0)","v":0},{"$f":"IF(AND(OR(CALC.D!AB15=1,AV83>AD82),CALC.D!$C$6<>\"\",CALC.D!$G$6<>\"\",CALC.D!$R$2<>\"\",CALC.D!$AB$20=1,CALC.D!$F$10<>\"\",CALC.D!$E$64<>\"\",CALC.D!$F$10=1,$BC$93=2,CALC.D!$G$59=$BU$92),TABELAS!$AJ$71,0)","v":0}]
[null,null,null,null,null,null,null,null,null,null,null,null,null,null,null,null,null,null,null,null,null,null,null,null,null,null,null,null,null,null,null,null,null,null,null,null,null,null,null,null,null,null,null,null,null,null,null,null,null,null,null,null,null,null,2,null,5,{"$f":"IF(AND(CALC.D!AB15=0,CALC.D!$C$6<>\"\",CALC.D!$G$6<>\"\",CALC.D!$R$2<>\"\",CALC.D!$AB$20=1,CALC.D!$F$10<>\"\",CALC.D!$E$64<>\"\",CALC.D!$F$10=2,BC93=2,CALC.D!$G$59=$BF$92),TABELAS!$AJ$57,0)","v":0},{"$f":"IF(AND(CALC.D!AB15=0,CALC.D!$C$6<>\"\",CALC.D!$G$6<>\"\",CALC.D!$R$2<>\"\",CALC.D!$AB$20=1,CALC.D!$F$10<>\"\",CALC.D!$E$64<>\"\",CALC.D!$F$10=2,BC93=2,CALC.D!$G$59=$BG$92),TABELAS!$AJ$58,0)","v":0},{"$f":"IF(AND(CALC.D!AB15=0,CALC.D!$C$6<>\"\",CALC.D!$G$6<>\"\",CALC.D!$R$2<>\"\",CALC.D!$AB$20=1,CALC.D!$F$10<>\"\",CALC.D!$E$64<>\"\",CALC.D!$F$10=2,$BC$93=2,CALC.D!$G$59=$BH$92),TABELAS!$AJ$59,0)","v":0},{"$f":"IF(AND(CALC.D!AB15=0,CALC.D!$C$6<>\"\",CALC.D!$G$6<>\"\",CALC.D!$R$2<>\"\",CALC.D!$AB$20=1,CALC.D!$F$10<>\"\",CALC.D!$E$64<>\"\",CALC.D!$F$10=2,$BC$93=2,CALC.D!$G$59=$BI$92),TABELAS!$AJ$60,0)","v":0},{"$f":"IF(AND(CALC.D!AB15=0,CALC.D!$C$6<>\"\",CALC.D!$G$6<>\"\",CALC.D!$R$2<>\"\",CALC.D!$AB$20=1,CALC.D!$F$10<>\"\",CALC.D!$E$64<>\"\",CALC.D!$F$10=2,$BC$93=2,CALC.D!$G$59=$BJ$92),TABELAS!$AJ$61,0)","v":0},{"$f":"IF(AND(CALC.D!AB15=0,CALC.D!$C$6<>\"\",CALC.D!$G$6<>\"\",CALC.D!$R$2<>\"\",CALC.D!$AB$20=1,CALC.D!$F$10<>\"\",CALC.D!$E$64<>\"\",CALC.D!$F$10=2,$BC$93=2,CALC.D!$G$59=$BK$92),TABELAS!$AJ$62,0)","v":0},{"$f":"IF(AND(CALC.D!AB15=0,CALC.D!$C$6<>\"\",CALC.D!$G$6<>\"\",CALC.D!$R$2<>\"\",CALC.D!$AB$20=1,CALC.D!$F$10<>\"\",CALC.D!$E$64<>\"\",CALC.D!$F$10=2,$BC$93=2,CALC.D!$G$59=$BL$92),TABELAS!$AJ$63,0)","v":0},{"$f":"IF(AND(CALC.D!AB15=0,CALC.D!$C$6<>\"\",CALC.D!$G$6<>\"\",CALC.D!$R$2<>\"\",CALC.D!$AB$20=1,CALC.D!$F$10<>\"\",CALC.D!$E$64<>\"\",CALC.D!$F$10=2,$BC$93=2,CALC.D!$G$59=$BM$92),TABELAS!$AJ$64,0)","v":0},{"$f":"IF(AND(CALC.D!AB15=0,CALC.D!$C$6<>\"\",CALC.D!$G$6<>\"\",CALC.D!$R$2<>\"\",CALC.D!$AB$20=1,CALC.D!$F$10<>\"\",CALC.D!$E$64<>\"\",CALC.D!$F$10=2,$BC$93=2,CALC.D!$G$59=$BN$92),TABELAS!$AJ$65,0)","v":0},{"$f":"IF(AND(CALC.D!AB15=0,CALC.D!$C$6<>\"\",CALC.D!$G$6<>\"\",CALC.D!$R$2<>\"\",CALC.D!$AB$20=1,CALC.D!$F$10<>\"\",CALC.D!$E$64<>\"\",CALC.D!$F$10=2,$BC$93=2,CALC.D!$G$59=$BO$92),TABELAS!$AJ$66,0)","v":0},5,{"$f":"IF(AND(OR(CALC.D!AB15=1,AV83>AD82),CALC.D!$C$6<>\"\",CALC.D!$G$6<>\"\",CALC.D!$R$2<>\"\",CALC.D!$AB$20=1,CALC.D!$F$10<>\"\",CALC.D!$E$64<>\"\",CALC.D!$F$10=2,$BC$93=2,CALC.D!$G$59=$BQ$92),TABELAS!$AJ$67,0)","v":0},{"$f":"IF(AND(OR(CALC.D!AB15=1,AV83>AD82),CALC.D!$C$6<>\"\",CALC.D!$G$6<>\"\",CALC.D!$R$2<>\"\",CALC.D!$AB$20=1,CALC.D!$F$10<>\"\",CALC.D!$E$64<>\"\",CALC.D!$F$10=2,$BC$93=2,CALC.D!$G$59=$BR$92),TABELAS!$AJ$68,0)","v":0},{"$f":"IF(AND(OR(CALC.D!AB15=1,AV83>AD82),CALC.D!$C$6<>\"\",CALC.D!$G$6<>\"\",CALC.D!$R$2<>\"\",CALC.D!$AB$20=1,CALC.D!$F$10<>\"\",CALC.D!$E$64<>\"\",CALC.D!$F$10=2,$BC$93=2,CALC.D!$G$59=$BS$92),TABELAS!$AJ$69,0)","v":0},{"$f":"IF(AND(OR(CALC.D!AB15=1,AV83>AD82),CALC.D!$C$6<>\"\",CALC.D!$G$6<>\"\",CALC.D!$R$2<>\"\",CALC.D!$AB$20=1,CALC.D!$F$10<>\"\",CALC.D!$E$64<>\"\",CALC.D!$F$10=2,$BC$93=2,CALC.D!$G$59=$BT$92),TABELAS!$AJ$70,0)","v":0},{"$f":"IF(AND(OR(CALC.D!AB15=1,AV83>AD82),CALC.D!$C$6<>\"\",CALC.D!$G$6<>\"\",CALC.D!$R$2<>\"\",CALC.D!$AB$20=1,CALC.D!$F$10<>\"\",CALC.D!$E$64<>\"\",CALC.D!$F$10=2,$BC$93=2,CALC.D!$G$59=$BU$92),TABELAS!$AJ$71,0)","v":0}]
[null,null,null,null,null,null,null,null,null,null,null,null,null,null,null,null,null,null,null,null,null,null,null,null,null,null,null,null,null,null,null,null,null,null,null,null,null,null,null,null,null,null,null,null,null,null,null,null,null,null,null,null,null,null,"3 ou mais",null,6,{"$f":"IF(AND(CALC.D!AB15=0,CALC.D!$C$6<>\"\",CALC.D!$G$6<>\"\",CALC.D!$R$2<>\"\",CALC.D!$AB$20=1,CALC.D!$F$10<>\"\",CALC.D!$E$64<>\"\",CALC.D!$F$10=\"3 ou mais\",BC93=2,CALC.D!$G$59=$BF$92),\"ou Ligação Coletiva\",0)","v":0},{"$f":"IF(AND(CALC.D!AB15=0,CALC.D!$C$6<>\"\",CALC.D!$G$6<>\"\",CALC.D!$R$2<>\"\",CALC.D!$AB$20=1,CALC.D!$F$10<>\"\",CALC.D!$E$64<>\"\",CALC.D!$F$10=\"3 ou mais\",BC93=2,CALC.D!$G$59=$BG$92),\"ou Ligação Coletiva\",0)","v":0},{"$f":"IF(AND(CALC.D!AB15=0,CALC.D!$C$6<>\"\",CALC.D!$G$6<>\"\",CALC.D!$R$2<>\"\",CALC.D!$AB$20=1,CALC.D!$F$10<>\"\",CALC.D!$E$64<>\"\",CALC.D!$F$10=\"3 ou mais\",$BC$93=2,CALC.D!$G$59=$BH$92),\"ou Ligação Coletiva\",0)","v":0},{"$f":"IF(AND(CALC.D!AB15=0,CALC.D!$C$6<>\"\",CALC.D!$G$6<>\"\",CALC.D!$R$2<>\"\",CALC.D!$AB$20=1,CALC.D!$F$10<>\"\",CALC.D!$E$64<>\"\",CALC.D!$F$10=\"3 ou mais\",$BC$93=2,CALC.D!$G$59=$BI$92),\"ou Ligação Coletiva\",0)","v":0},{"$f":"IF(AND(CALC.D!AB15=0,CALC.D!$C$6<>\"\",CALC.D!$G$6<>\"\",CALC.D!$R$2<>\"\",CALC.D!$AB$20=1,CALC.D!$F$10<>\"\",CALC.D!$E$64<>\"\",CALC.D!$F$10=\"3 ou mais\",$BC$93=2,CALC.D!$G$59=$BJ$92),\"ou Ligação Coletiva\",0)","v":0},{"$f":"IF(AND(CALC.D!AB15=0,CALC.D!$C$6<>\"\",CALC.D!$G$6<>\"\",CALC.D!$R$2<>\"\",CALC.D!$AB$20=1,CALC.D!$F$10<>\"\",CALC.D!$E$64<>\"\",CALC.D!$F$10=\"3 ou mais\",$BC$93=2,CALC.D!$G$59=$BK$92),\"ou Ligação Coletiva\",0)","v":0},{"$f":"IF(AND(CALC.D!AB15=0,CALC.D!$C$6<>\"\",CALC.D!$G$6<>\"\",CALC.D!$R$2<>\"\",CALC.D!$AB$20=1,CALC.D!$F$10<>\"\",CALC.D!$E$64<>\"\",CALC.D!$F$10=\"3 ou mais\",$BC$93=2,CALC.D!$G$59=$BL$92),\"ou Ligação Coletiva\",0)","v":0},{"$f":"IF(AND(CALC.D!AB15=0,CALC.D!$C$6<>\"\",CALC.D!$G$6<>\"\",CALC.D!$R$2<>\"\",CALC.D!$AB$20=1,CALC.D!$F$10<>\"\",CALC.D!$E$64<>\"\",CALC.D!$F$10=\"3 ou mais\",$BC$93=2,CALC.D!$G$59=$BM$92),\"ou Ligação Coletiva\",0)","v":0},{"$f":"IF(AND(CALC.D!AB15=0,CALC.D!$C$6<>\"\",CALC.D!$G$6<>\"\",CALC.D!$R$2<>\"\",CALC.D!$AB$20=1,CALC.D!$F$10<>\"\",CALC.D!$E$64<>\"\",CALC.D!$F$10=\"3 ou mais\",$BC$93=2,CALC.D!$G$59=$BN$92),\"ou Ligação Coletiva\",0)","v":0},{"$f":"IF(AND(CALC.D!AB15=0,CALC.D!$C$6<>\"\",CALC.D!$G$6<>\"\",CALC.D!$R$2<>\"\",CALC.D!$AB$20=1,CALC.D!$F$10<>\"\",CALC.D!$E$64<>\"\",CALC.D!$F$10=\"3 ou mais\",$BC$93=2,CALC.D!$G$59=$BO$92),\"ou Ligação Coletiva\",0)","v":0},6,{"$f":"IF(AND(OR(CALC.D!AB15=1,AV83>AD82),CALC.D!$C$6<>\"\",CALC.D!$G$6<>\"\",CALC.D!$R$2<>\"\",CALC.D!$AB$20=1,CALC.D!$F$10<>\"\",CALC.D!$E$64<>\"\",CALC.D!$F$10=\"3 ou mais\",$BC$93=2,CALC.D!$G$59=$BQ$92),\"ou Ligação Coletiva\",0)","v":0},{"$f":"IF(AND(OR(CALC.D!AB15=1,AV83>AD82),CALC.D!$C$6<>\"\",CALC.D!$G$6<>\"\",CALC.D!$R$2<>\"\",CALC.D!$AB$20=1,CALC.D!$F$10<>\"\",CALC.D!$E$64<>\"\",CALC.D!$F$10=\"3 ou mais\",$BC$93=2,CALC.D!$G$59=$BR$92),\"ou Ligação Coletiva\",0)","v":0},{"$f":"IF(AND(OR(CALC.D!AB15=1,AV83>AD82),CALC.D!$C$6<>\"\",CALC.D!$G$6<>\"\",CALC.D!$R$2<>\"\",CALC.D!$AB$20=1,CALC.D!$F$10<>\"\",CALC.D!$E$64<>\"\",CALC.D!$F$10=\"3 ou mais\",$BC$93=2,CALC.D!$G$59=$BS$92),\"ou Ligação Coletiva\",0)","v":0},{"$f":"IF(AND(OR(CALC.D!AB15=1,AV83>AD82),CALC.D!$C$6<>\"\",CALC.D!$G$6<>\"\",CALC.D!$R$2<>\"\",CALC.D!$AB$20=1,CALC.D!$F$10<>\"\",CALC.D!$E$64<>\"\",CALC.D!$F$10=\"3 ou mais\",$BC$93=2,CALC.D!$G$59=$BT$92),\"ou Ligação Coletiva\",0)","v":0},{"$f":"IF(AND(OR(CALC.D!AB15=1,AV83>AD82),CALC.D!$C$6<>\"\",CALC.D!$G$6<>\"\",CALC.D!$R$2<>\"\",CALC.D!$AB$20=1,CALC.D!$F$10<>\"\",CALC.D!$E$64<>\"\",CALC.D!$F$10=\"3 ou mais\",$BC$93=2,CALC.D!$G$59=$BU$92),\"ou Ligação Coletiva\",0)","v":0}]
[null,null,null,null,null,null,null,null,null,null,null,null,null,null,null,null,null,null,null,null,null,null,null,null,null,null,null,null,null,null,null,null,null,null,null,null,null,null,null,null,null,null,null,null,null,null,null,null,null,null,null,null,null,"CONCRETO ARMADO",1,{"$f":"IF(CALC.D!$E$64=TABELAS!AB59,VLOOKUP(CALC.D!$F$10,$BC$100:$BE$102,3,FALSE),0)","v":0},7,{"$f":"IF(AND(CALC.D!AB15=0,CALC.D!$C$6<>\"\",CALC.D!$G$6<>\"\",CALC.D!$R$2<>\"\",CALC.D!$AB$20=1,CALC.D!$F$10<>\"\",CALC.D!$E$64<>\"\",CALC.D!$F$10=1,BC93=3,CALC.D!$G$59=$BF$92),\"- USAR CAIXA TIPO II, IV, VI OU E\",0)","v":0},{"$f":"IF(AND(CALC.D!AB15=0,CALC.D!$C$6<>\"\",CALC.D!$G$6<>\"\",CALC.D!$R$2<>\"\",CALC.D!$AB$20=1,CALC.D!$F$10<>\"\",CALC.D!$E$64<>\"\",CALC.D!$F$10=1,BC93=3,CALC.D!$G$59=$BG$92),\"- USAR CAIXA TIPO II, IV, VI OU E\",0)","v":0},{"$f":"IF(AND(CALC.D!AB15=0,CALC.D!$C$6<>\"\",CALC.D!$G$6<>\"\",CALC.D!$R$2<>\"\",CALC.D!$AB$20=1,CALC.D!$F$10<>\"\",CALC.D!$E$64<>\"\",CALC.D!$F$10=1,$BC$93=3,CALC.D!$G$59=$BH$92),\"- USAR CAIXA TIPO II, IV, VI OU E\",0)","v":0},{"$f":"IF(AND(CALC.D!AB15=0,CALC.D!$C$6<>\"\",CALC.D!$G$6<>\"\",CALC.D!$R$2<>\"\",CALC.D!$AB$20=1,CALC.D!$F$10<>\"\",CALC.D!$E$64<>\"\",CALC.D!$F$10=1,$BC$93=3,CALC.D!$G$59=$BI$92),\"- USAR CAIXA TIPO II, IV, VI OU E\",0)","v":0},{"$f":"IF(AND(CALC.D!AB15=0,CALC.D!$C$6<>\"\",CALC.D!$G$6<>\"\",CALC.D!$R$2<>\"\",CALC.D!$AB$20=1,CALC.D!$F$10<>\"\",CALC.D!$E$64<>\"\",CALC.D!$F$10=1,$BC$93=3,CALC.D!$G$59=$BJ$92),\"- USAR CAIXA TIPO III, V, VI OU E\",0)","v":0},{"$f":"IF(AND(CALC.D!AB15=0,CALC.D!$C$6<>\"\",CALC.D!$G$6<>\"\",CALC.D!$R$2<>\"\",CALC.D!$AB$20=1,CALC.D!$F$10<>\"\",CALC.D!$E$64<>\"\",CALC.D!$F$10=1,$BC$93=3,CALC.D!$G$59=$BK$92),\"- USAR CAIXA TIPO III, V, VI OU E\",0)","v":0},{"$f":"IF(AND(CALC.D!AB15=0,CALC.D!$C$6<>\"\",CALC.D!$G$6<>\"\",CALC.D!$R$2<>\"\",CALC.D!$AB$20=1,CALC.D!$F$10<>\"\",CALC.D!$E$64<>\"\",CALC.D!$F$10=1,$BC$93=3,CALC.D!$G$59=$BL$92),\"- USAR CAIXA TIPO III, V, VI OU E\",0)","v":0},{"$f":"IF(AND(CALC.D!AB15=0,CALC.D!$C$6<>\"\",CALC.D!$G$6<>\"\",CALC.D!$R$2<>\"\",CALC.D!$AB$20=1,CALC.D!$F$10<>\"\",CALC.D!$E$64<>\"\",CALC.D!$F$10=1,$BC$93=3,CALC.D!$G$59=$BM$92),\"- USAR CAIXA TIPO L + T\",0)","v":0},{"$f":"IF(AND(CALC.D!AB15=0,CALC.D!$C$6<>\"\",CALC.D!$G$6<>\"\",CALC.D!$R$2<>\"\",CALC.D!$AB$20=1,CALC.D!$F$10<>\"\",CALC.D!$E$64<>\"\",CALC.D!$F$10=1,$BC$93=3,CALC.D!$G$59=$BN$92),\"CIVIL - USAR CAIXA TIPO L + T\",0)","v":0},{"$f":"IF(AND(CALC.D!AB15=0,CALC.D!$C$6<>\"\",CALC.D!$G$6<>\"\",CALC.D!$R$2<>\"\",CALC.D!$AB$20=1,CALC.D!$F$10<>\"\",CALC.D!$E$64<>\"\",CALC.D!$F$10=1,$BC$93=3,CALC.D!$G$59=$BO$92),\"CIVIL - USAR CAIXA TIPO L + T\",0)","v":0},7,{"$f":"IF(AND(OR(CALC.D!AB15=1,AV83>AD82),CALC.D!$C$6<>\"\",CALC.D!$G$6<>\"\",CALC.D!$R$2<>\"\",CALC.D!$AB$20=1,CALC.D!$F$10<>\"\",CALC.D!$E$64<>\"\",CALC.D!$F$10=1,$BC$93=3,CALC.D!$G$59=$BQ$92),\"- USAR CAIXA TIPO III, V, VI OU E\",0)","v":0},{"$f":"IF(AND(OR(CALC.D!AB15=1,AV83>AD82),CALC.D!$C$6<>\"\",CALC.D!$G$6<>\"\",CALC.D!$R$2<>\"\",CALC.D!$AB$20=1,CALC.D!$F$10<>\"\",CALC.D!$E$64<>\"\",CALC.D!$F$10=1,$BC$93=3,CALC.D!$G$59=$BR$92),\"- USAR CAIXA TIPO III, V, VI OU E\",0)","v":0},{"$f":"IF(AND(OR(CALC.D!AB15=1,AV83>AD82),CALC.D!$C$6<>\"\",CALC.D!$G$6<>\"\",CALC.D!$R$2<>\"\",CALC.D!$AB$20=1,CALC.D!$F$10<>\"\",CALC.D!$E$64<>\"\",CALC.D!$F$10=1,$BC$93=3,CALC.D!$G$59=$BS$92),\"- USAR CAIXA TIPO III, V, VI OU E\",0)","v":0},{"$f":"IF(AND(OR(CALC.D!AB15=1,AV83>AD82),CALC.D!$C$6<>\"\",CALC.D!$G$6<>\"\",CALC.D!$R$2<>\"\",CALC.D!$AB$20=1,CALC.D!$F$10<>\"\",CALC.D!$E$64<>\"\",CALC.D!$F$10=1,$BC$93=3,CALC.D!$G$59=$BT$92),\"- USAR CAIXA TIPO III, V, VI OU E\",0)","v":0},{"$f":"IF(AND(OR(CALC.D!AB15=1,AV83>AD82),CALC.D!$C$6<>\"\",CALC.D!$G$6<>\"\",CALC.D!$R$2<>\"\",CALC.D!$AB$20=1,CALC.D!$F$10<>\"\",CALC.D!$E$64<>\"\",CALC.D!$F$10=1,$BC$93=3,CALC.D!$G$59=$BU$92),\"- USAR CAIXA TIPO L + T\",0)","v":0}]
[null,null,null,null,null,null,null,null,null,null,null,null,null,null,null,null,null,null,null,null,null,null,null,null,null,null,null,null,null,null,null,null,null,null,null,null,null,null,null,null,null,null,null,null,null,null,null,null,null,null,null,null,null,null,2,null,8,{"$f":"IF(AND(CALC.D!AB15=0,CALC.D!$C$6<>\"\",CALC.D!$G$6<>\"\",CALC.D!$R$2<>\"\",CALC.D!$AB$20=1,CALC.D!$F$10<>\"\",CALC.D!$E$64<>\"\",CALC.D!$F$10=2,BC93=3,CALC.D!$G$59=$BF$92),\"- USAR CAIXA TIPO II, IV, VI OU E\",0)","v":0},{"$f":"IF(AND(CALC.D!AB15=0,CALC.D!$C$6<>\"\",CALC.D!$G$6<>\"\",CALC.D!$R$2<>\"\",CALC.D!$AB$20=1,CALC.D!$F$10<>\"\",CALC.D!$E$64<>\"\",CALC.D!$F$10=2,BC93=3,CALC.D!$G$59=$BG$92),\"- USAR CAIXA TIPO II, IV, VI OU E\",0)","v":0},{"$f":"IF(AND(CALC.D!AB15=0,CALC.D!$C$6<>\"\",CALC.D!$G$6<>\"\",CALC.D!$R$2<>\"\",CALC.D!$AB$20=1,CALC.D!$F$10<>\"\",CALC.D!$E$64<>\"\",CALC.D!$F$10=2,$BC$93=3,CALC.D!$G$59=$BH$92),\"- USAR CAIXA TIPO II, IV, VI OU E\",0)","v":0},{"$f":"IF(AND(CALC.D!AB15=0,CALC.D!$C$6<>\"\",CALC.D!$G$6<>\"\",CALC.D!$R$2<>\"\",CALC.D!$AB$20=1,CALC.D!$F$10<>\"\",CALC.D!$E$64<>\"\",CALC.D!$F$10=2,$BC$93=3,CALC.D!$G$59=$BI$92),\"- USAR CAIXA TIPO II, IV, VI OU E\",0)","v":0},{"$f":"IF(AND(CALC.D!AB15=0,CALC.D!$C$6<>\"\",CALC.D!$G$6<>\"\",CALC.D!$R$2<>\"\",CALC.D!$AB$20=1,CALC.D!$F$10<>\"\",CALC.D!$E$64<>\"\",CALC.D!$F$10=2,$BC$93=3,CALC.D!$G$59=$BJ$92),\"- USAR CAIXA TIPO III, V, VI OU E\",0)","v":0},{"$f":"IF(AND(CALC.D!AB15=0,CALC.D!$C$6<>\"\",CALC.D!$G$6<>\"\",CALC.D!$R$2<>\"\",CALC.D!$AB$20=1,CALC.D!$F$10<>\"\",CALC.D!$E$64<>\"\",CALC.D!$F$10=2,$BC$93=3,CALC.D!$G$59=$BK$92),\"- USAR CAIXA TIPO III, V, VI OU E\",0)","v":0},{"$f":"IF(AND(CALC.D!AB15=0,CALC.D!$C$6<>\"\",CALC.D!$G$6<>\"\",CALC.D!$R$2<>\"\",CALC.D!$AB$20=1,CALC.D!$F$10<>\"\",CALC.D!$E$64<>\"\",CALC.D!$F$10=2,$BC$93=3,CALC.D!$G$59=$BL$92),\"- USAR CAIXA TIPO III, V, VI OU E\",0)","v":0},{"$f":"IF(AND(CALC.D!AB15=0,CALC.D!$C$6<>\"\",CALC.D!$G$6<>\"\",CALC.D!$R$2<>\"\",CALC.D!$AB$20=1,CALC.D!$F$10<>\"\",CALC.D!$E$64<>\"\",CALC.D!$F$10=2,$BC$93=3,CALC.D!$G$59=$BM$92),\"- USAR CAIXA TIPO L + T\",0)","v":0},{"$f":"IF(AND(CALC.D!AB15=0,CALC.D!$C$6<>\"\",CALC.D!$G$6<>\"\",CALC.D!$R$2<>\"\",CALC.D!$AB$20=1,CALC.D!$F$10<>\"\",CALC.D!$E$64<>\"\",CALC.D!$F$10=2,$BC$93=3,CALC.D!$G$59=$BN$92),\"CIVIL - USAR CAIXA TIPO L + T\",0)","v":0},{"$f":"IF(AND(CALC.D!AB15=0,CALC.D!$C$6<>\"\",CALC.D!$G$6<>\"\",CALC.D!$R$2<>\"\",CALC.D!$AB$20=1,CALC.D!$F$10<>\"\",CALC.D!$E$64<>\"\",CALC.D!$F$10=2,$BC$93=3,CALC.D!$G$59=$BO$92),\"CIVIL - USAR CAIXA TIPO L + T\",0)","v":0},8,{"$f":"IF(AND(OR(CALC.D!AB15=1,AV83>AD82),CALC.D!$C$6<>\"\",CALC.D!$G$6<>\"\",CALC.D!$R$2<>\"\",CALC.D!$AB$20=1,CALC.D!$F$10<>\"\",CALC.D!$E$64<>\"\",CALC.D!$F$10=2,$BC$93=3,CALC.D!$G$59=$BQ$92),\"- USAR CAIXA TIPO III, V, VI OU E\",0)","v":0},{"$f":"IF(AND(OR(CALC.D!AB15=1,AV83>AD82),CALC.D!$C$6<>\"\",CALC.D!$G$6<>\"\",CALC.D!$R$2<>\"\",CALC.D!$AB$20=1,CALC.D!$F$10<>\"\",CALC.D!$E$64<>\"\",CALC.D!$F$10=2,$BC$93=3,CALC.D!$G$59=$BR$92),\"- USAR CAIXA TIPO III, V, VI OU E\",0)","v":0},{"$f":"IF(AND(OR(CALC.D!AB15=1,AV83>AD82),CALC.D!$C$6<>\"\",CALC.D!$G$6<>\"\",CALC.D!$R$2<>\"\",CALC.D!$AB$20=1,CALC.D!$F$10<>\"\",CALC.D!$E$64<>\"\",CALC.D!$F$10=2,$BC$93=3,CALC.D!$G$59=$BS$92),\"- USAR CAIXA TIPO III, V, VI OU E\",0)","v":0},{"$f":"IF(AND(OR(CALC.D!AB15=1,AV83>AD82),CALC.D!$C$6<>\"\",CALC.D!$G$6<>\"\",CALC.D!$R$2<>\"\",CALC.D!$AB$20=1,CALC.D!$F$10<>\"\",CALC.D!$E$64<>\"\",CALC.D!$F$10=2,$BC$93=3,CALC.D!$G$59=$BT$92),\"- USAR CAIXA TIPO III, V, VI OU E\",0)","v":0},{"$f":"IF(AND(OR(CALC.D!AB15=1,AV83>AD82),CALC.D!$C$6<>\"\",CALC.D!$G$6<>\"\",CALC.D!$R$2<>\"\",CALC.D!$AB$20=1,CALC.D!$F$10<>\"\",CALC.D!$E$64<>\"\",CALC.D!$F$10=2,$BC$93=3,CALC.D!$G$59=$BU$92),\"- USAR CAIXA TIPO L + T\",0)","v":0}]
[null,null,null,null,null,null,null,null,null,null,null,null,null,null,null,null,null,null,null,null,null,null,null,null,null,null,null,null,null,null,null,null,null,null,null,null,null,null,null,null,null,null,null,null,null,null,null,null,null,null,null,null,null,null,"3 ou mais",null,9,{"$f":"IF(AND(CALC.D!AB15=0,CALC.D!$C$6<>\"\",CALC.D!$G$6<>\"\",CALC.D!$R$2<>\"\",CALC.D!$AB$20=1,CALC.D!$F$10<>\"\",CALC.D!$E$64<>\"\",CALC.D!$F$10=\"3 ou mais\",BC93=3,CALC.D!$G$59=$BF$92),\"ou Ligação Coletiva\",0)","v":0},{"$f":"IF(AND(CALC.D!AB15=0,CALC.D!$C$6<>\"\",CALC.D!$G$6<>\"\",CALC.D!$R$2<>\"\",CALC.D!$AB$20=1,CALC.D!$F$10<>\"\",CALC.D!$E$64<>\"\",CALC.D!$F$10=\"3 ou mais\",BC93=3,CALC.D!$G$59=$BG$92),\"ou Ligação Coletiva\",0)","v":0},{"$f":"IF(AND(CALC.D!AB15=0,CALC.D!$C$6<>\"\",CALC.D!$G$6<>\"\",CALC.D!$R$2<>\"\",CALC.D!$AB$20=1,CALC.D!$F$10<>\"\",CALC.D!$E$64<>\"\",CALC.D!$F$10=\"3 ou mais\",$BC$93=3,CALC.D!$G$59=$BH$92),\"ou Ligação Coletiva\",0)","v":0},{"$f":"IF(AND(CALC.D!AB15=0,CALC.D!$C$6<>\"\",CALC.D!$G$6<>\"\",CALC.D!$R$2<>\"\",CALC.D!$AB$20=1,CALC.D!$F$10<>\"\",CALC.D!$E$64<>\"\",CALC.D!$F$10=\"3 ou mais\",$BC$93=3,CALC.D!$G$59=$BI$92),\"ou Ligação Coletiva\",0)","v":0},{"$f":"IF(AND(CALC.D!AB15=0,CALC.D!$C$6<>\"\",CALC.D!$G$6<>\"\",CALC.D!$R$2<>\"\",CALC.D!$AB$20=1,CALC.D!$F$10<>\"\",CALC.D!$E$64<>\"\",CALC.D!$F$10=\"3 ou mais\",$BC$93=3,CALC.D!$G$59=$BJ$92),\"ou Ligação Coletiva\",0)","v":0},{"$f":"IF(AND(CALC.D!AB15=0,CALC.D!$C$6<>\"\",CALC.D!$G$6<>\"\",CALC.D!$R$2<>\"\",CALC.D!$AB$20=1,CALC.D!$F$10<>\"\",CALC.D!$E$64<>\"\",CALC.D!$F$10=\"3 ou mais\",$BC$93=3,CALC.D!$G$59=$BK$92),\"ou Ligação Coletiva\",0)","v":0},{"$f":"IF(AND(CALC.D!AB15=0,CALC.D!$C$6<>\"\",CALC.D!$G$6<>\"\",CALC.D!$R$2<>\"\",CALC.D!$AB$20=1,CALC.D!$F$10<>\"\",CALC.D!$E$64<>\"\",CALC.D!$F$10=\"3 ou mais\",$BC$93=3,CALC.D!$G$59=$BL$92),\"ou Ligação Coletiva\",0)","v":0},{"$f":"IF(AND(CALC.D!AB15=0,CALC.D!$C$6<>\"\",CALC.D!$G$6<>\"\",CALC.D!$R$2<>\"\",CALC.D!$AB$20=1,CALC.D!$F$10<>\"\",CALC.D!$E$64<>\"\",CALC.D!$F$10=\"3 ou mais\",$BC$93=3,CALC.D!$G$59=$BM$92),\"ou Ligação Coletiva\",0)","v":0},{"$f":"IF(AND(CALC.D!AB15=0,CALC.D!$C$6<>\"\",CALC.D!$G$6<>\"\",CALC.D!$R$2<>\"\",CALC.D!$AB$20=1,CALC.D!$F$10<>\"\",CALC.D!$E$64<>\"\",CALC.D!$F$10=\"3 ou mais\",$BC$93=3,CALC.D!$G$59=$BN$92),\"ou Ligação Coletiva\",0)","v":0},{"$f":"IF(AND(CALC.D!AB15=0,CALC.D!$C$6<>\"\",CALC.D!$G$6<>\"\",CALC.D!$R$2<>\"\",CALC.D!$AB$20=1,CALC.D!$F$10<>\"\",CALC.D!$E$64<>\"\",CALC.D!$F$10=\"3 ou mais\",$BC$93=3,CALC.D!$G$59=$BO$92),\"ou Ligação Coletiva\",0)","v":0},9,{"$f":"IF(AND(OR(CALC.D!AB15=1,AV83>AD82),CALC.D!$C$6<>\"\",CALC.D!$G$6<>\"\",CALC.D!$R$2<>\"\",CALC.D!$AB$20=1,CALC.D!$F$10<>\"\",CALC.D!$E$64<>\"\",CALC.D!$F$10=\"3 ou mais\",$BC$93=3,CALC.D!$G$59=$BQ$92),\"ou Ligação Coletiva\",0)","v":0},{"$f":"IF(AND(OR(CALC.D!AB15=1,AV83>AD82),CALC.D!$C$6<>\"\",CALC.D!$G$6<>\"\",CALC.D!$R$2<>\"\",CALC.D!$AB$20=1,CALC.D!$F$10<>\"\",CALC.D!$E$64<>\"\",CALC.D!$F$10=\"3 ou mais\",$BC$93=3,CALC.D!$G$59=$BR$92),\"ou Ligação Coletiva\",0)","v":0},{"$f":"IF(AND(OR(CALC.D!AB15=1,AV83>AD82),CALC.D!$C$6<>\"\",CALC.D!$G$6<>\"\",CALC.D!$R$2<>\"\",CALC.D!$AB$20=1,CALC.D!$F$10<>\"\",CALC.D!$E$64<>\"\",CALC.D!$F$10=\"3 ou mais\",$BC$93=3,CALC.D!$G$59=$BS$92),\"ou Ligação Coletiva\",0)","v":0},{"$f":"IF(AND(OR(CALC.D!AB15=1,AV83>AD82),CALC.D!$C$6<>\"\",CALC.D!$G$6<>\"\",CALC.D!$R$2<>\"\",CALC.D!$AB$20=1,CALC.D!$F$10<>\"\",CALC.D!$E$64<>\"\",CALC.D!$F$10=\"3 ou mais\",$BC$93=3,CALC.D!$G$59=$BT$92),\"ou Ligação Coletiva\",0)","v":0},{"$f":"IF(AND(OR(CALC.D!AB15=1,AV83>AD82),CALC.D!$C$6<>\"\",CALC.D!$G$6<>\"\",CALC.D!$R$2<>\"\",CALC.D!$AB$20=1,CALC.D!$F$10<>\"\",CALC.D!$E$64<>\"\",CALC.D!$F$10=\"3 ou mais\",$BC$93=3,CALC.D!$G$59=$BU$92),\"ou Ligação Coletiva\",0)","v":0}]
[null,null,null,null,null,null,null,null,null,null,null,null,null,null,null,null,null,null,null,null,null,null,null,null,null,null,null,null,null,null,null,null,null,null,null,null,null,null,null,null,null,null,null,null,null,null,null,null,null,null,null,null,null,"FACHADA DA EDIFICAÇÃO",1,{"$f":"IF(CALC.D!$E$64=TABELAS!AB60,VLOOKUP(CALC.D!$F$10,$BC$103:$BE$105,3,FALSE),0)","v":0},10,{"$f":"IF(AND(CALC.D!AB15=0,CALC.D!$C$6<>\"\",CALC.D!$G$6<>\"\",CALC.D!$R$2<>\"\",CALC.D!$AB$20=1,CALC.D!$F$10<>\"\",CALC.D!$E$64<>\"\",CALC.D!$F$10=1,BC93=4,CALC.D!$G$59=$BF$92),\"- USAR CAIXA TIPO II, IV, VI OU E\",0)","v":0},{"$f":"IF(AND(CALC.D!AB15=0,CALC.D!$C$6<>\"\",CALC.D!$G$6<>\"\",CALC.D!$R$2<>\"\",CALC.D!$AB$20=1,CALC.D!$F$10<>\"\",CALC.D!$E$64<>\"\",CALC.D!$F$10=1,$BC$93=4,CALC.D!$G$59=$BG$92),\"- USAR CAIXA TIPO II, IV, VI OU E\",0)","v":0},{"$f":"IF(AND(CALC.D!AB15=0,CALC.D!$C$6<>\"\",CALC.D!$G$6<>\"\",CALC.D!$R$2<>\"\",CALC.D!$AB$20=1,CALC.D!$F$10<>\"\",CALC.D!$E$64<>\"\",CALC.D!$F$10=1,$BC$93=4,CALC.D!$G$59=$BH$92),\"- USAR CAIXA TIPO II, IV, VI OU E\",0)","v":0},{"$f":"IF(AND(CALC.D!AB15=0,CALC.D!$C$6<>\"\",CALC.D!$G$6<>\"\",CALC.D!$R$2<>\"\",CALC.D!$AB$20=1,CALC.D!$F$10<>\"\",CALC.D!$E$64<>\"\",CALC.D!$F$10=1,$BC$93=4,CALC.D!$G$59=$BI$92),\"- USAR CAIXA TIPO II, IV, VI OU E\",0)","v":0},{"$f":"IF(AND(CALC.D!AB15=0,CALC.D!$C$6<>\"\",CALC.D!$G$6<>\"\",CALC.D!$R$2<>\"\",CALC.D!$AB$20=1,CALC.D!$F$10<>\"\",CALC.D!$E$64<>\"\",CALC.D!$F$10=1,$BC$93=4,CALC.D!$G$59=$BJ$92),\"- USAR CAIXA TIPO III, V, VI OU E\",0)","v":0},{"$f":"IF(AND(CALC.D!AB15=0,CALC.D!$C$6<>\"\",CALC.D!$G$6<>\"\",CALC.D!$R$2<>\"\",CALC.D!$AB$20=1,CALC.D!$F$10<>\"\",CALC.D!$E$64<>\"\",CALC.D!$F$10=1,$BC$93=4,CALC.D!$G$59=$BK$92),\"- USAR CAIXA TIPO III, V, VI OU E\",0)","v":0},{"$f":"IF(AND(CALC.D!AB15=0,CALC.D!$C$6<>\"\",CALC.D!$G$6<>\"\",CALC.D!$R$2<>\"\",CALC.D!$AB$20=1,CALC.D!$F$10<>\"\",CALC.D!$E$64<>\"\",CALC.D!$F$10=1,$BC$93=4,CALC.D!$G$59=$BL$92),\"- USAR CAIXA TIPO III, V, VI OU E\",0)","v":0},{"$f":"IF(AND(CALC.D!AB15=0,CALC.D!$C$6<>\"\",CALC.D!$G$6<>\"\",CALC.D!$R$2<>\"\",CALC.D!$AB$20=1,CALC.D!$F$10<>\"\",CALC.D!$E$64<>\"\",CALC.D!$F$10=1,$BC$93=4,CALC.D!$G$59=$BM$92),\"- USAR CAIXA TIPO L + T\",0)","v":0},{"$f":"IF(AND(CALC.D!AB15=0,CALC.D!$C$6<>\"\",CALC.D!$G$6<>\"\",CALC.D!$R$2<>\"\",CALC.D!$AB$20=1,CALC.D!$F$10<>\"\",CALC.D!$E$64<>\"\",CALC.D!$F$10=1,$BC$93=4,CALC.D!$G$59=$BN$92),\"- USAR CAIXA TIPO L + T\",0)","v":0},{"$f":"IF(AND(CALC.D!AB15=0,CALC.D!$C$6<>\"\",CALC.D!$G$6<>\"\",CALC.D!$R$2<>\"\",CALC.D!$AB$20=1,CALC.D!$F$10<>\"\",CALC.D!$E$64<>\"\",CALC.D!$F$10=1,$BC$93=4,CALC.D!$G$59=$BO$92),\"- USAR CAIXA TIPO L + T\",0)","v":0},10,{"$f":"IF(AND(OR(CALC.D!AB15=1,AV83>AD82),CALC.D!$C$6<>\"\",CALC.D!$G$6<>\"\",CALC.D!$R$2<>\"\",CALC.D!$AB$20=1,CALC.D!$F$10<>\"\",CALC.D!$E$64<>\"\",CALC.D!$F$10=1,$BC$93=4,CALC.D!$G$59=$BQ$92),\"PELA PARTE CIVIL\",0)","v":0},{"$f":"IF(AND(OR(CALC.D!AB15=1,AV83>AD82),CALC.D!$C$6<>\"\",CALC.D!$G$6<>\"\",CALC.D!$R$2<>\"\",CALC.D!$AB$20=1,CALC.D!$F$10<>\"\",CALC.D!$E$64<>\"\",CALC.D!$F$10=1,$BC$93=4,CALC.D!$G$59=$BR$92),\"- USAR CAIXA TIPO III, V, VI OU E\",0)","v":0},{"$f":"IF(AND(OR(CALC.D!AB15=1,AV83>AD82),CALC.D!$C$6<>\"\",CALC.D!$G$6<>\"\",CALC.D!$R$2<>\"\",CALC.D!$AB$20=1,CALC.D!$F$10<>\"\",CALC.D!$E$64<>\"\",CALC.D!$F$10=1,$BC$93=4,CALC.D!$G$59=$BS$92),\"- USAR CAIXA TIPO III, V, VI OU E\",0)","v":0},{"$f":"IF(AND(OR(CALC.D!AB15=1,AV83>AD82),CALC.D!$C$6<>\"\",CALC.D!$G$6<>\"\",CALC.D!$R$2<>\"\",CALC.D!$AB$20=1,CALC.D!$F$10<>\"\",CALC.D!$E$64<>\"\",CALC.D!$F$10=1,$BC$93=4,CALC.D!$G$59=$BT$92),\"- USAR CAIXA TIPO III, V, VI OU E\",0)","v":0},{"$f":"IF(AND(OR(CALC.D!AB15=1,AV83>AD82),CALC.D!$C$6<>\"\",CALC.D!$G$6<>\"\",CALC.D!$R$2<>\"\",CALC.D!$AB$20=1,CALC.D!$F$10<>\"\",CALC.D!$E$64<>\"\",CALC.D!$F$10=1,$BC$93=4,CALC.D!$G$59=$BU$92),\"- USAR CAIXA TIPO L + T\",0)","v":0}]
[null,null,null,null,null,null,null,null,null,null,null,null,null,null,null,null,null,null,null,null,null,null,null,null,null,null,null,null,null,null,null,null,null,null,null,null,null,null,null,null,null,null,null,null,null,null,null,null,null,null,null,null,null,null,2,null,11,{"$f":"IF(AND(CALC.D!AB15=0,CALC.D!$C$6<>\"\",CALC.D!$G$6<>\"\",CALC.D!$R$2<>\"\",CALC.D!$AB$20=1,CALC.D!$F$10<>\"\",CALC.D!$E$64<>\"\",CALC.D!$F$10=2,BC93=4,CALC.D!$G$59=$BF$92),\"- USAR CAIXA TIPO II, IV, VI OU E\",0)","v":0},{"$f":"IF(AND(CALC.D!AB15=0,CALC.D!$C$6<>\"\",CALC.D!$G$6<>\"\",CALC.D!$R$2<>\"\",CALC.D!$AB$20=1,CALC.D!$F$10<>\"\",CALC.D!$E$64<>\"\",CALC.D!$F$10=2,$BC$93=4,CALC.D!$G$59=$BG$92),\"- USAR CAIXA TIPO II, IV, VI OU E\",0)","v":0},{"$f":"IF(AND(CALC.D!AB15=0,CALC.D!$C$6<>\"\",CALC.D!$G$6<>\"\",CALC.D!$R$2<>\"\",CALC.D!$AB$20=1,CALC.D!$F$10<>\"\",CALC.D!$E$64<>\"\",CALC.D!$F$10=2,$BC$93=4,CALC.D!$G$59=$BH$92),\"- USAR CAIXA TIPO II, IV, VI OU E\",0)","v":0},{"$f":"IF(AND(CALC.D!AB15=0,CALC.D!$C$6<>\"\",CALC.D!$G$6<>\"\",CALC.D!$R$2<>\"\",CALC.D!$AB$20=1,CALC.D!$F$10<>\"\",CALC.D!$E$64<>\"\",CALC.D!$F$10=2,$BC$93=4,CALC.D!$G$59=$BI$92),\"- USAR CAIXA TIPO II, IV, VI OU E\",0)","v":0},{"$f":"IF(AND(CALC.D!AB15=0,CALC.D!$C$6<>\"\",CALC.D!$G$6<>\"\",CALC.D!$R$2<>\"\",CALC.D!$AB$20=1,CALC.D!$F$10<>\"\",CALC.D!$E$64<>\"\",CALC.D!$F$10=2,$BC$93=4,CALC.D!$G$59=$BJ$92),\"- USAR CAIXA TIPO III, V, VI OU E\",0)","v":0},{"$f":"IF(AND(CALC.D!AB15=0,CALC.D!$C$6<>\"\",CALC.D!$G$6<>\"\",CALC.D!$R$2<>\"\",CALC.D!$AB$20=1,CALC.D!$F$10<>\"\",CALC.D!$E$64<>\"\",CALC.D!$F$10=2,$BC$93=4,CALC.D!$G$59=$BK$92),\"- USAR CAIXA TIPO III, V, VI OU E\",0)","v":0},{"$f":"IF(AND(CALC.D!AB15=0,CALC.D!$C$6<>\"\",CALC.D!$G$6<>\"\",CALC.D!$R$2<>\"\",CALC.D!$AB$20=1,CALC.D!$F$10<>\"\",CALC.D!$E$64<>\"\",CALC.D!$F$10=2,$BC$93=4,CALC.D!$G$59=$BL$92),\"- USAR CAIXA TIPO III, V, VI OU E\",0)","v":0},{"$f":"IF(AND(CALC.D!AB15=0,CALC.D!$C$6<>\"\",CALC.D!$G$6<>\"\",CALC.D!$R$2<>\"\",CALC.D!$AB$20=1,CALC.D!$F$10<>\"\",CALC.D!$E$64<>\"\",CALC.D!$F$10=2,$BC$93=4,CALC.D!$G$59=$BM$92),\"- USAR CAIXA TIPO L + T\",0)","v":0},{"$f":"IF(AND(CALC.D!AB15=0,CALC.D!$C$6<>\"\",CALC.D!$G$6<>\"\",CALC.D!$R$2<>\"\",CALC.D!$AB$20=1,CALC.D!$F$10<>\"\",CALC.D!$E$64<>\"\",CALC.D!$F$10=2,$BC$93=4,CALC.D!$G$59=$BN$92),\"- USAR CAIXA TIPO L + T\",0)","v":0},{"$f":"IF(AND(CALC.D!AB15=0,CALC.D!$C$6<>\"\",CALC.D!$G$6<>\"\",CALC.D!$R$2<>\"\",CALC.D!$AB$20=1,CALC.D!$F$10<>\"\",CALC.D!$E$64<>\"\",CALC.D!$F$10=2,$BC$93=4,CALC.D!$G$59=$BO$92),\"- USAR CAIXA TIPO L + T\",0)","v":0},11,{"$f":"IF(AND(OR(CALC.D!AB15=1,AV83>AD82),CALC.D!$C$6<>\"\",CALC.D!$G$6<>\"\",CALC.D!$R$2<>\"\",CALC.D!$AB$20=1,CALC.D!$F$10<>\"\",CALC.D!$E$64<>\"\",CALC.D!$F$10=2,$BC$93=4,CALC.D!$G$59=$BQ$92),\"PELA PARTE CIVIL\",0)","v":0},{"$f":"IF(AND(OR(CALC.D!AB15=1,AV83>AD82),CALC.D!$C$6<>\"\",CALC.D!$G$6<>\"\",CALC.D!$R$2<>\"\",CALC.D!$AB$20=1,CALC.D!$F$10<>\"\",CALC.D!$E$64<>\"\",CALC.D!$F$10=2,$BC$93=4,CALC.D!$G$59=$BR$92),\"- USAR CAIXA TIPO III, V, VI OU E\",0)","v":0},{"$f":"IF(AND(OR(CALC.D!AB15=1,AV83>AD82),CALC.D!$C$6<>\"\",CALC.D!$G$6<>\"\",CALC.D!$R$2<>\"\",CALC.D!$AB$20=1,CALC.D!$F$10<>\"\",CALC.D!$E$64<>\"\",CALC.D!$F$10=2,$BC$93=4,CALC.D!$G$59=$BS$92),\"- USAR CAIXA TIPO III, V, VI OU E\",0)","v":0},{"$f":"IF(AND(OR(CALC.D!AB15=1,AV83>AD82),CALC.D!$C$6<>\"\",CALC.D!$G$6<>\"\",CALC.D!$R$2<>\"\",CALC.D!$AB$20=1,CALC.D!$F$10<>\"\",CALC.D!$E$64<>\"\",CALC.D!$F$10=2,$BC$93=4,CALC.D!$G$59=$BT$92),\"- USAR CAIXA TIPO III, V, VI OU E\",0)","v":0},{"$f":"IF(AND(OR(CALC.D!AB15=1,AV83>AD82),CALC.D!$C$6<>\"\",CALC.D!$G$6<>\"\",CALC.D!$R$2<>\"\",CALC.D!$AB$20=1,CALC.D!$F$10<>\"\",CALC.D!$E$64<>\"\",CALC.D!$F$10=2,$BC$93=4,CALC.D!$G$59=$BU$92),\"- USAR CAIXA TIPO L + T\",0)","v":0}]
[null,null,null,null,null,null,null,null,null,null,null,null,null,null,null,null,null,null,null,null,null,null,null,null,null,null,null,null,null,null,null,null,null,null,null,null,null,null,null,null,null,null,null,null,null,null,null,null,null,null,null,null,null,null,"3 ou mais",null,12,{"$f":"IF(AND(CALC.D!AB15=0,CALC.D!$C$6<>\"\",CALC.D!$G$6<>\"\",CALC.D!$R$2<>\"\",CALC.D!$AB$20=1,CALC.D!$F$10<>\"\",CALC.D!$E$64<>\"\",CALC.D!$F$10=2,BC93=4,CALC.D!$G$59=$BF$92),\"ou Ligação Coletiva\",0)","v":0},{"$f":"IF(AND(CALC.D!AB15=0,CALC.D!$C$6<>\"\",CALC.D!$G$6<>\"\",CALC.D!$R$2<>\"\",CALC.D!$AB$20=1,CALC.D!$F$10<>\"\",CALC.D!$E$64<>\"\",CALC.D!$F$10=\"3 ou mais\",$BC$93=4,CALC.D!$G$59=$BG$92),\"ou Ligação Coletiva\",0)","v":0},{"$f":"IF(AND(CALC.D!AB15=0,CALC.D!$C$6<>\"\",CALC.D!$G$6<>\"\",CALC.D!$R$2<>\"\",CALC.D!$AB$20=1,CALC.D!$F$10<>\"\",CALC.D!$E$64<>\"\",CALC.D!$F$10=\"3 ou mais\",$BC$93=4,CALC.D!$G$59=$BH$92),\"ou Ligação Coletiva\",0)","v":0},{"$f":"IF(AND(CALC.D!AB15=0,CALC.D!$C$6<>\"\",CALC.D!$G$6<>\"\",CALC.D!$R$2<>\"\",CALC.D!$AB$20=1,CALC.D!$F$10<>\"\",CALC.D!$E$64<>\"\",CALC.D!$F$10=\"3 ou mais\",$BC$93=4,CALC.D!$G$59=$BI$92),\"ou Ligação Coletiva\",0)","v":0},{"$f":"IF(AND(CALC.D!AB15=0,CALC.D!$C$6<>\"\",CALC.D!$G$6<>\"\",CALC.D!$R$2<>\"\",CALC.D!$AB$20=1,CALC.D!$F$10<>\"\",CALC.D!$E$64<>\"\",CALC.D!$F$10=\"3 ou mais\",$BC$93=4,CALC.D!$G$59=$BJ$92),\"ou Ligação Coletiva\",0)","v":0},{"$f":"IF(AND(CALC.D!AB15=0,CALC.D!$C$6<>\"\",CALC.D!$G$6<>\"\",CALC.D!$R$2<>\"\",CALC.D!$AB$20=1,CALC.D!$F$10<>\"\",CALC.D!$E$64<>\"\",CALC.D!$F$10=\"3 ou mais\",$BC$93=4,CALC.D!$G$59=$BK$92),\"ou Ligação Coletiva\",0)","v":0},{"$f":"IF(AND(CALC.D!AB15=0,CALC.D!$C$6<>\"\",CALC.D!$G$6<>\"\",CALC.D!$R$2<>\"\",CALC.D!$AB$20=1,CALC.D!$F$10<>\"\",CALC.D!$E$64<>\"\",CALC.D!$F$10=\"3 ou mais\",$BC$93=4,CALC.D!$G$59=$BL$92),\"ou Ligação Coletiva\",0)","v":0},{"$f":"IF(AND(CALC.D!AB15=0,CALC.D!$C$6<>\"\",CALC.D!$G$6<>\"\",CALC.D!$R$2<>\"\",CALC.D!$AB$20=1,CALC.D!$F$10<>\"\",CALC.D!$E$64<>\"\",CALC.D!$F$10=\"3 ou mais\",$BC$93=4,CALC.D!$G$59=$BM$92),\"ou Ligação Coletiva\",0)","v":0},{"$f":"IF(AND(CALC.D!AB15=0,CALC.D!$C$6<>\"\",CALC.D!$G$6<>\"\",CALC.D!$R$2<>\"\",CALC.D!$AB$20=1,CALC.D!$F$10<>\"\",CALC.D!$E$64<>\"\",CALC.D!$F$10=\"3 ou mais\",$BC$93=4,CALC.D!$G$59=$BN$92),\"ou Ligação Coletiva\",0)","v":0},{"$f":"IF(AND(CALC.D!AB15=0,CALC.D!$C$6<>\"\",CALC.D!$G$6<>\"\",CALC.D!$R$2<>\"\",CALC.D!$AB$20=1,CALC.D!$F$10<>\"\",CALC.D!$E$64<>\"\",CALC.D!$F$10=\"3 ou mais\",$BC$93=4,CALC.D!$G$59=$BO$92),\"ou Ligação Coletiva\",0)","v":0},12,{"$f":"IF(AND(OR(CALC.D!AB15=1,AV83>AD82),CALC.D!$C$6<>\"\",CALC.D!$G$6<>\"\",CALC.D!$R$2<>\"\",CALC.D!$AB$20=1,CALC.D!$F$10<>\"\",CALC.D!$E$64<>\"\",CALC.D!$F$10=\"3 ou mais\",$BC$93=4,CALC.D!$G$59=$BQ$92),\"ou Ligação Coletiva\",0)","v":0},{"$f":"IF(AND(OR(CALC.D!AB15=1,AV83>AD82),CALC.D!$C$6<>\"\",CALC.D!$G$6<>\"\",CALC.D!$R$2<>\"\",CALC.D!$AB$20=1,CALC.D!$F$10<>\"\",CALC.D!$E$64<>\"\",CALC.D!$F$10=\"3 ou mais\",$BC$93=4,CALC.D!$G$59=$BR$92),\"ou Ligação Coletiva\",0)","v":0},{"$f":"IF(AND(OR(CALC.D!AB15=1,AV83>AD82),CALC.D!$C$6<>\"\",CALC.D!$G$6<>\"\",CALC.D!$R$2<>\"\",CALC.D!$AB$20=1,CALC.D!$F$10<>\"\",CALC.D!$E$64<>\"\",CALC.D!$F$10=\"3 ou mais\",$BC$93=4,CALC.D!$G$59=$BS$92),\"ou Ligação Coletiva\",0)","v":0},{"$f":"IF(AND(OR(CALC.D!AB15=1,AV83>AD82),CALC.D!$C$6<>\"\",CALC.D!$G$6<>\"\",CALC.D!$R$2<>\"\",CALC.D!$AB$20=1,CALC.D!$F$10<>\"\",CALC.D!$E$64<>\"\",CALC.D!$F$10=\"3 ou mais\",$BC$93=4,CALC.D!$G$59=$BT$92),\"ou Ligação Coletiva\",0)","v":0},{"$f":"IF(AND(OR(CALC.D!AB15=1,AV83>AD82),CALC.D!$C$6<>\"\",CALC.D!$G$6<>\"\",CALC.D!$R$2<>\"\",CALC.D!$AB$20=1,CALC.D!$F$10<>\"\",CALC.D!$E$64<>\"\",CALC.D!$F$10=\"3 ou mais\",$BC$93=4,CALC.D!$G$59=$BU$92),\"ou Ligação Coletiva\",0)","v":0}]

{"sheet":"TABELAS","index":3,"n_rows":97,"n_cols":53,"rows_kept":97,"cut":false,"hidden":true,"merged":[[69,39,69,40],[70,39,70,40],[52,31,52,40],[53,33,53,40],[60,39,60,40],[61,39,61,40],[62,39,62,40],[63,39,63,40],[64,39,64,40],[65,39,65,40],[66,39,66,40],[67,39,67,40],[68,39,68,40],[63,37,63,38],[64,37,64,38],[65,37,65,38],[66,37,66,38],[67,37,67,38],[68,37,68,38],[69,37,69,38],[70,37,70,38],[55,37,55,38],[63,35,63,36],[64,35,64,36],[67,35,67,36],[68,35,68,36],[69,33,69,34],[70,33,70,34],[62,33,62,34],[63,33,63,34],[64,33,64,34],[65,33,65,34],[66,33,66,34],[67,33,67,34],[68,33,68,34],[69,35,69,36],[70,35,70,36],[62,35,62,36],[66,35,66,36],[12,31,12,34],[56,37,56,38],[57,37,57,38],[58,37,58,38],[59,37,59,38],[60,37,60,38],[61,37,61,38],[37,35,37,38],[65,35,65,36],[62,37,62,38],[54,37,54,38],[60,35,60,36],[61,35,61,36],[56,35,56,36],[55,35,55,36],[57,35,57,36],[58,35,58,36],[59,35,59,36],[61,33,61,34],[55,39,55,40],[56,39,56,40],[57,39,57,40],[58,39,58,40],[59,39,59,40],[84,11,84,12],[4,19,4,29],[8,16,9,16],[60,33,60,34],[6,31,6,34],[13,31,13,34],[14,31,14,34],[54,33,54,36],[53,31,55,32],[55,33,55,34],[35,31,35,40],[6,40,6,41],[38,35,38,36],[39,35,39,36],[19,31,19,38],[8,31,8,34],[9,31,9,34],[10,31,10,34],[11,31,11,34],[0,0,2,28],[56,33,56,34],[57,33,57,34],[58,33,58,34],[59,33,59,34],[54,27,54,28],[20,31,20,33],[16,0,16,2],[34,31,34,52],[37,39,37,46],[37,0,37,1],[38,49,38,51],[37,49,37,52],[15,31,15,34],[16,31,16,34],[17,31,17,34],[21,31,21,35],[22,31,22,35],[23,31,23,35],[10,37,17,38],[0,31,2,51],[4,40,4,51],[54,39,54,40],[37,47,37,48],[92,2,92,3],[92,5,92,6],[92,7,92,8],[92,9,92,10],[92,11,92,12],[80,5,80,6],[80,7,80,8],[80,9,80,10],[80,11,80,12],[81,2,81,3],[81,5,81,6],[81,7,81,8],[81,9,81,10],[81,11,81,12],[83,7,83,8],[84,5,84,6],[84,7,84,8],[82,2,82,3],[86,2,86,3],[90,5,90,6],[83,2,83,3],[85,2,85,3],[89,11,89,12],[91,2,91,3],[75,11,75,12],[82,11,82,12],[79,2,79,3],[75,2,75,4],[75,5,75,6],[79,5,79,6],[83,5,83,6],[85,5,85,6],[76,9,76,10],[77,9,77,10],[78,9,78,10],[85,7,85,8],[80,2,80,3],[84,9,84,10],[84,2,84,3],[75,7,75,8],[76,7,76,8],[75,9,75,10],[77,7,77,8],[78,7,78,8],[76,5,76,6],[77,5,77,6],[78,5,78,6],[80,23,80,24],[81,23,81,24],[78,23,78,24],[79,23,79,24],[75,20,75,22],[76,16,76,18],[80,20,80,22],[81,20,81,22],[78,20,78,22],[79,20,79,22],[75,16,75,18],[81,16,81,18],[76,20,76,22],[76,23,76,24],[77,16,77,18],[77,20,77,22],[77,23,77,24],[75,23,75,24],[82,23,82,24],[36,31,36,32],[36,36,36,52],[29,6,29,8],[19,0,19,2],[20,0,20,2],[21,0,21,2],[29,12,29,14],[30,12,30,14],[31,6,31,8],[26,6,26,8],[32,6,32,8],[28,10,32,10],[29,16,31,16],[35,0,35,19],[28,12,28,14],[30,6,30,8],[28,6,28,8],[37,2,37,5],[39,2,39,4],[40,2,40,4],[37,6,37,11],[37,12,37,13],[19,10,21,10],[6,47,6,49],[6,25,6,27],[6,19,6,20],[6,22,6,23],[6,12,6,14],[4,0,4,4],[5,0,5,2],[7,12,7,14],[6,6,6,8],[4,31,4,38],[5,31,5,33],[4,12,4,16],[4,6,4,10],[6,0,6,2],[7,0,7,2],[7,6,7,8],[5,12,5,14],[5,6,5,8],[6,43,6,44],[7,31,7,34],[8,12,8,14],[16,6,16,8],[17,6,17,8],[27,6,27,8],[26,12,26,14],[27,12,27,14],[21,6,21,8],[15,12,15,13],[16,12,16,13],[17,12,17,13],[12,6,12,8],[15,6,15,10],[23,6,23,10],[25,6,25,8],[24,6,24,8],[20,6,20,8],[19,6,19,8],[21,12,21,13],[22,12,22,13],[13,12,13,13],[14,12,14,13],[23,12,23,13],[12,12,12,17],[18,16,23,16],[8,0,8,2],[17,0,17,2],[13,0,13,2],[18,0,18,2],[9,6,9,8],[10,6,10,8],[8,6,8,8],[11,0,11,2],[11,6,11,8],[14,0,14,2],[18,6,18,8],[9,0,9,2],[10,0,10,2],[12,0,12,2],[9,12,9,14],[15,0,15,2],[31,12,31,14],[25,12,25,16],[36,0,36,6],[18,17,23,17],[18,12,18,13],[19,12,19,13],[20,12,20,13],[57,0,57,2],[58,0,58,2],[52,4,52,11],[54,8,54,9],[80,16,80,18],[54,4,54,5],[52,0,52,2],[79,7,79,8],[76,2,76,3],[77,2,77,3],[76,11,76,12],[77,11,77,12],[78,11,78,12],[79,11,79,12],[54,10,54,11],[53,8,53,11],[78,2,78,3],[78,16,78,18],[79,16,79,18],[79,9,79,10],[73,0,73,12],[72,0,72,12],[74,0,77,1],[74,2,74,12],[82,20,82,22],[86,11,86,12],[87,11,87,12],[88,11,88,12],[90,11,90,12],[82,7,82,8],[87,7,87,8],[88,7,88,8],[87,2,87,3],[89,7,89,8],[90,7,90,8],[88,2,88,3],[86,5,86,6],[87,5,87,6],[88,5,88,6],[86,7,86,8],[82,9,82,10],[83,9,83,10],[85,9,85,10],[82,5,82,6],[91,5,91,6],[91,7,91,8],[91,9,91,10],[91,11,91,12],[82,16,82,18],[83,11,83,12],[85,11,85,12],[89,2,89,3],[90,2,90,3],[86,9,86,10],[87,9,87,10],[88,9,88,10],[89,9,89,10],[90,9,90,10],[89,5,89,6],[93,11,93,12],[100,16,100,18],[93,5,93,6],[93,7,93,8],[93,9,93,10],[94,2,94,3],[94,5,94,6],[94,7,94,8],[94,9,94,10],[94,11,94,12],[95,2,95,3],[95,5,95,6],[95,7,95,8],[95,9,95,10],[95,11,95,12],[93,2,93,3],[122,16,122,18],[122,20,122,22],[122,23,122,24],[123,16,123,18],[123,20,123,22],[123,23,123,24],[101,16,101,18],[101,20,101,22],[101,23,101,24],[102,16,102,18],[102,20,102,22],[102,23,102,24],[121,16,121,18],[121,20,121,22],[121,23,121,24],[124,16,124,18],[124,20,124,22],[124,23,124,24],[125,16,125,18],[125,20,125,22],[125,23,125,24],[126,16,126,18],[126,20,126,22],[126,23,126,24],[130,16,130,18],[130,20,130,22],[130,23,130,24],[134,16,134,18],[134,20,134,22],[134,23,134,24],[133,4,133,5],[133,6,133,7],[127,16,127,18],[127,20,127,22],[127,23,127,24],[128,16,128,18],[128,20,128,22],[128,23,128,24],[129,16,129,18],[129,20,129,22],[129,23,129,24],[131,16,131,18],[131,20,131,22],[131,23,131,24],[134,4,134,5],[134,6,134,7],[132,16,132,18],[132,20,132,22],[132,23,132,24],[133,16,133,18],[133,20,133,22],[133,23,133,24],[132,4,132,5],[132,6,132,7],[136,16,136,18],[136,20,136,22],[136,23,136,24],[135,4,135,5],[135,6,135,7],[137,16,137,18],[137,20,137,22],[137,23,137,24],[136,4,136,5],[136,6,136,7],[135,16,135,18],[135,20,135,22],[135,23,135,24],[138,16,138,18],[138,20,138,22],[138,23,138,24],[137,4,137,5],[137,6,137,7],[139,16,139,18],[139,20,139,22],[139,23,139,24],[138,4,138,5],[138,6,138,7],[140,16,140,18],[140,20,140,22],[140,23,140,24],[139,4,139,5],[139,6,139,7],[143,16,143,18],[143,20,143,22],[143,23,143,24],[140,4,140,5],[140,6,140,7],[141,16,141,18],[141,20,141,22],[141,23,141,24],[142,16,142,18],[142,20,142,22],[142,23,142,24],[141,4,141,5],[141,6,141,7],[154,20,154,22],[153,16,153,18],[153,20,153,22],[144,23,144,24],[142,4,142,5],[142,6,142,7],[145,4,145,5],[145,6,145,7],[147,23,147,24],[148,16,148,18],[148,20,148,22],[148,23,148,24],[146,4,146,5],[146,6,146,7],[143,4,143,5],[143,6,143,7],[145,16,145,18],[145,20,145,22],[145,23,145,24],[146,16,146,18],[146,20,146,22],[146,23,146,24],[148,4,148,5],[148,6,148,7],[147,20,147,22],[144,4,144,5],[144,6,144,7],[150,6,150,7],[151,4,151,5],[151,6,151,7],[152,16,152,18],[152,20,152,22],[152,4,152,5],[152,6,152,7],[144,16,144,18],[144,20,144,22],[151,20,151,22],[147,4,147,5],[147,6,147,7],[147,16,147,18],[163,4,163,5],[163,6,163,7],[157,16,157,18],[157,20,157,22],[157,23,157,24],[162,4,162,5],[162,6,162,7],[156,16,156,18],[156,20,156,22],[156,23,156,24],[161,4,161,5],[161,6,161,7],[156,4,156,5],[156,6,156,7],[160,4,160,5],[160,6,160,7],[159,4,159,5],[159,6,159,7],[158,4,158,5],[158,6,158,7],[157,4,157,5],[157,6,157,7],[152,23,152,24],[149,4,149,5],[149,6,149,7],[151,23,151,24],[155,6,155,7],[149,16,149,18],[149,20,149,22],[149,23,149,24],[153,23,153,24],[155,4,155,5],[153,4,153,5],[150,4,150,5],[153,6,153,7],[155,16,155,18],[155,20,155,22],[155,23,155,24],[150,16,150,18],[150,20,150,22],[150,23,150,24],[151,16,151,18],[154,23,154,24],[154,4,154,5],[154,6,154,7],[154,16,154,18]]}
["CPFL                                           CPFL                                         CPFL                                         CPFL",null,null,null,null,null,null,null,null,null,null,null,null,null,null,null,null,null,null,null,null,null,null,null,null,null,null,null,null,null,null,"CERIM                                        CERIM                                            CERIM                                  CERIM                                  CERIM"]
[]
[]
[]
["GRUPO - 1",null,null,null,null,null,"GRUPO - 2",null,null,null,null,null,"GRUPO - 5",null,null,null,null,null,null,"GRUPO - 7 CPFL",null,null,null,null,null,null,null,null,null,null,null,"GRUPO - 6",null,null,null,null,null,null,null,null,"GRUPO - 7 - FECOERESP"]
["DESCRIÇÃO",null,null,"POTENCIA","VINC.",null,"DESCRIÇÃO",null,null,"POTENCIA","VINC.",null,"DESCRIÇÃO",null,null,"POTENCIA","VINC.",null,null,null,null,null,null,null,null,null,null,null,null,null,null,"DESCRIÇÃO",null,null,null,"POTENCIA ATIVA","POTENCIA DEMANDA","VINC","VINC."]
["SELECIONE",null,null,0,{"$f":"IF(CALC.D!B21<>\"\",VLOOKUP(CALC.D!B21,TABELAS!$A$7:$D$22,4,FALSE),\"\")","v":""},null,"SELECIONE",null,null,0,{"$f":"IF(CALC.D!B34<>\"\",VLOOKUP(CALC.D!B34,TABELAS!$G$7:$J$13,4,FALSE),\"\")","v":""},null,null,null,null,0,{"$f":"IF(CALC.D!L21<>\"\",VLOOKUP(CALC.D!L21,TABELAS!$M$7:$P$10,4,FALSE),\"\")","v":""},null,null,"MOTORES MONO",null,null,"MOTORES TRIF",null,null,"MONOF. TRIF.",null,null,"VINC.","VINC.",null,"SELECIONE",null,null,null,0,0,{"$f":"IF(AND(CALC.D!L26<>\"\",CALCULO!$D$7=1),VLOOKUP(CALC.D!L26,TABELAS!$AF$7:$AK$18,5,FALSE),\"\")","v":""},{"$f":"IF(AND(CALC.D!L26<>\"\",CALCULO!$D$7=1),VLOOKUP(CALC.D!L26,TABELAS!$AF$7:$AK$18,6,FALSE),\"\")","v":""},null,"MOTORES MONO",null,null,"MOTORES TRIF",null,null,null,"MONOF. TRIF.",null,null,"VINC."]
["TOMADAS DE USO GERAL 100W",null,null,100,{"$f":"IF(CALC.D!B22<>\"\",VLOOKUP(CALC.D!B22,TABELAS!$A$7:$D$22,4,FALSE),\"\")","v":""},null,"CHAPINHA PARA CABELO",null,null,1500,{"$f":"IF(CALC.D!B35<>\"\",VLOOKUP(CALC.D!B35,TABELAS!$G$7:$J$13,4,FALSE),\"\")","v":""},null,"SELECIONE",null,null,0,{"$f":"IF(CALC.D!L22<>\"\",VLOOKUP(CALC.D!L22,TABELAS!$M$7:$P$10,4,FALSE),\"\")","v":""},null,null,null,null,null,null,null,null,null,null,null,null,null,null,"AR CONDICIONADO 7500BTU's (730W)",null,null,null,730,810,{"$f":"IF(AND(CALC.D!L26<>\"\",CALCULO!$D$7=1),VLOOKUP(CALC.D!L26,TABELAS!$AF$7:$AK$18,5,FALSE),\"\")","v":""},{"$f":"IF(AND(CALC.D!L27<>\"\",CALCULO!$D$7=1),VLOOKUP(CALC.D!L27,TABELAS!$AF$7:$AK$18,6,FALSE),\"\")","v":""}]
["TOMADAS DE USO ESPECÍFICO 600W",null,null,600,{"$f":"IF(CALC.D!B23<>\"\",VLOOKUP(CALC.D!B23,TABELAS!$A$7:$D$22,4,FALSE),\"\")","v":""},null,"CHUVEIRO ELÉTRICO",null,null,6500,{"$f":"IF(CALC.D!B36<>\"\",VLOOKUP(CALC.D!B36,TABELAS!$G$7:$J$13,4,FALSE),\"\")","v":""},null,"FOGÃO ELÉTRICO",null,null,2500,null,null,null,"SELECIONE",null,null,"SELECIONE",null,null,"MONOFÁSICO FN","BIFÁSICO FFN","TRIFÁSICO FFFN",{"$f":"IF(AND(CALC.D!N33<>\"\",OR(CALC.D!AB21=1,CALC.D!AB21=2)),VLOOKUP(CALC.D!N33,TABELAS!$T$8:$U$23,2,FALSE),IF(AND(CALC.D!N33<>\"\",CALC.D!AB21=3),VLOOKUP(CALC.D!N33,TABELAS!$W$8:$X$39,2,FALSE),\"\"))","v":""},{"$f":"IF(AND(CALC.D!N33<>\"\",OR(CALC.D!AB21=1,CALC.D!AB21=2)),VLOOKUP(CALC.D!N33,TABELAS!$T$8:$V$23,3,FALSE),IF(AND(CALC.D!N33<>\"\",CALC.D!AB21=3),VLOOKUP(CALC.D!N33,TABELAS!$W$8:$Y$39,3,FALSE),\"\"))","v":""},null,"AR CONDICIONADO 9000BTU's (880W)",null,null,null,880,975,{"$f":"IF(AND(CALC.D!L26<>\"\",CALCULO!$D$7=1),VLOOKUP(CALC.D!L26,TABELAS!$AF$7:$AK$18,5,FALSE),\"\")","v":""},{"$f":"IF(AND(CALC.D!L28<>\"\",CALCULO!$D$7=1),VLOOKUP(CALC.D!L28,TABELAS!$AF$7:$AK$18,6,FALSE),\"\")","v":""},null,"SELECIONE",0,0,"SELECIONE",0,0,null,"MONOFÁSICO FN","BIFÁSICO FFN","TRIFÁSICO FFFN",{"$f":"IF(AND(CALC.D!N33<>\"\",OR(CALC.D!AB21=1,CALC.D!AB21=2)),VLOOKUP(CALC.D!N33,TABELAS!$AO$9:$AP$23,2,FALSE),IF(AND(CALC.D!N33<>\"\",CALC.D!AB21=3),VLOOKUP(CALC.D!N33,TABELAS!$AR$9:$AS$34,2,FALSE),\"\"))","v":""},{"$f":"IF(AND(CALC.D!N33<>\"\",OR(CALC.D!AB21=1,CALC.D!AB21=2)),VLOOKUP(CALC.D!N33,TABELAS!$AO$9:$AQ$23,3,FALSE),IF(AND(CALC.D!N33<>\"\",CALC.D!AB21=3),VLOOKUP(CALC.D!N33,TABELAS!$AR$9:$AT$34,3,FALSE),\"\"))","v":""}]
["LÂMPADA LED",null,null,12,{"$f":"IF(CALC.D!B24<>\"\",VLOOKUP(CALC.D!B24,TABELAS!$A$7:$D$22,4,FALSE),\"\")","v":""},null,"FERRO DE PASSAR ",null,null,1000,{"$f":"IF(CALC.D!B37<>\"\",VLOOKUP(CALC.D!B37,TABELAS!$G$7:$J$13,4,FALSE),\"\")","v":""},null,"POTÊNCIA ESPECÍFICA",null,null,0,null,null,null,"1/4 CV",660,420,"1/4 CV",580,350,"MONOFÁSICO FN","BIFÁSICO FFN","TRIFÁSICO FFFN",{"$f":"IF(AND(CALC.D!N34<>\"\",OR(CALC.D!AB22=1,CALC.D!AB22=2)),VLOOKUP(CALC.D!N34,TABELAS!$T$8:$U$23,2,FALSE),IF(AND(CALC.D!N34<>\"\",CALC.D!AB22=3),VLOOKUP(CALC.D!N34,TABELAS!$W$8:$X$39,2,FALSE),\"\"))","v":""},{"$f":"IF(AND(CALC.D!N34<>\"\",OR(CALC.D!AB22=1,CALC.D!AB22=2)),VLOOKUP(CALC.D!N34,TABELAS!$T$8:$V$23,3,FALSE),IF(AND(CALC.D!N34<>\"\",CALC.D!AB22=3),VLOOKUP(CALC.D!N34,TABELAS!$W$8:$Y$39,3,FALSE),\"\"))","v":""},null,"AR CONDICIONADO 10000BTU's (975W)",null,null,null,975,1085,{"$f":"IF(AND(CALC.D!L26<>\"\",CALCULO!$D$7=1),VLOOKUP(CALC.D!L26,TABELAS!$AF$7:$AK$18,5,FALSE),\"\")","v":""},{"$f":"IF(AND(CALC.D!L29<>\"\",CALCULO!$D$7=1),VLOOKUP(CALC.D!L29,TABELAS!$AF$7:$AK$18,6,FALSE),\"\")","v":""},null,"1/4 CV",660,420,"1/3 CV",650,390,null,"MONOFÁSICO FN","BIFÁSICO FFN","TRIFÁSICO FFFN",{"$f":"IF(AND(CALC.D!N34<>\"\",OR(CALC.D!AB22=1,CALC.D!AB22=2)),VLOOKUP(CALC.D!N34,TABELAS!$AO$9:$AP$23,2,FALSE),IF(AND(CALC.D!N34<>\"\",CALC.D!AB22=3),VLOOKUP(CALC.D!N34,TABELAS!$AR$9:$AS$34,2,FALSE),\"\"))","v":""},{"$f":"IF(AND(CALC.D!N34<>\"\",OR(CALC.D!AB22=1,CALC.D!AB22=2)),VLOOKUP(CALC.D!N34,TABELAS!$AO$9:$AQ$23,3,FALSE),IF(AND(CALC.D!N34<>\"\",CALC.D!AB22=3),VLOOKUP(CALC.D!N34,TABELAS!$AR$9:$AT$34,3,FALSE),\"\"))","v":""}]
["LÂMPADA FLUORESCENTE",null,null,40,{"$f":"IF(CALC.D!B25<>\"\",VLOOKUP(CALC.D!B25,TABELAS!$A$7:$D$22,4,FALSE),\"\")","v":""},null,"SECADOR DE CABELOS",null,null,1000,{"$f":"IF(CALC.D!B38<>\"\",VLOOKUP(CALC.D!B38,TABELAS!$G$7:$J$13,4,FALSE),\"\")","v":""},null,null,null,null,null,null,null,null,"1/3 CV",770,510,"1/3 CV",650,390,"MONOFÁSICO FN","BIFÁSICO FFN","TRIFÁSICO FFFN",{"$f":"IF(AND(CALC.D!N35<>\"\",OR(CALC.D!AB23=1,CALC.D!AB23=2)),VLOOKUP(CALC.D!N35,TABELAS!$T$8:$U$23,2,FALSE),IF(AND(CALC.D!N35<>\"\",CALC.D!AB23=3),VLOOKUP(CALC.D!N35,TABELAS!$W$8:$X$39,2,FALSE),\"\"))","v":""},{"$f":"IF(AND(CALC.D!N35<>\"\",OR(CALC.D!AB23=1,CALC.D!AB23=2)),VLOOKUP(CALC.D!N35,TABELAS!$T$8:$V$23,3,FALSE),IF(AND(CALC.D!N35<>\"\",CALC.D!AB23=3),VLOOKUP(CALC.D!N35,TABELAS!$W$8:$Y$39,3,FALSE),\"\"))","v":""},null,"AR CONDICIONADO 12000BTU's (1180W)",null,null,null,1180,1300,null,null,null,"1/3 CV",770,510,"1/2 CV",870,580,null,"MONOFÁSICO FN","BIFÁSICO FFN","TRIFÁSICO FFFN",{"$f":"IF(AND(CALC.D!N35<>\"\",OR(CALC.D!AB23=1,CALC.D!AB23=2)),VLOOKUP(CALC.D!N35,TABELAS!$AO$9:$AP$23,2,FALSE),IF(AND(CALC.D!N35<>\"\",CALC.D!AB23=3),VLOOKUP(CALC.D!N35,TABELAS!$AR$9:$AS$34,2,FALSE),\"\"))","v":""},{"$f":"IF(AND(CALC.D!N35<>\"\",OR(CALC.D!AB23=1,CALC.D!AB23=2)),VLOOKUP(CALC.D!N35,TABELAS!$AO$9:$AQ$23,3,FALSE),IF(AND(CALC.D!N35<>\"\",CALC.D!AB23=3),VLOOKUP(CALC.D!N35,TABELAS!$AR$9:$AT$34,3,FALSE),\"\"))","v":""}]
["BATEDEIRA",null,null,200,{"$f":"IF(CALC.D!B26<>\"\",VLOOKUP(CALC.D!B26,TABELAS!$A$7:$D$22,4,FALSE),\"\")","v":""},null,"TORNEIRA ELÉTRICA",null,null,3000,null,null,null,null,null,null,null,null,null,"1/2 CV",1180,790,"1/2 CV",870,580,"MONOFÁSICO FN","BIFÁSICO FFN","TRIFÁSICO FFFN",{"$f":"IF(AND(CALC.D!N36<>\"\",OR(CALC.D!AB24=1,CALC.D!AB24=2)),VLOOKUP(CALC.D!N36,TABELAS!$T$8:$U$23,2,FALSE),IF(AND(CALC.D!N36<>\"\",CALC.D!AB24=3),VLOOKUP(CALC.D!N36,TABELAS!$W$8:$X$39,2,FALSE),\"\"))","v":""},{"$f":"IF(AND(CALC.D!N36<>\"\",OR(CALC.D!AB24=1,CALC.D!AB24=2)),VLOOKUP(CALC.D!N36,TABELAS!$T$8:$V$23,3,FALSE),IF(AND(CALC.D!N36<>\"\",CALC.D!AB24=3),VLOOKUP(CALC.D!N36,TABELAS!$W$8:$Y$39,3,FALSE),\"\"))","v":""},null,"AR CONDICIONADO 15000BTU's (1460W)",null,null,null,1460,1620,null,null,null,"1/2 CV",1180,790,"3/4 CV",1260,830,null,"MONOFÁSICO FN","BIFÁSICO FFN","TRIFÁSICO FFFN",{"$f":"IF(AND(CALC.D!N36<>\"\",OR(CALC.D!AB24=1,CALC.D!AB24=2)),VLOOKUP(CALC.D!N36,TABELAS!$AO$9:$AP$23,2,FALSE),IF(AND(CALC.D!N36<>\"\",CALC.D!AB24=3),VLOOKUP(CALC.D!N36,TABELAS!$AR$9:$AS$34,2,FALSE),\"\"))","v":""},{"$f":"IF(AND(CALC.D!N36<>\"\",OR(CALC.D!AB24=1,CALC.D!AB24=2)),VLOOKUP(CALC.D!N36,TABELAS!$AO$9:$AQ$23,3,FALSE),IF(AND(CALC.D!N36<>\"\",CALC.D!AB24=3),VLOOKUP(CALC.D!N36,TABELAS!$AR$9:$AT$34,3,FALSE),\"\"))","v":""}]
["CERCA ELÉTRICA",null,null,10,{"$f":"IF(CALC.D!B27<>\"\",VLOOKUP(CALC.D!B27,TABELAS!$A$7:$D$22,4,FALSE),\"\")","v":""},null,"POTÊNCIA ESPECÍFICA",null,null,0,null,null,"GRUPO - 6",null,null,null,null,null,null,"3/4 CV",1340,900,"3/4 CV",1260,830,"MONOFÁSICO FN","BIFÁSICO FFN","TRIFÁSICO FFFN",{"$f":"IF(AND(CALC.D!N37<>\"\",OR(CALC.D!AB25=1,CALC.D!AB25=2)),VLOOKUP(CALC.D!N37,TABELAS!$T$8:$U$23,2,FALSE),IF(AND(CALC.D!N37<>\"\",CALC.D!AB25=3),VLOOKUP(CALC.D!N37,TABELAS!$W$8:$X$39,2,FALSE),\"\"))","v":""},{"$f":"IF(AND(CALC.D!N37<>\"\",OR(CALC.D!AB25=1,CALC.D!AB25=2)),VLOOKUP(CALC.D!N37,TABELAS!$T$8:$V$23,3,FALSE),IF(AND(CALC.D!N37<>\"\",CALC.D!AB25=3),VLOOKUP(CALC.D!N37,TABELAS!$W$8:$Y$39,3,FALSE),\"\"))","v":""},null,"AR CONDICIONADO 18000BTU's (1760W)",null,null,null,1760,1950,null,null,null,"3/4 CV",1340,900,"1 CV",1520,1050,null,"MONOFÁSICO FN","BIFÁSICO FFN","TRIFÁSICO FFFN",{"$f":"IF(AND(CALC.D!N37<>\"\",OR(CALC.D!AB25=1,CALC.D!AB25=2)),VLOOKUP(CALC.D!N37,TABELAS!$AO$9:$AP$23,2,FALSE),IF(AND(CALC.D!N37<>\"\",CALC.D!AB25=3),VLOOKUP(CALC.D!N37,TABELAS!$AR$9:$AS$34,2,FALSE),\"\"))","v":""},{"$f":"IF(AND(CALC.D!N37<>\"\",OR(CALC.D!AB25=1,CALC.D!AB25=2)),VLOOKUP(CALC.D!N37,TABELAS!$AO$9:$AQ$23,3,FALSE),IF(AND(CALC.D!N37<>\"\",CALC.D!AB25=3),VLOOKUP(CALC.D!N37,TABELAS!$AR$9:$AT$34,3,FALSE),\"\"))","v":""}]
["COMPUTADOR",null,null,330,{"$f":"IF(CALC.D!B28<>\"\",VLOOKUP(CALC.D!B28,TABELAS!$A$7:$D$22,4,FALSE),\"\")","v":""},null,null,null,null,null,null,null,"DESCRIÇÃO",null,"POTENCIA ATIVA","POTENCIA DEMANDA","VINC.","VINC.",null,"1 CV",1560,1140,"1 CV",1520,1050,"MONOFÁSICO FN","BIFÁSICO FFN","TRIFÁSICO FFFN",{"$f":"IF(AND(CALC.D!N38<>\"\",OR(CALC.D!AB26=1,CALC.D!AB26=2)),VLOOKUP(CALC.D!N38,TABELAS!$T$8:$U$23,2,FALSE),IF(AND(CALC.D!N38<>\"\",CALC.D!AB26=3),VLOOKUP(CALC.D!N38,TABELAS!$W$8:$X$39,2,FALSE),\"\"))","v":""},{"$f":"IF(AND(CALC.D!N38<>\"\",OR(CALC.D!AB26=1,CALC.D!AB26=2)),VLOOKUP(CALC.D!N38,TABELAS!$T$8:$V$23,3,FALSE),IF(AND(CALC.D!N38<>\"\",CALC.D!AB26=3),VLOOKUP(CALC.D!N38,TABELAS!$W$8:$Y$39,3,FALSE),\"\"))","v":""},null,"AR CONDICIONADO 21000BTU's (2050W)",null,null,null,2050,2280,null,null,null,"1 CV",1560,1140,"1 1/2 CV",2170,1540,null,"MONOFÁSICO FN","BIFÁSICO FFN","TRIFÁSICO FFFN",{"$f":"IF(AND(CALC.D!N38<>\"\",OR(CALC.D!AB26=1,CALC.D!AB26=2)),VLOOKUP(CALC.D!N38,TABELAS!$AO$9:$AP$23,2,FALSE),IF(AND(CALC.D!N38<>\"\",CALC.D!AB26=3),VLOOKUP(CALC.D!N38,TABELAS!$AR$9:$AS$34,2,FALSE),\"\"))","v":""},{"$f":"IF(AND(CALC.D!N38<>\"\",OR(CALC.D!AB26=1,CALC.D!AB26=2)),VLOOKUP(CALC.D!N38,TABELAS!$AO$9:$AQ$23,3,FALSE),IF(AND(CALC.D!N38<>\"\",CALC.D!AB26=3),VLOOKUP(CALC.D!N38,TABELAS!$AR$9:$AT$34,3,FALSE),\"\"))","v":""}]
["FREEZER",null,null,350,{"$f":"IF(CALC.D!B29<>\"\",VLOOKUP(CALC.D!B29,TABELAS!$A$7:$D$22,4,FALSE),\"\")","v":""},null,null,null,null,null,null,null,"SELECIONE",null,0,0,{"$f":"IF(AND(CALC.D!L26<>\"\",CALCULO!$D$7=2),VLOOKUP(CALC.D!L26,TABELAS!$M$15:$P$24,3,FALSE),\"\")","v":""},{"$f":"IF(AND(CALC.D!L26<>\"\",CALCULO!$D$7=2),VLOOKUP(CALC.D!L26,TABELAS!$M$15:$P$24,4,FALSE),\"\")","v":""},null,"1 1/2 CV",2350,1670,"1 1/2 CV",2170,1540,"MONOFÁSICO FN","BIFÁSICO FFN","TRIFÁSICO FFFN",{"$f":"IF(AND(CALC.D!N39<>\"\",OR(CALC.D!AB27=1,CALC.D!AB27=2)),VLOOKUP(CALC.D!N39,TABELAS!$T$8:$U$23,2,FALSE),IF(AND(CALC.D!N39<>\"\",CALC.D!AB27=3),VLOOKUP(CALC.D!N39,TABELAS!$W$8:$X$39,2,FALSE),\"\"))","v":""},{"$f":"IF(AND(CALC.D!N39<>\"\",OR(CALC.D!AB27=1,CALC.D!AB27=2)),VLOOKUP(CALC.D!N39,TABELAS!$T$8:$V$23,3,FALSE),IF(AND(CALC.D!N39<>\"\",CALC.D!AB27=3),VLOOKUP(CALC.D!N39,TABELAS!$W$8:$Y$39,3,FALSE),\"\"))","v":""},null,"AR CONDICIONADO 30000BTU's (2930W)",null,null,null,2930,3250,null,null,null,"1 1/2 CV",2350,1670,"2 CV",2700,1950,null,"MONOFÁSICO FN","BIFÁSICO FFN","TRIFÁSICO FFFN",{"$f":"IF(AND(CALC.D!N39<>\"\",OR(CALC.D!AB27=1,CALC.D!AB27=2)),VLOOKUP(CALC.D!N39,TABELAS!$AO$9:$AP$23,2,FALSE),IF(AND(CALC.D!N39<>\"\",CALC.D!AB27=3),VLOOKUP(CALC.D!N39,TABELAS!$AR$9:$AS$34,2,FALSE),\"\"))","v":""},{"$f":"IF(AND(CALC.D!N39<>\"\",OR(CALC.D!AB27=1,CALC.D!AB27=2)),VLOOKUP(CALC.D!N39,TABELAS!$AO$9:$AQ$23,3,FALSE),IF(AND(CALC.D!N39<>\"\",CALC.D!AB27=3),VLOOKUP(CALC.D!N39,TABELAS!$AR$9:$AT$34,3,FALSE),\"\"))","v":""}]
["GELADEIRA",null,null,600,{"$f":"IF(CALC.D!B30<>\"\",VLOOKUP(CALC.D!B30,TABELAS!$A$7:$D$22,4,FALSE),\"\")","v":""},null,"GRUPO - 3",null,null,null,null,null,"AR CONDICIONADO 7100BTU's (900W)",null,900,900,{"$f":"IF(AND(CALC.D!L27<>\"\",CALCULO!$D$7=2),VLOOKUP(CALC.D!L27,TABELAS!$M$15:$P$24,3,FALSE),\"\")","v":""},{"$f":"IF(AND(CALC.D!L27<>\"\",CALCULO!$D$7=2),VLOOKUP(CALC.D!L27,TABELAS!$M$15:$P$24,4,FALSE),\"\")","v":""},null,"2 CV",2970,2170,"2 CV",2700,1950,null,null,null,null,null,null,"AR CONDICIONADO 41000BTU's (4000W)",null,null,null,4000,4450,null,null,null,"2 CV",2970,2170,"3 CV",4040,2950]
["LIQUIDIFICADOR",null,null,600,null,null,"DESCRIÇÃO",null,null,"POTENCIA","VINC.",null,"AR CONDICIONADO 8500BTU's (1300W)",null,1300,1300,{"$f":"IF(AND(CALC.D!L28<>\"\",CALCULO!$D$7=2),VLOOKUP(CALC.D!L28,TABELAS!$M$15:$P$24,3,FALSE),\"\")","v":""},{"$f":"IF(AND(CALC.D!L28<>\"\",CALCULO!$D$7=2),VLOOKUP(CALC.D!L28,TABELAS!$M$15:$P$24,4,FALSE),\"\")","v":""},null,"3 CV",4070,3220,"3 CV",4040,2950,null,null,null,null,null,null,"AR CONDICIONADO 60000BTU's (5850W)",null,null,null,5850,6500,null,null,null,"3 CV",4070,3220,"4 CV",5030,3720]
["FRITADEIRA ELÉTRICA",null,null,1500,null,null,"SELECIONE",null,null,0,{"$f":"IF(CALC.D!B42<>\"\",VLOOKUP(CALC.D!B42,TABELAS!$G$18:$J$22,4,FALSE),\"\")","v":""},null,"AR CONDICIONADO 10000BTU's (1400W)",null,1400,1400,{"$f":"IF(AND(CALC.D!L29<>\"\",CALCULO!$D$7=2),VLOOKUP(CALC.D!L29,TABELAS!$M$15:$P$24,3,FALSE),\"\")","v":""},{"$f":"IF(AND(CALC.D!L29<>\"\",CALCULO!$D$7=2),VLOOKUP(CALC.D!L29,TABELAS!$M$15:$P$24,4,FALSE),\"\")","v":""},null,"5 CV",6160,5110,"4 CV",5030,3720,null,null,null,null,null,null,"POTÊNCIA ESPECÍFICA",null,null,null,0,0,null,null,null,"5 CV",6160,5110,"5 CV",6060,4510]
["PANELA ELÉTRICA",null,null,700,null,null,"AQUECEDOR CENTRAL",null,null,9000,{"$f":"IF(CALC.D!B43<>\"\",VLOOKUP(CALC.D!B43,TABELAS!$G$18:$J$22,4,FALSE),\"\")","v":""},null,"AR CONDICIONADO 12000BTU's (1600W)",null,1600,1600,null,null,null,"7 1/2 CV",8840,7070,"5 CV",6020,4510,null,null,null,null,null,null,null,null,null,null,null,null,null,null,null,"7 1/2 CV",8840,7070,"7 1/2 CV",8650,6570]
["TORRADEIRA ELÉTRICA",null,null,750,null,null,"AQUECEDOR DE ACUMULAÇÃO",null,null,7700,null,null,"AR CONDICIONADO 14000BTU's (1900W)",null,1900,2100,null,null,null,"10 CV",11640,9310,"6 CV",7000,5330,null,null,null,null,null,null,"GRUPO - 9",null,null,null,null,null,null,null,null,"10 CV",11640,9310,"10 CV",11540,8890]
["MIX (MISTURADOR ELÉTRICO)",null,null,200,null,null,"SAUNA A VAPOR",null,null,16000,null,null,"AR CONDICIONADO 18000BTU's (2600W)",null,2600,2860,null,null,null,"12 1/2 CV",14940,11580,"7 1/2 CV",8650,6570,null,null,null,null,null,null,"DESCRIÇÃO",null,null,null,null,"POTENCIA",null,"VINC.",null,"12 1/2 CV",14940,11580,"12 1/2 CV",14090,10850]
["POTÊNCIA ESPECÍFICA",null,null,0,null,null,"POTÊNCIA ESPECÍFICA",null,null,0,null,null,"AR CONDICIONADO 21000BTU's (2800W)",null,2800,3080,null,null,null,"15 CV",16940,13720,"10 CV",11540,8890,null,null,null,null,null,null,"SELECIONE",null,null,null,null,0,null,{"$f":"IF(AND(CALC.D!L48<>\"\",CALCULO!$D$7=1),VLOOKUP(CALC.D!L48,TABELAS!$AF$22:$AK$24,6,FALSE),\"\")","v":""},null,"15 CV",16940,13720,"15 CV",16650,12820]
[null,null,null,null,null,null,null,null,null,null,null,null,"AR CONDICIONADO 30000BTU's (3600W)",null,3600,4000,null,null,null,"POTÊNCIA ESPECÍFICA",0,0,"12 1/2 CV",14090,10850,null,null,null,null,null,null,"HIDROMASSAGEM (6750W)",null,null,null,null,6750,null,{"$f":"IF(AND(CALC.D!L49<>\"\",CALCULO!$D$7=1),VLOOKUP(CALC.D!L49,TABELAS!$AF$22:$AK$24,6,FALSE),\"\")","v":""},null,"POTÊNCIA ESPECÍFICA",0,0,"20 CV",22100,17010]
[null,null,null,null,null,null,"GRUPO - 4",null,null,null,null,null,"POTÊNCIA ESPECÍFICA",null,0,0,null,null,null,null,null,null,"15 CV",16650,12820,null,null,null,null,null,null,"POTÊNCIA ESPECÍFICA",null,null,null,null,0,null,null,null,null,null,null,"25 CV",25830,20920]
[null,null,null,null,null,null,"DESCRIÇÃO",null,null,"POTENCIA","VINC.",null,null,null,null,null,null,null,null,null,null,null,"20 CV",22100,17010,null,null,null,null,null,null,null,null,null,null,null,null,null,null,null,null,null,null,"30 CV",30520,25030]
[null,null,null,null,null,null,"SELECIONE",null,null,0,{"$f":"IF(CALC.D!B47<>\"\",VLOOKUP(CALC.D!B47,TABELAS!$G$26:$J$33,4,FALSE),\"\")","v":""},null,"GRUPO - 8",null,null,null,null,null,null,null,null,null,"25 CV",25830,20920,null,null,null,null,null,null,null,null,null,null,null,null,null,null,null,null,null,null,"40 CV",39740,33380]
[null,null,null,null,null,null,"FORNO ELÉTRICO",null,null,1500,{"$f":"IF(CALC.D!B48<>\"\",VLOOKUP(CALC.D!B48,TABELAS!$G$26:$J$33,4,FALSE),\"\")","v":""},null,"DESCRIÇÃO",null,null,"POTENCIA","VINC.",null,null,null,null,null,"30 CV",30520,25030,null,null,null,null,null,null,null,null,null,null,null,null,null,null,null,null,null,null,"50 CV",48730,40930]
[null,null,null,null,null,null,"LAVADOURA DE ROUPAS",null,null,2000,{"$f":"IF(CALC.D!B49<>\"\",VLOOKUP(CALC.D!B49,TABELAS!$G$26:$J$33,4,FALSE),\"\")","v":""},null,"SELECIONE",null,null,0,{"$f":"IF(CALC.D!L43<>\"\",VLOOKUP(CALC.D!L43,TABELAS!$M$28:$P$32,4,FALSE),\"\")","v":""},null,null,null,null,null,"40 CV",39740,33380,null,null,null,null,null,null,null,null,null,null,null,null,null,null,null,null,null,null,"60 CV",58150,49420]
[null,null,null,null,null,null,"LAVADOURA DE LOUÇA",null,null,2000,null,null,"MÁQUINAS DE SOLDA (4000W)",null,null,4000,{"$f":"IF(CALC.D!L44<>\"\",VLOOKUP(CALC.D!L44,TABELAS!$M$28:$P$32,4,FALSE),\"\")","v":""},null,null,null,null,null,"50 CV",48730,40930,null,null,null,null,null,null,null,null,null,null,null,null,null,null,null,null,null,null,"75 CV",72280,61440]
[null,null,null,null,null,null,"SECADORA DE ROUPA",null,null,2500,null,null,"SOLDA A ARCO (6000W)",null,null,6000,null,null,null,null,null,null,"60 CV",58150,49420,null,null,null,null,null,null,null,null,null,null,null,null,null,null,null,null,null,null,"100 CV",95560,81230]
[null,null,null,null,null,null,"LAVA E SECA ROUPAS",null,null,1400,null,null,"SOLDA A GALVANIZAÇÃO (3300W)",null,null,3300,null,null,null,null,null,null,"75 CV",72280,61440,null,null,null,null,null,null,null,null,null,null,null,null,null,null,null,null,null,null,"125 CV",117050,100670]
[null,null,null,null,null,null,"FORNO MICROONDAS",null,null,1250,null,null,"POTÊNCIA ESPECÍFICA",null,null,0,null,null,null,null,null,null,"100 CV",97050,80550,null,null,null,null,null,null,null,null,null,null,null,null,null,null,null,null,null,null,"150 CV",141290,120090]
[null,null,null,null,null,null,"POTÊNCIA ESPECÍFICA",null,null,0,null,null,null,null,null,null,null,null,null,null,null,null,"125 CV",114560,96230,null,null,null,null,null,null,null,null,null,null,null,null,null,null,null,null,null,null,"200 CV",190180,161650]
[null,null,null,null,null,null,null,null,null,null,null,null,null,null,null,null,null,null,null,null,null,null,"150 CV",128020,106250,null,null,null,null,null,null,null,null,null,null,null,null,null,null,null,null,null,null,"POTÊNCIA ESPECÍFICA",0,0]
[null,null,null,null,null,null,null,null,null,null,null,null,null,null,null,null,null,null,null,null,null,null,"175 CV",170890,140130,null,null,null,null,null,null,"FECOERESP"]
["CPFL",null,null,null,null,null,null,null,null,null,null,null,null,null,null,null,null,null,null,null,null,null,"200 CV",196390,159080,null,null,null,null,null,null,"OUTRAS TABELAS PARA ANÁLISE DA PLANILHA"]
["OUTRAS TABELAS PARA ANÁLISE DA PLANILHA",null,null,null,null,null,null,null,null,null,null,null,null,null,null,null,null,null,null,null,null,null,"250 CV IRRIG.",242820,196690,null,null,null,null,null,null,"CLASSES:",null,"CATEGORIA",null,null,"TIPO DE INSTALAÇÃO"]
["CLASSES:",null,"RESIDENCIAL",null,null,null,"COMERCIAL",null,null,null,null,null,"INDUSTRIAL",null,null,null,null,null,null,null,null,null,"300 CV IRRIG.",286970,232440,null,null,null,null,null,null,null,null,null,null,"RESIDENCIAL",null,null,null,"COMERCIAL",null,null,null,null,null,null,null,"INDUSTRIAL",null,"RURAL"]
[null,null,null,null,null,null,null,null,null,null,null,null,null,null,null,null,null,null,null,null,null,null,"POTÊNCIA ESPECÍFICA",0,0,null,null,null,null,null,null,"RESIDENCIAL",1,"A1 MONOFÁSICO",null,"PROPRIEDADE RESIDENCIAL INDIVIDUAL",null,null,1,"AUDITÓRIO, SALÕES PARA EXPOSIÇÕES E SEMELHANTES",null,null,null,"1.1",10,null,3,"PROPRIEDADE INDUSTRIAL PARTICULAR",15,"PRODUTORES RURAIS",null,null,16]
["RESIDENCIAL",1,"PROPRIEDADE RESIDENCIAL INDIVIDUAL",null,null,1,"AUDITÓRIO, SALÕES PARA EXPOSIÇÕES E SEMELHANTES",null,null,"1.1",10,3,"PROPRIEDADE INDUSTRIAL PARTICULAR",14,null,null,null,null,null,null,null,null,null,null,null,null,null,null,null,null,null,"COMERCIAL",2,"A2 MONOFÁSICO",null,"PROPRIEDADE RESIDENCIAL COLETIVA",null,null,2,"BANCOS, LOJAS E SEMELHANTES",null,null,null,"1.2",30,null,4]
["COMERCIAL",2,"PROPRIEDADE RESIDENCIAL COLETIVA",null,null,2,"BANCOS, LOJAS E SEMELHANTES",null,null,"1.2",30,4,null,null,null,null,null,null,null,null,null,null,null,null,null,null,null,null,null,null,null,"INDUSTRIAL",3,"B1 BIFÁSICO",null,null,null,null,null,"BARBEARIAS, SALÕES DE BELEZA E SEMELHANTES",null,null,null,"1.3",30,null,5]
["INDUSTRIAL",3,null,null,null,null,"BARBEARIAS, SALÕES DE BELEZA E SEMELHANTES",null,null,"1.3",30,5,null,null,null,null,null,null,null,null,null,null,null,null,null,null,null,null,null,null,null,"RURAL",4,"B2 BIFÁSICO",null,null,null,null,null,"CLUBES E SEMELHANTES",null,null,null,"1.4",20,null,6]
[null,null,null,null,null,null,"CLUBES E SEMELHANTES",null,null,"1.4",20,6,null,null,null,null,null,null,null,null,null,null,null,null,null,null,null,null,null,null,null,null,null,"C1 TRIFÁSICO",null,null,null,null,null,"ESCOLAS E SEMELHANTES",null,null,null,"1.5",30,null,7]
[null,null,null,null,null,null,"ESCOLAS E SEMELHANTES",null,null,"1.5",30,7,null,null,null,null,null,null,null,null,null,null,null,null,null,null,null,null,null,null,null,null,null,"C2 TRIFÁSICO",null,null,null,null,null,"ESCRITÓRIO (EDIFÍCIOS)",null,null,null,"1.6",30,null,8]
[null,null,null,null,null,null,"ESCRITÓRIO (EDIFÍCIOS)",null,null,"1.6",30,8,null,null,null,null,null,null,null,null,null,null,null,null,null,null,null,null,null,null,null,null,null,"C3 TRIFÁSICO",null,null,null,null,null,"ADMINISTRAÇÃO DE EDIFÍCIOS DE USO COLETIVO",null,null,null,"1.7",5,null,9]
[null,null,null,null,null,null,"GARAGENS COMERCIAIS E SEMELHANTES",null,null,"1.7",5,9,null,null,null,null,null,null,null,null,null,null,null,null,null,null,null,null,null,null,null,null,null,"C4 TRIFÁSICO",null,null,null,null,null,"GARAGENS COMERCIAIS E SEMELHANTES",null,null,null,"1.8",5,null,10]
[null,null,null,null,null,null,"HOSPITAIS E SEMELHANTES",null,null,"1.8",20,10,null,null,null,null,null,null,null,null,null,null,null,null,null,null,null,null,null,null,null,null,null,"C5 TRIFÁSICO",null,null,null,null,null,"HOSPITAIS E SEMELHANTES",null,null,null,"1.9",20,null,11]
[null,null,null,null,null,null,"HOTEIS E SEMELHANTES",null,null,"1.9",20,11,null,null,null,null,null,null,null,null,null,null,null,null,null,null,null,null,null,null,null,null,null,"C6 TRIFÁSICO",null,null,null,null,null,"HOTEIS E SEMELHANTES",null,null,null,"1.10",20,null,12]
[null,null,null,null,null,null,"IGREJAS E SEMELHANTES",null,null,"1.10",10,12,null,null,null,null,null,null,null,null,null,null,null,null,null,null,null,null,null,null,null,null,null,null,null,null,null,null,null,"IGREJAS E SEMELHANTES",null,null,null,"1.11",10,null,13]
[null,null,null,null,null,null,"RESTAURANTES E SEMELHANTES",null,null,"1.11",20,13,null,null,null,null,null,null,null,null,null,null,null,null,null,null,null,null,null,null,null,null,null,null,null,null,null,null,null,"RESTAURANTES E SEMELHANTES",null,null,null,"1.12",20,null,14]
[]
[]
["TIPO DE NORMA ATENDENDO",null,null,null,"LISTA SUSPENSA",null,null,null,null,null,null,null,null,null,null,null,null,null,null,null,null,null,null,null,null,null,null,null,null,null,null,"NORMA CERIM - FECOERESP"]
["NTC-D-04 - FECOERESP",null,null,null,"TABELAS DA GED 13",null,null,null,"TABELAS DA NTC-D-04",null,null,null,null,null,null,null,null,null,null,null,null,null,null,null,null,null,null,null,null,null,null,"CATEGORIAS",null,"POSTES"]
["GED Nº 13 - CPFL",null,null,null,"1A/1C/1D/1E",null,"1B",null,"A1 a C6 (127/220)",null,"C7 a C11 (220/380)",null,null,null,null,null,null,null,null,null,null,null,null,null,null,null,null,"ENCABEÇAMENTO",null,null,null,null,null,"POSTE PADRÃO",null,null,null,"CONCRETO",null,"METÁLICO"]
[null,null,null,null,"CATEGORIA","Vinc.","CATEGORIA","Vinc.","CATEGORIA","VINC.","CATEGORIA","VINC.",null,null,null,null,null,null,null,null,null,null,null,null,null,null,null,null,0,null,null,null,null,"FACE A",null,"FACE B",null,"FACE A",null,"FACE A"]
[null,null,null,null,{"$f":"\"\"","v":""},null,{"$f":"\"\"","v":""},null,{"$f":"\"\"","v":""},null,{"$f":"\"\"","v":""},null,null,null,null,null,null,null,null,null,null,null,null,null,null,null,null,"POSTE DUPLO T",1,null,null,"A1",1,"PCI 7,5 MT X 90 daN (Face A) -",null,"CAIXA INCORPORADA (POSTE PADRÃO)",null,"Concreto DUPLO T - 7,5x90 daN -",null,"Metálico - 7,5x90 daN - "]
["ANCORAGEM DO RAMAL",null,null,null,{"$f":"IF(AND(CALC.D!AB15=0,CALC.D!AB20=2,CALC.D!E64<>\"\",CALC.D!C6<>\"\",CALC.D!G6<>\"\"),CALC.D!E59,\"\")","v":""},"Dimens.",{"$f":"IF(AND(CALC.D!AB15=1,CALC.D!AB20=2,CALC.D!E64<>\"\",CALC.D!C6<>\"\",CALC.D!G6<>\"\"),CALC.D!E59,\"\")","v":""},"Dimens.",{"$f":"IF(AND(CALC.D!AB15=0,CALC.D!AB20=1,CALC.D!E64<>\"\",CALC.D!C6<>\"\",CALC.D!G6<>\"\"),CALC.D!E59,\"\")","v":""},"Dimens.",{"$f":"IF(AND(CALC.D!AB15=1,CALC.D!AB20=1,CALC.D!E64<>\"\",CALC.D!C6<>\"\",CALC.D!G6<>\"\"),CALC.D!E59,\"\")","v":""},"Dimens.",null,null,null,null,null,null,null,null,null,null,null,null,null,null,null,"(PCI) POSTE PADRÃO C/ CAIXA",2,null,null,"A2",2,"PCI 7,5 MT X 90 daN (Face A) -",null,"CAIXA INCORPORADA (POSTE PADRÃO)",null,"Concreto DUPLO T - 7,5x90 daN -",null,"Metálico - 7,5x90 daN - "]
[null,null,null,null,"A1 MONOFÁSICO",1,"A3 MONOFÁSICO",11,"A1 MONOFÁSICO",1,"C7 TRIFÁSICO",11,null,null,null,null,null,null,null,null,null,null,null,null,null,null,null,"CONCRETO ARMADO (COLUNA)",3,null,null,"B1",3,"PCI 7,5 MT X 90 daN (Face A) -",null,"CAIXA INCORPORADA (POSTE PADRÃO)",null,"Concreto DUPLO T - 7,5x90 daN -",null,"Metálico - 7,5x90 daN - "]
[null,null,1,null,"A2 MONOFÁSICO",2,"A4 MONOFÁSICO",12,"A2 MONOFÁSICO",2,"C8 TRIFÁSICO",12,null,null,null,null,null,null,null,null,null,null,null,null,null,null,null,"FACHADA DA EDIFICAÇÃO",4,null,null,"B2",4,"PCI 7,5 MT X 90 daN (Face A) -",null,"CAIXA INCORPORADA (POSTE PADRÃO)",null,"Concreto DUPLO T - 7,5x90 daN -",null,"Metálico - 7,5x90 daN - "]
["POSTE PADRÃO C/ CAIXA",null,2,null,"B1 BIFÁSICO",3,"B3 BIFÁSICO",13,"B1 BIFÁSICO",3,"C9 TRIFÁSICO",13,null,null,null,null,null,null,null,null,null,null,null,null,null,null,null,null,5,null,null,"C1",5,"PCI 7,5 MT X 200 daN (Face A) -",null,"CAIXA INCORPORADA (POSTE PADRÃO)",null,"Concreto DUPLO T - 7,5x200 daN -",null,"NÃO PERMITIDO"]
["POSTE DE CONCRETO DUPLO T",null,3,null,"B2 BIFÁSICO",4,"C7 TRIFÁSICO",14,"B2 BIFÁSICO",4,"C10 TRIFÁSICO",14,null,null,null,null,null,null,null,null,null,null,null,null,null,null,null,null,null,null,null,"C2",6,"PCI 7,5 MT X 200 daN (Face A) -",null,"CAIXA INCORPORADA (POSTE PADRÃO)",null,"Concreto DUPLO T - 7,5x200 daN -",null,"NÃO PERMITIDO"]
["POSTE METÁLICO",null,4,null,"C1 TRIFÁSICO",5,"C8 TRIFÁSICO",15,"C1 TRIFÁSICO",5,"C11 TRIFÁSICO",15,null,null,null,null,null,null,null,null,null,null,null,null,null,null,null,null,null,null,null,"C3",7,"PCI 7,5 MT X 200 daN (Face A) -",null,"CAIXA INCORPORADA (POSTE PADRÃO)",null,"Concreto DUPLO T - 7,5x200 daN -",null,"NÃO PERMITIDO"]
["POSTE DE FIBRA DE VIDRO",null,5,null,"C2 TRIFÁSICO",6,"C9 TRIFÁSICO",16,"C2 TRIFÁSICO",6,null,null,null,null,null,null,null,null,null,null,null,null,null,null,null,null,null,null,null,null,null,"C4",8,"PCI 7,5 MT X 300 daN (Face A) -",null,"CAIXA INCORPORADA (POSTE PADRÃO)",null,"Concreto DUPLO T - 7,5x300 daN -",null,"NÃO PERMITIDO"]
["PONTALETE",null,6,null,"C3 TRIFÁSICO",7,"C10 TRIFÁSICO",17,"C3 TRIFÁSICO",7,null,null,null,null,null,null,null,null,null,null,null,null,null,null,null,null,null,null,null,null,null,"C5",9,"PCI 7,5 MT X 300 daN (Face A) -",null,"CAIXA INCORPORADA (POSTE PADRÃO)",null,"Concreto DUPLO T - 7,5x300 daN -",null,"NÃO PERMITIDO"]
["COLUNA CONSTRUÍDA",null,7,null,"C4 TRIFÁSICO",8,"C11 TRIFÁSICO",18,"C4 TRIFÁSICO",8,null,null,null,null,null,null,null,null,null,null,null,null,null,null,null,null,null,null,null,null,null,"C6",10,"PCI 7,5 MT X 300 daN (Face A) -",null,"CAIXA INCORPORADA (POSTE PADRÃO)",null,"Concreto DUPLO T - 7,5x300 daN -",null,"NÃO PERMITIDO"]
["ALVENARIA/FACHADA",null,8,null,"C5 TRIFÁSICO",9,null,null,"C5 TRIFÁSICO",9,null,null,null,null,null,null,null,null,null,null,null,null,null,null,null,null,null,null,null,null,null,"C7",11,"PCI 7,5 MT X 200 daN (Face A) -",null,"CAIXA INCORPORADA (POSTE PADRÃO)",null,"Concreto DUPLO T - 7,5x200 daN - ",null,"NÃO PERMITIDO"]
[null,null,null,null,"C6 TRIFÁSICO",10,null,null,"C6 TRIFÁSICO",10,null,null,null,null,null,null,null,null,null,null,null,null,null,null,null,null,null,null,null,null,null,"C8",12,"PCI 7,5 MT X 200 daN (Face A) -",null,"CAIXA INCORPORADA (POSTE PADRÃO)",null,"Concreto DUPLO T - 7,5x200 daN - ",null,"NÃO PERMITIDO"]
[null,null,null,null,null,null,null,null,null,null,null,null,null,null,null,null,null,null,null,null,null,null,null,null,null,null,null,null,null,null,null,"C9",13,"PCI 7,5 MT X 200 daN (Face A) -",null,"CAIXA INCORPORADA (POSTE PADRÃO)",null,"Concreto DUPLO T - 7,5x200 daN - ",null,"NÃO PERMITIDO"]
[null,null,null,null,null,null,null,null,null,null,null,null,null,null,null,null,null,null,null,null,null,null,null,null,null,null,null,null,null,null,null,"C10",14,"PCI 7,5 MT X 200 daN (Face A) -",null,"CAIXA INCORPORADA (POSTE PADRÃO)",null,"Concreto DUPLO T - 7,5x200 daN - ",null,"NÃO PERMITIDO"]
[null,null,null,null,null,null,null,null,null,null,null,null,null,null,null,null,null,null,null,null,null,null,null,null,null,null,null,null,null,null,null,"C11",15,"PCI 7,5 MT X 300 daN (Face A) -",null,"CAIXA INCORPORADA (POSTE PADRÃO)",null,"Concreto DUPLO T - 7,5x300 daN - ",null,"NÃO PERMITIDO"]
[]
["TIPO DO PADRÃO DE ENTRADA"]
["NORMA CPFL PIRATININGA"]
["CATEGORIAS",null,"POSTES"]
[null,null,"POSTE PADRÃO",null,null,"POSTE DE CONCRETO",null,"POSTE DE AÇO",null,"PONTALETE",null,"POSTE DE FIBRA DE VIDRO"]
[null,null,"FACE A",null,"FACE B","DUPLO T FACE B",null,"TABELA 1C",null,"TAB.1A/B/C/D/E",null,"TABELA 1C"]
[null,null,1,null,2,3,null,4,null,5,null,6,null,9,10]
[{"$f":"E59","v":"A1 MONOFÁSICO"},1,"FACE A - Mini 90 daN ou FACE A - Multi 100 200 daN e",null,"FACE B - Mini 140 daN ou FACE B - Multi 100 300 daN","Poste DUPLO T - Esforço de 90 daN na FACE B",null,"90 daN FACE B - Circ. c/ Ø Externo x Espessura 101,6x5,0 ou Quadrado 80x80x3mm",null,"60,33X3,35 (ø Ext. x Espessura)",null,"Esforço de 90 daN na FACE B",null,null,null,{"$f":"E59","v":"A1 MONOFÁSICO"}]
[{"$f":"E60","v":"A2 MONOFÁSICO"},2,"FACE A - Mini 90 daN ou FACE A - Multi 100 200 daN e",null,"FACE B - Mini 140 daN ou FACE B - Multi 100 300 daN","Poste DUPLO T - Esforço de 90 daN na FACE B",null,"90 daN FACE B - Circ. c/ Ø Externo x Espessura 101,6x5,0 ou Quadrado 80x80x3mm",null,"60,33X3,35 (ø Ext. x Espessura)",null,"Esforço de 90 daN na FACE B",null,null,null,"A2 MONOFÁSICO"]
["A3 MONOFÁSICO",3,"FACE A - Mini 90 daN ou FACE A - Multi 100 200 daN e",null,"FACE B - Mini 140 daN ou FACE B - Multi 100 300 daN","Poste DUPLO T - Esforço de 90 daN na FACE B",null,"90 daN FACE B - Circ. c/ Ø Externo x Espessura 101,6x5,0 ou Quadrado 80x80x3mm",null,"60,33X3,35 (ø Ext. x Espessura)",null,"Esforço de 90 daN na FACE B",null,"Metálico - 90 daN","Fibra de Vidro - 90 daN","B1 BIFÁSICO"]
["A4 MONOFÁSICO",4,"FACE A - Mini 90 daN ou FACE A - Multi 100 200 daN e",null,"FACE B - Mini 140 daN ou FACE B - Multi 100 300 daN","Poste DUPLO T - Esforço de 90 daN na FACE B",null,"90 daN FACE B - Circ. c/ Ø Externo x Espessura 101,6x5,0 ou Quadrado 80x80x3mm",null,"60,33X3,35 (ø Ext. x Espessura)",null,"Esforço de 90 daN na FACE B",null,"Metálico - 90 daN","Fibra de Vidro - 90 daN","B2 BIFÁSICO"]
[{"$f":"E61","v":"B1 BIFÁSICO"},5,"FACE A - Multi 100 200 daN e",null,"FACE B - Multi 100 300 daN","Poste DUPLO T - Esforço de 90 daN na FACE B",null,"90 daN FACE B - Circ. c/ Ø Externo x Espessura 101,6x5,0 ou Quadrado 80x80x3mm",null,"60,33X3,35 (ø Ext. x Espessura)",null,"Esforço de 90 daN na FACE B",null,"Metálico - 90 daN","Fibra de Vidro - 90 daN","C1 TRIFÁSICO"]
[{"$f":"E62","v":"B2 BIFÁSICO"},6,"FACE A - Multi 100 200 daN e",null,"FACE B - Multi 100 300 daN","Poste DUPLO T - Esforço de 90 daN na FACE B",null,"90 daN FACE B - Circ. c/ Ø Externo x Espessura 101,6x5,0 ou Quadrado 80x80x3mm",null,"60,33X3,35 (ø Ext. x Espessura)",null,"Esforço de 90 daN na FACE B",null,"Metálico - 90 daN","Fibra de Vidro - 90 daN","C2 TRIFÁSICO"]
["B3 BIFÁSICO",7,"FACE A - Multi 100 200 daN e",null,"FACE B - Multi 100 300 daN","Poste DUPLO T - Esforço de 90 daN na FACE B",null,"90 daN FACE B - Circ. c/ Ø Externo x Espessura 101,6x5,0 ou Quadrado 80x80x3mm",null,"60,33X3,35 (ø Ext. x Espessura)",null,"Esforço de 90 daN na FACE B",null,"Metálico - 90 daN","Fibra de Vidro - 90 daN","C3 TRIFÁSICO"]
[{"$f":"E63","v":"C1 TRIFÁSICO"},8,"FACE A - Multi 100 200 daN e",null,"FACE B - Multi 100 300 daN","Poste DUPLO T - Esforço de 90 daN na FACE B",null,"90 daN FACE B - Circ. c/ Ø Externo x Espessura 101,6x5,0 ou Quadrado 80x80x3mm",null,"60,33X3,35 (ø Ext. x Espessura)",null,"Esforço de 90 daN na FACE B",null,"*","Fibra de Vidro - 200 daN","C4 TRIFÁSICO"]
["C2 TRIFÁSICO",9,"FACE A - Multi 100 200 daN e",null,"FACE B - Multi 100 300 daN","Poste DUPLO T - Esforço de 90 daN na FACE B",null,"90 daN FACE B - Circ. c/ Ø Externo x Espessura 101,6x5,0 ou Quadrado 80x80x3mm",null,"ANCORAGEM NÃO PERMITIDA PARA A ",null,"Esforço de 90 daN na FACE B",null,"*","Fibra de Vidro - 300 daN","C5 TRIFÁSICO"]
["C3 TRIFÁSICO",10,"FACE A - Multi 100 200 daN e",null,"FACE B - Multi 100 300 daN","Poste DUPLO T - Esforço de 90 daN na FACE B",null,"90 daN FACE B - Circ. c/ Ø Externo x Espessura 101,6x5,0 ou Quadrado 80x80x3mm",null,"ANCORAGEM NÃO PERMITIDA PARA A ",null,"Esforço de 90 daN na FACE B",null,"*","Fibra de Vidro - 300 daN","C6 TRIFÁSICO"]
["C4 TRIFÁSICO",11,"FACE A - Multi 200 300 daN e",null,"FACE B - Multi 200 600 daN","Poste DUPLO T - Esforço de 200 daN na FACE B",null,"ANCORAGEM NÃO PERMITIDA PARA A ",null,"ANCORAGEM NÃO PERMITIDA PARA A ",null,"Esforço de 200 daN na FACE B"]
["C5 TRIFÁSICO",12,"FACE A - Multi 200 300 daN e",null,"FACE B - Multi 200 600 daN","Poste DUPLO T - Esforço de 300 daN na FACE B",null,"ANCORAGEM NÃO PERMITIDA PARA A ",null,"ANCORAGEM NÃO PERMITIDA PARA A ",null,"Esforço de 300 daN na FACE B"]
["C6 TRIFÁSICO",13,"FACE A - Multi 200 300 daN e",null,"FACE B - Multi 200 600 daN","Poste DUPLO T - Esforço de 300 daN na FACE B",null,"ANCORAGEM NÃO PERMITIDA PARA A ",null,"ANCORAGEM NÃO PERMITIDA PARA A ",null,"Esforço de 300 daN na FACE B"]
["C7 TRIFÁSICO",14,"FACE A - Mini 90 daN ou FACE A - Multi 100 200 daN e",null,"FACE B - Mini 140 daN ou FACE B - Multi 100 300 daN","Poste DUPLO T - Esforço de 90 daN na FACE B",null,"90 daN FACE B - Circ. c/ Ø Externo x Espessura 101,6x5,0 ou Quadrado 80x80x3mm",null,"ANCORAGEM NÃO PERMITIDA PARA A ",null,"Esforço de 90 daN na FACE B"]
["C8 TRIFÁSICO",15,"FACE A - Mini 90 daN ou FACE A - Multi 100 200 daN e",null,"FACE B - Mini 140 daN ou FACE B - Multi 100 300 daN","Poste DUPLO T - Esforço de 90 daN na FACE B",null,"90 daN FACE B - Circ. c/ Ø Externo x Espessura 101,6x5,0 ou Quadrado 80x80x3mm",null,"ANCORAGEM NÃO PERMITIDA PARA A ",null,"Esforço de 90 daN na FACE B"]
["C9 TRIFÁSICO",16,"FACE A - Multi 100 200 daN e",null,"FACE B - Multi 100 300 daN","Poste DUPLO T - Esforço de 200 daN na FACE B",null,"90 daN FACE B - Circ. c/ Ø Externo x Espessura 101,6x5,0 ou Quadrado 80x80x3mm",null,"ANCORAGEM NÃO PERMITIDA PARA A ",null,"Esforço de 200 daN na FACE B"]
["C10 TRIFÁSICO",17,"FACE A - Multi 100 200 daN e",null,"FACE B - Multi 100 300 daN","Poste DUPLO T - Esforço de 200 daN na FACE B",null,"90 daN FACE B - Circ. c/ Ø Externo x Espessura 101,6x5,0 ou Quadrado 80x80x3mm",null,"ANCORAGEM NÃO PERMITIDA PARA A ",null,"Esforço de 200 daN na FACE B"]
["C11 TRIFÁSICO",18,"FACE A - Multi 100 200 daN e",null,"FACE B - Multi 100 300 daN","Poste DUPLO T - Esforço de 200 daN na FACE B",null,"ANCORAGEM NÃO PERMITIDA PARA A ",null,"ANCORAGEM NÃO PERMITIDA PARA A ",null,"Esforço de 200 daN na FACE B"]
[null,{"$f":"VLOOKUP(CALC.D!E59,TABELAS!A79:B96,2,FALSE)","v":{"$error":"#N/A"}}]

{"sheet":"OBSERVAÇÕES","index":4,"n_rows":50,"n_cols":1,"rows_kept":50,"cut":false,"hidden":false,"merged":[[0,0,2,12]]}
["OBSERVAÇÕES"]
[]
[]
[]
[]
["** O presente formulário de demanda, constitui com a formação de cálculos para auxiliar os consumidores "]
["da CERIM na solicitação de atendimento."]
[]
["*** Este formulário  contempla as tabelas da CPFL Piratininga norma técnica GED - 13 e NTC D 04 CERIM."]
["possui memorial de cálculo para atender até 3 consumidores para GED 13 e 2 Consumidores para"]
["NTC D 04, contemplando as classes, Residêncial, Comercial e Indústrial."]
["Atende as Tabelas de 1A a 1E da GED 13 e Tabela 09 da NTC D 04."]
[]
[]
[]
[]
[]
[]
[]
[]
[]
[]
[]
[]
[]
[]
[]
[]
[]
[]
[]
[]
[]
[]
[]
[]
[]
[]
[]
[]
[]
[]
[]
[]
[]
[]
[]
[]
[]
["by PROENGENCO - PROJETOS E INSTALÇOES ELÉTRICAS"]

{"sheet":"REVISÕES","index":5,"n_rows":61,"n_cols":1,"rows_kept":61,"cut":false,"hidden":false,"merged":[[45,0,47,11],[0,0,1,11],[16,0,16,11],[17,0,19,11],[28,0,28,11],[29,0,31,11],[25,0,27,11],[24,0,24,11],[20,0,20,11],[21,0,23,11],[9,0,11,11],[12,0,12,11],[13,0,15,11],[8,0,8,11],[59,0,59,11],[60,0,62,11],[3,0,3,11],[36,0,36,11],[40,0,40,11],[37,0,39,11],[32,0,32,11],[33,0,35,11],[41,0,43,11],[48,0,48,11],[49,0,51,11],[56,0,56,11],[57,0,58,11],[52,0,52,11],[53,0,55,11],[44,0,44,11]]}
["CONTROLE DE REVISÕES DA PLANILHA"]
[]
[]
["CONTROLE DA REVISÃO 01"]
["·         Alterado a Caixa de Medição, limitando em Atendimento C6;"]
["·         Limitado a Cat. C5 e C6 dentro dos 75 kW;"]
["·         Limitado o disjuntor para a Cat. C5 e C6 para os 75 kW."]
["·         Alterado os calculos dos motores para atender a VER. 2.8 da GED - 13."]
["CONTROLE DA REVISÃO 02"]
["·         Feito melhorias para correção de erro para a categoria de atendimento nos itens; \"Cabo mm²\" - \"Caixa\" - \"Disjuntores (A)\" - \"Eletrodutos mm (pol)\" - \"Aterramento - Condutores mm² e Eletrodutos (pol)\" - \"Postes (Tubular de Aço (mm) e Concreto (daN))\" - \"Ramal de Ligação\";"]
[]
[]
["CONTROLE DA REVISÃO 03 - 30/09/2015"]
["·         Inserido Tabela 15 com especificação da potência dos motores para auxiliar o atendimento comercial dos motores não previamente cadastrados na planilha de atendimento de solicitação de carga."]
[]
[]
["CONTROLE DA REVISÃO 04 - 28/10/2015"]
["·        Corrigido Método de cálculo de potência dos motores. Corrigido Método de Cálculo dos Ares Condicionado, divergências para o Cálculo de Demanda."]
[]
[]
["CONTROLE DA REVISÃO 05 - 28/01/2016"]
["·        Removido Bairro, CPF, Endereço, Município, deixando Nome e Processo e incluindo Consumidor no Cabeçalho da Planilha. Incluido a categoria de atendimento fixa B1 e B2 como opção na contratação dos consumidores, incluído a opção da categoria de atendimento C1. Incluído as opções, Ligação Provisória sim ( )/Não ( ), Há Edificação Sim ( )/Não ( ), alterado a Nomenclatura, Cabos de Entrada para > Cabos de Entrada/Saída."]
[]
[]
["CONTROLE DA REVISÃO 06 - 18/03/2016"]
["·        Alterado Os Disjuntores das Categorias A1, A2 e B2 para atender a Revisão da Norma GED - 13 CPFL, versão 2.11 de 19/01/2016."]
[]
[]
["CONTROLE DA REVISÃO 07 - 22/03/2016"]
["·        Alterado os métodos para o cálculo de demanda do Grupo 03, estavam convergindo com o cálculo do Grupo 02"]
[]
[]
["CONTROLE DA REVISÃO 08 - 31/03/2016"]
["·        Alterado o Layout da Planilha, para categoria solicitada, categoria dimensionada, ligação provisória e há edificação"]
[]
[]
["CONTROLE DA REVISÃO 09 - 03/06/2016"]
["·        Nos cálculos de demanda, foram realizadas correções de cálculo, atendendo a NORMA GED - 13 - CPFL"]
[]
[]
["CONTROLE DA REVISÃO 10 - 09/09/2016"]
["·        Alterado a Tabela de consulta de Potencia dos motores, de kW para KVAr - Tabela 15 de Motores Trifásicos da GED 13 - CPFL Piratininga"]
[]
[]
["CONTROLE DA REVISÃO 11 - 13/09/2016"]
["·        Alterado a Metodologia de cálculo do maior motor para eliminar erro quando adicionados novos motores na lista do Grupo 07 - Motores"]
[]
[]
["CONTROLE DA REVISÃO 12 - 30/08/2017"]
["·        Excluido a possibilidade de uso desta planilha para classe diferentes da classe Residêncial. Na versão antiga."]
[]
[]
["CONTROLE DA REVISÃO 13 - 01/04/2019"]
["·        Incluido na planilha cálculos que contemplam motores monofásicos, bifásicos e trifásicos. Para padrões até 25 kW não será disponibilizado os cálculos de Demanda. Incluído campo para documentação necessária para cada Categoria de Atendimento. Foi alterado o layout, a lista ficando suspensa, e o método de cálculo. OBS: Passando a adota o uso das Classes Comercial, Residencial e Industrial. Acrescentado Botão para Verificar Preenchimento e para Acessar Abas Observações e Revisões."]
[]
[]
["CONTROLE DA REVISÃO 14 - 06/03/2020"]
["·        Correções e ajustes"]
[]
["CONTROLE DA REVISÃO 15 - 12/01/2024"]
["·        Corrigido a exigência de ART para área construída acima de 200m² quando a solicitação for Residencial. Ficando conforme norma para ligações comerciais. Ver Item 6.23 da GED 13 CPFL"]

{"sheet":"Relatório de Compatibilidade","index":6,"n_rows":24,"n_cols":6,"rows_kept":24,"cut":false,"hidden":true,"merged":[]}
[null,"Relatório de Compatibilidade para PLANILHA PARA CALCULO DE DEMANDA (rev.14) 04-03-2020 rev Bruno.xlsm"]
[null,"Executado em 06/03/2020 21:38"]
[]
[null,"Se a pasta de trabalho for salva em um formato de arquivo anterior ou aberta em uma versão anterior do Microsoft Excel, os recursos listados não estarão disponíveis."]
[]
[null,"Perda insignificante de fidelidade",null,null,"Núm. de ocorrências","Versão"]
[]
[null,"Uma ou mais células desta pasta de trabalho têm regras de validação de dados que se referem a valores de outras planilhas. Não há suporte para essas regras em versões anteriores do Excel.",null,null,18]
[null,null,null,null,"CALC.D'!B42:E43","Excel 2007"]
[null,null,null,null,"CALC.D'!B47:E49"]
[null,null,null,null,"CALC.D'!L43:Q44"]
[null,null,null,null,"CALC.D'!L48:Q49"]
[null,null,null,null,"CALC.D'!L21:Q22"]
[null,null,null,null,"CALC.D'!L26:Q29"]
[null,null,null,null,"CALC.D'!R2"]
[null,null,null,null,"CALC.D'!B21:E30"]
[null,null,null,null,"CALC.D'!B34:E38"]
[null,null,null,null,"CALC.D'!L33:Q39"]
[null,null,null,null,"CALC.D'!C6:D6"]
[null,null,null,null,"CALC.D'!G6:O6"]
[null,null,null,null,"CALC.D'!B15:C16"]
[null,null,null,null,"CALC.D'!D16:G16"]
[null,null,null,null,"CALC.D'!E15:G15"]
[null,null,null,null,"CALC.D'!D15"]